{
    "service": "3",
    "subservice": "9",
    "type": "TC",
    "description": "This TC requests a report about the addressed housekeeping report structures. The answer for this request is TM(3,10).",
    "parameters": [
        {
            "name": "N",
            "data_type_name": "Unsigned Integer",
            "size_in_bit": "8 Bit",
            "position": "0",
            "description": "The number of housekeeping report structures to report about. It is possible to request 218 SIDs at once, but only one per TM will be reported as answer.",
            "PTC": 3,
            "PFC": 4,
            "max_value": 218
        },
        {
            "name": "HK Param Report SID",
            "data_type_name": "Enum",
            "size_in_bit": "8 Bit",
            "position": "1 + i",
            "description": "The identifier of the housekeeping report structures to report about.",
            "PTC": 2,
            "PFC": 8,
            "repetition_depends_on": "N"
        }
    ]
}