{
    "service": "3",
    "subservice": "30",
    "type": "TC",
    "description": "This TC appends a variable number of parameters to an existing diagnostic report structure. Before appending parameters, it has to be checked whether the maximum length of the application data of a TC (219 Byte) is still not exceeded.",
    "parameters": [
        {
            "name": "Diagnostic Param Report SID",
            "data_type_name": "Enum",
            "size_in_bit": "8 Bit",
            "position": "0",
            "description": "The identifier of the diagnostic parameter report structure.",
            "PTC": 2,
            "PFC": 8
        },
        {
            "name": "N",
            "data_type_name": "Unsigned Integer",
            "size_in_bit": "8 Bit",
            "position": "1",
            "description": "The number of simply commutated parameters. The maximum value is 71.",
            "PTC": 3,
            "PFC": 4
        },
        {
            "name": "Param ID",
            "data_type_name": "Enum",
            "size_in_bit": "24 Bit",
            "position": "2 + i",
            "description": "The identifier of a parameter to be sampled once.",
            "PTC": 2,
            "PFC": 24,
            "repetition_depends_on": "N"
        }
    ]
}