{
    "service": "5",
    "subservice": "6",
    "type": "TC",
    "description": "This request disables the report generation for the specified event definitions. After disabling the event definition no report will be generated on the occurrence of the corresponding event.",
    "parameters": [
        {
            "name": "N",
            "data_type_name": "Unsigned Integer",
            "size_in_bit": "8 Bit",
            "position": "0",
            "description": "The number of event definitions to enable. The maximum value is 109.",
            "PTC": 3,
            "PFC": 4,
            "max_value": 109
        },
        {
            "name": "ED ID",
            "data_type_name": "Enum",
            "size_in_bit": "16 Bit",
            "position": "1 + i",
            "description": "The identifier of a event definition to disable.",
            "PTC": 2,
            "PFC": 16,
            "repetition_depends_on": "N"
        }
    ]
}