{
    "service": "11",
    "subservice": "15",
    "type": "TC",
    "description": "This TC postpones all time-based scheduled activities for the specified time.",
    "parameters": [
        {
            "name": "Time Offset",
            "data_type_name": "Relative Time",
            "size_in_bit": "64 Bit",
            "position": "0",
            "description": "The time to postpone.",
            "PTC": 10,
            "PFC": 2
        }
    ]
}