{
  "service": "22",
  "subservice": "11",
  "type": "TC",
  "description": "This TC requests a detailed report for all addressed TCs in the position-based schedule. The answer for this request is TM(22,10).",
  "parameters": [
    {
      "name": "Type",
      "data_type_name": "Enum",
      "size_in_bit": "8 Bit",
      "position": "0",
      "description": "The type can have following values: 00 - ”all” 11 - ”between 2 position tags” 01 - ”from position tag” 10 - ”to position tag”.",
      "PTC": 2,
      "PFC": 8
    },
    {
      "name": "Tag 1: No.",
      "data_type_name": "Unsigned Integer",
      "size_in_bit": "16 Bit",
      "position": "1",
      "description": "The first position tag. This is the one from which the selection starts. It contains the orbit number and the position within this orbit.",
      "PTC": 3,
      "PFC": 12
    },
    {
      "name": "Tag 1: Pos.",
      "data_type_name": "Real",
      "size_in_bit": "64 Bit",
      "position": "2",
      "description": "The first position tag. This is the one from which the selection starts. It contains the orbit number and the position within this orbit.",
      "PTC": 5,
      "PFC": 2
    },
    {
      "name": "Tag 2: No.",
      "data_type_name": "Unsigned Integer",
      "size_in_bit": "16 Bit",
      "position": "3",
      "description": "The second position tag. This is the one at which the selection stops. It contains the orbit number and the position within this orbit",
      "PTC": 3,
      "PFC": 12
    },
    {
      "name": "Tag 2: Pos.",
      "data_type_name": "Real",
      "size_in_bit": "64 Bit",
      "position": "4",
      "description": "The second position tag. This is the one at which the selection stops. It contains the orbit number and the position within this orbit",
      "PTC": 5,
      "PFC": 2
    }
  ]
}