{
    "service": "11",
    "subservice": "17",
    "type": "TC",
    "description": "This TC requests a summary report of all time-based scheduled activities. The answer on this request is TM(11,13). If more than 18 activities are scheduled more than one report will be generated as answer.",
    "parameters": []
}