{
    "service": "3",
    "subservice": "5",
    "type": "TC",
    "description": "This TC enables the periodic generation of the housekeeping parameter reports. After being enabled the reports will be generated periodically. The defined Collection Interval will be applied.",
    "parameters": [
        {
            "name": "N",
            "data_type_name": "Unsigned Integer",
            "size_in_bit": "8 Bit",
            "position": "0",
            "description": "The number of housekeeping report structures whose periodic generation gets enabled. The maximum value is 218.",
            "PTC": 3,
            "PFC": 4,
            "max_value": 218
        },
        {
            "name": "HK Param Report SID",
            "data_type_name": "Enum",
            "size_in_bit": "8 Bit",
            "position": "1 + i",
            "description": "The identifier of the housekeeping report structures whose periodic generation gets enabled.",
            "PTC": 2,
            "PFC": 8,
            "repetition_depends_on": "N"
        }
    ]
}