{
  "service": "19",
  "subservice": "11",
  "type": "TM",
  "description": "This TM reports the status and the corresponding request for each addressed event definition. The generation of this TC is initiated by receiving TC(19,10). The maximum size of the complete request (including header and checksum) is 232 Byte.",
  "parameters": [
    {
      "name": "N",
      "data_type_name": "Unsigned Integer",
      "size_in_bit": "8 Bit",
      "position": "0",
      "description": "The number of following event definitions. The maximum value is 11.",
      "PTC": 3,
      "PFC": 4,
      "max_value": 11
    },
    {
      "name": "ED System ID: APID",
      "data_type_name": "Enum",
      "size_in_bit": "11 Bit",
      "position": "1 + i * 4",
      "description": "The system identifier of the event definition. It consists of the APID of the process that hosts the related event reporting subservice and the Event Definition ID.",
      "PTC": 2,
      "PFC": 11,
      "repetition_depends_on": "N"
    },
    {
      "name": "ED System ID: ED ID",
      "data_type_name": "Enum",
      "size_in_bit": "16 Bit",
      "position": "2 + i * 4",
      "description": "The system identifier of the event definition. It consists of the APID of the process that hosts the related event reporting subservice and the Event Definition ID.",
      "PTC": 2,
      "PFC": 13,
      "repetition_depends_on": "N"
    },
    {
      "name": "Event-Action Status",
      "data_type_name": "Enum",
      "size_in_bit": "8 Bit",
      "position": "3 + i * 4",
      "description": "The current status of the associated event definition. Possible values are: 0 - ”disabled” 1 - ”enabled”",
      "PTC": 2,
      "PFC": 8,
      "repetition_depends_on": "N"
    },
    {
      "name": "Request",
      "data_type_name": "TC packet",
      "size_in_bit": "n * 8 Bit",
      "position": "4 + i * 4",
      "description": "The TC which should be released if the event associated with the event definition occurs. The size of this field is n · 8 Bit. The maximum size of the complete request (including header and checksum) is 232 Byte.",
      "PTC": 12,
      "PFC": 1,
      "repetition_depends_on": "N"
    }
  ]
}