{
    "service": "3",
    "subservice": "1",
    "type": "TC",
    "description": "This TC creates a complete housekeeping report structure with a variable number of parameters to report about. The state of the new SID is set to disabled.",
    "parameters": [
        {
            "name": "HK Param Report SID",
            "data_type_name": "Enum",
            "size_in_bit": "8 Bit",
            "position": "0",
            "description": "The identifier of the housekeeping parameter report structure.",
            "PTC": 2,
            "PFC": 8
        },
        {
            "name": "Collection Interval",
            "data_type_name": "Unsigned Integer",
            "size_in_bit": "16 Bit",
            "position": "1",
            "description": "The time for collecting the data for the report. The maximum value is 32767 (decimal). The unit is seconds.",
            "PTC": 3,
            "PFC": 12,
            "max_value": 32767,
            "unit": "seconds"
        },
        {
            "name": "N",
            "data_type_name": "Unsigned Integer",
            "size_in_bit": "8 Bit",
            "position": "2",
            "description": "The number of simply commutated parameters. The maximum value is 71.",
            "PTC": 3,
            "PFC": 4,
            "max_value": 71
        },
        {
            "name": "Param ID",
            "data_type_name": "Enum",
            "size_in_bit": "24 Bit",
            "position": "3 + i",
            "description": "The identifier of a parameter to be sampled once.",
            "PTC": 2,
            "PFC": 24,
            "repetition_depends_on": "N"
        }
    ]
}