{
    "service": "11",
    "subservice": "13",
    "type": "TM",
    "description": "This TM reports summary data of the requested time-based scheduled activities. The generation of this TM is initiated by receiving TC(11,12), TC(11,14) or TC(11,17).",
    "parameters": [
        {
            "name": "N",
            "data_type_name": "Unsigned Integer",
            "size_in_bit": "8 Bit",
            "position": "0",
            "description": "The number of requests whose data is reported. The maximum value is 18.",
            "PTC": 3,
            "PFC": 4,
            "max_value": 18
        },
        {
            "name": "Release Time",
            "data_type_name": "Absolute Time",
            "size_in_bit": "64 Bit",
            "position": "1 + 4i",
            "description": "The moment of planned release.",
            "PTC": 9,
            "PFC": 2,
            "repetition_depends_on": "N"
        },
        {
            "name": "Request ID: Source ID",
            "data_type_name": "Enum",
            "size_in_bit": "7 Bit",
            "position": "2 + 4i",
            "description": "The identifier of a request to report about. The ID contains the Source ID, the APID and the Sequence Count of the request.",
            "PTC": 2,
            "PFC": 7,
            "repetition_depends_on": "N"
        },
        {
            "name": "Request ID: APID",
            "data_type_name": "Enum",
            "size_in_bit": "11 Bit",
            "position": "3 + 4i",
            "description": "The identifier of a request to report about. The ID contains the Source ID, the APID and the Sequence Count of the request.",
            "PTC": 2,
            "PFC": 11,
            "repetition_depends_on": "N"
        },
        {
            "name": "Request ID: Sequence Count",
            "data_type_name": "Unsigned Integer",
            "size_in_bit": "14 Bit",
            "position": "4 + 4i",
            "description": "The identifier of a request to report about. The ID contains the Source ID, the APID and the Sequence Count of the request.",
            "PTC": 3,
            "PFC": 10,
            "repetition_depends_on": "N"
        }
    ]
}