<mxfile host="app.diagrams.net" modified="2024-06-03T19:29:13.831Z" agent="Mozilla/5.0 (Windows NT 10.0; Win64; x64) AppleWebKit/537.36 (KHTML, like Gecko) Chrome/125.0.0.0 Safari/537.36" etag="gXVQQdo7M0h3qTv1ToyU" version="24.4.13" type="gitlab">
  <diagram name="Seite-1" id="omOJBpnm_ymy6uIvsLeX">
    <mxGraphModel dx="2325" dy="1132" grid="1" gridSize="10" guides="1" tooltips="1" connect="1" arrows="1" fold="1" page="1" pageScale="1" pageWidth="827" pageHeight="1169" math="0" shadow="0">
      <root>
        <mxCell id="0" />
        <mxCell id="1" parent="0" />
        <mxCell id="0IpWVgyViqhQ_YEmtk9I-8" value="" style="group" parent="1" vertex="1" connectable="0">
          <mxGeometry x="40" y="280" width="320" height="180" as="geometry" />
        </mxCell>
        <mxCell id="0IpWVgyViqhQ_YEmtk9I-5" value="&lt;font style=&quot;font-size: 16px;&quot;&gt;Level 2 Subsystem&lt;br style=&quot;font-size: 16px;&quot;&gt;&lt;/font&gt;" style="rounded=0;whiteSpace=wrap;html=1;fontSize=16;align=left;fillColor=#ffe6cc;strokeColor=#d79b00;" parent="0IpWVgyViqhQ_YEmtk9I-8" vertex="1">
          <mxGeometry width="160" height="20" as="geometry" />
        </mxCell>
        <mxCell id="0IpWVgyViqhQ_YEmtk9I-6" value="&lt;div align=&quot;left&quot;&gt;Description&lt;/div&gt;" style="rounded=0;whiteSpace=wrap;html=1;align=left;verticalAlign=top;fillColor=#ffe6cc;strokeColor=#d79b00;" parent="0IpWVgyViqhQ_YEmtk9I-8" vertex="1">
          <mxGeometry y="20" width="320" height="40" as="geometry" />
        </mxCell>
        <mxCell id="0IpWVgyViqhQ_YEmtk9I-7" value="&lt;div align=&quot;left&quot;&gt;Requirements&lt;/div&gt;" style="rounded=0;whiteSpace=wrap;html=1;align=left;verticalAlign=top;fillColor=#ffe6cc;strokeColor=#d79b00;" parent="0IpWVgyViqhQ_YEmtk9I-8" vertex="1">
          <mxGeometry y="60" width="320" height="120" as="geometry" />
        </mxCell>
        <mxCell id="0IpWVgyViqhQ_YEmtk9I-13" value="" style="group" parent="1" vertex="1" connectable="0">
          <mxGeometry x="40" y="80" width="320" height="180" as="geometry" />
        </mxCell>
        <mxCell id="0IpWVgyViqhQ_YEmtk9I-14" value="&lt;font style=&quot;font-size: 16px;&quot;&gt;Level 1 Subsystem&lt;br style=&quot;font-size: 16px;&quot;&gt;&lt;/font&gt;" style="rounded=0;whiteSpace=wrap;html=1;fontSize=16;align=left;fillColor=#e1d5e7;strokeColor=#9673a6;" parent="0IpWVgyViqhQ_YEmtk9I-13" vertex="1">
          <mxGeometry width="160" height="20" as="geometry" />
        </mxCell>
        <mxCell id="0IpWVgyViqhQ_YEmtk9I-15" value="&lt;div align=&quot;left&quot;&gt;Description&lt;/div&gt;" style="rounded=0;whiteSpace=wrap;html=1;align=left;verticalAlign=top;fillColor=#e1d5e7;strokeColor=#9673a6;" parent="0IpWVgyViqhQ_YEmtk9I-13" vertex="1">
          <mxGeometry y="20" width="320" height="40" as="geometry" />
        </mxCell>
        <mxCell id="0IpWVgyViqhQ_YEmtk9I-16" value="&lt;div align=&quot;left&quot;&gt;Requirements&lt;/div&gt;" style="rounded=0;whiteSpace=wrap;html=1;align=left;verticalAlign=top;fillColor=#e1d5e7;strokeColor=#9673a6;" parent="0IpWVgyViqhQ_YEmtk9I-13" vertex="1">
          <mxGeometry y="60" width="320" height="120" as="geometry" />
        </mxCell>
        <mxCell id="0IpWVgyViqhQ_YEmtk9I-17" value="" style="group" parent="1" vertex="1" connectable="0">
          <mxGeometry x="40" y="480" width="320" height="180" as="geometry" />
        </mxCell>
        <mxCell id="0IpWVgyViqhQ_YEmtk9I-18" value="&lt;font style=&quot;font-size: 16px;&quot;&gt;Level 3 Subsystem&lt;br style=&quot;font-size: 16px;&quot;&gt;&lt;/font&gt;" style="rounded=0;whiteSpace=wrap;html=1;fontSize=16;align=left;fillColor=#dae8fc;strokeColor=#6c8ebf;" parent="0IpWVgyViqhQ_YEmtk9I-17" vertex="1">
          <mxGeometry width="160" height="20" as="geometry" />
        </mxCell>
        <mxCell id="0IpWVgyViqhQ_YEmtk9I-19" value="&lt;div align=&quot;left&quot;&gt;Description&lt;/div&gt;" style="rounded=0;whiteSpace=wrap;html=1;align=left;verticalAlign=top;fillColor=#dae8fc;strokeColor=#6c8ebf;" parent="0IpWVgyViqhQ_YEmtk9I-17" vertex="1">
          <mxGeometry y="20" width="320" height="40" as="geometry" />
        </mxCell>
        <mxCell id="0IpWVgyViqhQ_YEmtk9I-20" value="&lt;div align=&quot;left&quot;&gt;Requirements&lt;/div&gt;" style="rounded=0;whiteSpace=wrap;html=1;align=left;verticalAlign=top;fillColor=#dae8fc;strokeColor=#6c8ebf;" parent="0IpWVgyViqhQ_YEmtk9I-17" vertex="1">
          <mxGeometry y="60" width="320" height="120" as="geometry" />
        </mxCell>
        <mxCell id="0IpWVgyViqhQ_YEmtk9I-21" value="Templates" style="rounded=0;whiteSpace=wrap;html=1;fontSize=20;" parent="1" vertex="1">
          <mxGeometry x="40" width="320" height="40" as="geometry" />
        </mxCell>
        <mxCell id="CT-23ezE2R-wKhLyO320-1" value="Tree" style="rounded=0;whiteSpace=wrap;html=1;fontSize=20;" parent="1" vertex="1">
          <mxGeometry x="520" width="320" height="40" as="geometry" />
        </mxCell>
        <mxCell id="CT-23ezE2R-wKhLyO320-3" value="Level 1" style="rounded=0;whiteSpace=wrap;html=1;fontSize=20;" parent="1" vertex="1">
          <mxGeometry x="520" y="80" width="240" height="20" as="geometry" />
        </mxCell>
        <mxCell id="CT-23ezE2R-wKhLyO320-4" value="Level 2" style="rounded=0;whiteSpace=wrap;html=1;fontSize=20;" parent="1" vertex="1">
          <mxGeometry x="520" y="480" width="240" height="20" as="geometry" />
        </mxCell>
        <mxCell id="CT-23ezE2R-wKhLyO320-5" value="Level 3" style="rounded=0;whiteSpace=wrap;html=1;fontSize=20;" parent="1" vertex="1">
          <mxGeometry x="503" y="870" width="240" height="20" as="geometry" />
        </mxCell>
        <mxCell id="CT-23ezE2R-wKhLyO320-6" value="" style="endArrow=none;dashed=1;html=1;rounded=0;exitX=1;exitY=0;exitDx=0;exitDy=0;entryX=0;entryY=0;entryDx=0;entryDy=0;" parent="1" source="CT-23ezE2R-wKhLyO320-4" target="CT-23ezE2R-wKhLyO320-13" edge="1">
          <mxGeometry width="50" height="50" relative="1" as="geometry">
            <mxPoint x="940" y="480" as="sourcePoint" />
            <mxPoint x="1760" y="480" as="targetPoint" />
          </mxGeometry>
        </mxCell>
        <mxCell id="CT-23ezE2R-wKhLyO320-7" value="" style="endArrow=none;dashed=1;html=1;rounded=0;exitX=1;exitY=0;exitDx=0;exitDy=0;entryX=0;entryY=0;entryDx=0;entryDy=0;" parent="1" source="CT-23ezE2R-wKhLyO320-3" target="CT-23ezE2R-wKhLyO320-12" edge="1">
          <mxGeometry width="50" height="50" relative="1" as="geometry">
            <mxPoint x="770" y="290" as="sourcePoint" />
            <mxPoint x="1720" y="60" as="targetPoint" />
          </mxGeometry>
        </mxCell>
        <mxCell id="CT-23ezE2R-wKhLyO320-8" value="" style="endArrow=none;dashed=1;html=1;rounded=0;exitX=1;exitY=0;exitDx=0;exitDy=0;entryX=0;entryY=0;entryDx=0;entryDy=0;" parent="1" source="CT-23ezE2R-wKhLyO320-5" target="CT-23ezE2R-wKhLyO320-14" edge="1">
          <mxGeometry width="50" height="50" relative="1" as="geometry">
            <mxPoint x="780" y="700" as="sourcePoint" />
            <mxPoint x="1760" y="880" as="targetPoint" />
          </mxGeometry>
        </mxCell>
        <mxCell id="CT-23ezE2R-wKhLyO320-12" value="Level 1" style="rounded=0;whiteSpace=wrap;html=1;fontSize=20;" parent="1" vertex="1">
          <mxGeometry x="2800" y="100" width="240" height="20" as="geometry" />
        </mxCell>
        <mxCell id="CT-23ezE2R-wKhLyO320-13" value="Level 2" style="rounded=0;whiteSpace=wrap;html=1;fontSize=20;" parent="1" vertex="1">
          <mxGeometry x="2800" y="480" width="240" height="20" as="geometry" />
        </mxCell>
        <mxCell id="CT-23ezE2R-wKhLyO320-14" value="Level 3" style="rounded=0;whiteSpace=wrap;html=1;fontSize=20;" parent="1" vertex="1">
          <mxGeometry x="2800" y="880" width="240" height="20" as="geometry" />
        </mxCell>
        <mxCell id="CT-23ezE2R-wKhLyO320-15" value="" style="group" parent="1" vertex="1" connectable="0">
          <mxGeometry x="880" y="120" width="320" height="320" as="geometry" />
        </mxCell>
        <mxCell id="CT-23ezE2R-wKhLyO320-16" value="DORY&lt;font style=&quot;font-size: 16px;&quot;&gt;&lt;br style=&quot;font-size: 16px;&quot;&gt;&lt;/font&gt;" style="rounded=0;whiteSpace=wrap;html=1;fontSize=16;align=left;fillColor=#e1d5e7;strokeColor=#9673a6;" parent="CT-23ezE2R-wKhLyO320-15" vertex="1">
          <mxGeometry width="160" height="24.615384615384613" as="geometry" />
        </mxCell>
        <mxCell id="CT-23ezE2R-wKhLyO320-17" value="&lt;div align=&quot;left&quot;&gt;Deployable Orbital Radio assemblY&lt;/div&gt;" style="rounded=0;whiteSpace=wrap;html=1;align=left;verticalAlign=top;fillColor=#e1d5e7;strokeColor=#9673a6;" parent="CT-23ezE2R-wKhLyO320-15" vertex="1">
          <mxGeometry y="24.615384615384613" width="320" height="49.230769230769226" as="geometry" />
        </mxCell>
        <mxCell id="CT-23ezE2R-wKhLyO320-18" value="&lt;div align=&quot;left&quot;&gt;&lt;b&gt;- no materials degrading in space environment in such&lt;/b&gt;&lt;/div&gt;&lt;div align=&quot;left&quot;&gt;&lt;b&gt;a manner that jeopardises the misson shall be used (... standard)&lt;/b&gt;&lt;/div&gt;&lt;div align=&quot;left&quot;&gt;&lt;b&gt;- the antennas function shall not be inhibited by the change in thermal conditions present in the planned orbit trajectory&lt;/b&gt;&lt;/div&gt;&lt;div align=&quot;left&quot;&gt;&lt;b&gt;- the antenna shall be able to withstand load conditions (acoustic, shock, quasi-static and vibration)&amp;nbsp; present during launch&lt;/b&gt;&lt;/div&gt;&lt;div align=&quot;left&quot;&gt;&lt;b&gt;- the mechanical frequency response of the antenna shall be within the range permitted by commonly available CubeSat AOCS Modules&lt;/b&gt;&lt;/div&gt;&lt;div align=&quot;left&quot;&gt;&lt;b&gt;- the antenna shall provide a safe mode against potential failure resulting from its design&lt;/b&gt;&lt;/div&gt;&lt;div align=&quot;left&quot;&gt;- DORY shall not exceed a total mass of&amp;nbsp;&lt;span style=&quot;background-color: initial;&quot;&gt;1 [kg]&lt;/span&gt;&lt;/div&gt;&lt;div align=&quot;left&quot;&gt;&lt;span style=&quot;background-color: initial;&quot;&gt;- DORY shall not exceed a volume of 0.5 [U]&lt;/span&gt;&lt;/div&gt;&lt;div align=&quot;left&quot;&gt;&lt;span style=&quot;background-color: initial;&quot;&gt;&lt;br&gt;&lt;/span&gt;&lt;/div&gt;" style="rounded=0;whiteSpace=wrap;html=1;align=left;verticalAlign=top;fillColor=#e1d5e7;strokeColor=#9673a6;" parent="CT-23ezE2R-wKhLyO320-15" vertex="1">
          <mxGeometry y="73.84615384615384" width="320" height="246.15384615384613" as="geometry" />
        </mxCell>
        <mxCell id="CT-23ezE2R-wKhLyO320-19" value="" style="group" parent="1" vertex="1" connectable="0">
          <mxGeometry x="863" y="510" width="320" height="340" as="geometry" />
        </mxCell>
        <mxCell id="CT-23ezE2R-wKhLyO320-20" value="Deployment mechanism" style="rounded=0;whiteSpace=wrap;html=1;fontSize=16;align=left;fillColor=#ffe6cc;strokeColor=#d79b00;" parent="CT-23ezE2R-wKhLyO320-19" vertex="1">
          <mxGeometry width="210" height="30.909090909090917" as="geometry" />
        </mxCell>
        <mxCell id="CT-23ezE2R-wKhLyO320-21" value="&lt;div align=&quot;left&quot;&gt;Deployment mechanism of the antenna from the satellite and the antenna itself (if split up into two different systems)&lt;/div&gt;" style="rounded=0;whiteSpace=wrap;html=1;align=left;verticalAlign=top;fillColor=#ffe6cc;strokeColor=#d79b00;" parent="CT-23ezE2R-wKhLyO320-19" vertex="1">
          <mxGeometry y="30.909090909090917" width="320" height="77.2727272727273" as="geometry" />
        </mxCell>
        <mxCell id="CT-23ezE2R-wKhLyO320-22" value="&lt;div align=&quot;left&quot;&gt;- The mechanism shall have a safety factor of minimum Y in all calculated load cases&lt;br&gt;&lt;/div&gt;&lt;div align=&quot;left&quot;&gt;- the transient load created during deployment of the antenna shall not jeopradise the current attitude/stability of the satellite&lt;/div&gt;&lt;div align=&quot;left&quot;&gt;&lt;b&gt;- the transient load created during deployment of the antenna shall not cause mission endangering plastic deformation&lt;/b&gt;&lt;/div&gt;&lt;b&gt;- the whole deployment mechanism shall have a probability of failure no greater than X (combined probability of all deployment steps)&lt;/b&gt;&lt;br&gt;&lt;b&gt;- the deployment mechanism shall be tested under industry standards (ECSS-E-ST-10-03)&lt;br&gt;- the deployment mechanism shall deploy the antenna into the right position and direction with a tolerance of X°&lt;/b&gt;" style="rounded=0;whiteSpace=wrap;html=1;align=left;verticalAlign=top;fillColor=#ffe6cc;strokeColor=#d79b00;" parent="CT-23ezE2R-wKhLyO320-19" vertex="1">
          <mxGeometry y="88.15" width="320" height="231.85" as="geometry" />
        </mxCell>
        <mxCell id="CT-23ezE2R-wKhLyO320-23" value="" style="group" parent="1" vertex="1" connectable="0">
          <mxGeometry x="1270" y="500" width="320" height="360" as="geometry" />
        </mxCell>
        <mxCell id="CT-23ezE2R-wKhLyO320-24" value="&lt;font style=&quot;font-size: 16px;&quot;&gt;(Antenna) Structure&lt;br style=&quot;font-size: 16px;&quot;&gt;&lt;/font&gt;" style="rounded=0;whiteSpace=wrap;html=1;fontSize=16;align=left;fillColor=#ffe6cc;strokeColor=#d79b00;" parent="CT-23ezE2R-wKhLyO320-23" vertex="1">
          <mxGeometry width="270" height="27.692307692307686" as="geometry" />
        </mxCell>
        <mxCell id="CT-23ezE2R-wKhLyO320-25" value="&lt;div align=&quot;left&quot;&gt;Description&lt;/div&gt;&lt;div align=&quot;left&quot;&gt;Applicable ECSS:&amp;nbsp;&lt;strong style=&quot;background-color: initial; border-color: var(--border-color);&quot;&gt;ECSS-E-ST-10-03,&amp;nbsp;&lt;/strong&gt;&lt;strong style=&quot;background-color: initial; border-color: var(--border-color);&quot;&gt;ECSS-E-ST-10-06 (thermal control) and&amp;nbsp;&lt;/strong&gt;&lt;strong style=&quot;background-color: initial; border-color: var(--border-color);&quot;&gt;ECSS-E-ST-10-08&lt;/strong&gt;&lt;/div&gt;&lt;div style=&quot;border-color: var(--border-color);&quot; align=&quot;left&quot;&gt;&lt;br style=&quot;border-color: var(--border-color);&quot;&gt;&lt;/div&gt;" style="rounded=0;whiteSpace=wrap;html=1;align=left;verticalAlign=top;fillColor=#ffe6cc;strokeColor=#d79b00;" parent="CT-23ezE2R-wKhLyO320-23" vertex="1">
          <mxGeometry y="27.692307692307686" width="320" height="55.38461538461537" as="geometry" />
        </mxCell>
        <mxCell id="CT-23ezE2R-wKhLyO320-26" value="&lt;div align=&quot;left&quot;&gt;- The structure shall have a safety factor of minimum X in all calculated load cases&lt;/div&gt;&lt;div align=&quot;left&quot;&gt;&lt;b&gt;-The antenna structure shall fulfill a minimum fatigue safety factor of 1.83 throughout the satellite&#39;s lifespan&lt;/b&gt;&lt;/div&gt;&lt;div align=&quot;left&quot;&gt;&lt;b&gt;-The structure should not adversely affect the electrical properties of the antenna&lt;/b&gt;&lt;/div&gt;&lt;div align=&quot;left&quot;&gt;&lt;br&gt;&lt;/div&gt;" style="rounded=0;whiteSpace=wrap;html=1;align=left;verticalAlign=top;fillColor=#ffe6cc;strokeColor=#d79b00;" parent="CT-23ezE2R-wKhLyO320-23" vertex="1">
          <mxGeometry y="83.07923076923075" width="320" height="249.23076923076923" as="geometry" />
        </mxCell>
        <mxCell id="CT-23ezE2R-wKhLyO320-27" value="" style="endArrow=classic;html=1;rounded=0;exitX=0.25;exitY=1;exitDx=0;exitDy=0;entryX=0.5;entryY=0;entryDx=0;entryDy=0;edgeStyle=orthogonalEdgeStyle;" parent="1" source="CT-23ezE2R-wKhLyO320-18" target="CT-23ezE2R-wKhLyO320-20" edge="1">
          <mxGeometry width="50" height="50" relative="1" as="geometry">
            <mxPoint x="1170" y="500" as="sourcePoint" />
            <mxPoint x="1220" y="450" as="targetPoint" />
          </mxGeometry>
        </mxCell>
        <mxCell id="CT-23ezE2R-wKhLyO320-28" value="" style="endArrow=classic;html=1;rounded=0;exitX=0.75;exitY=1;exitDx=0;exitDy=0;entryX=0.5;entryY=0;entryDx=0;entryDy=0;edgeStyle=orthogonalEdgeStyle;" parent="1" source="CT-23ezE2R-wKhLyO320-18" target="CT-23ezE2R-wKhLyO320-24" edge="1">
          <mxGeometry width="50" height="50" relative="1" as="geometry">
            <mxPoint x="1150" y="370" as="sourcePoint" />
            <mxPoint x="1200" y="320" as="targetPoint" />
          </mxGeometry>
        </mxCell>
        <mxCell id="CT-23ezE2R-wKhLyO320-29" value="" style="group" parent="1" vertex="1" connectable="0">
          <mxGeometry x="1280" y="920" width="320" height="180" as="geometry" />
        </mxCell>
        <mxCell id="CT-23ezE2R-wKhLyO320-30" value="&lt;font style=&quot;font-size: 16px;&quot;&gt;Payload Structure&lt;br style=&quot;font-size: 16px;&quot;&gt;&lt;/font&gt;" style="rounded=0;whiteSpace=wrap;html=1;fontSize=16;align=left;fillColor=#dae8fc;strokeColor=#6c8ebf;" parent="CT-23ezE2R-wKhLyO320-29" vertex="1">
          <mxGeometry width="160" height="20" as="geometry" />
        </mxCell>
        <mxCell id="CT-23ezE2R-wKhLyO320-31" value="&lt;div align=&quot;left&quot;&gt;Description&lt;/div&gt;" style="rounded=0;whiteSpace=wrap;html=1;align=left;verticalAlign=top;fillColor=#dae8fc;strokeColor=#6c8ebf;" parent="CT-23ezE2R-wKhLyO320-29" vertex="1">
          <mxGeometry y="20" width="320" height="40" as="geometry" />
        </mxCell>
        <mxCell id="CT-23ezE2R-wKhLyO320-32" value="&lt;div align=&quot;left&quot;&gt;Requirements&lt;/div&gt;" style="rounded=0;whiteSpace=wrap;html=1;align=left;verticalAlign=top;fillColor=#dae8fc;strokeColor=#6c8ebf;" parent="CT-23ezE2R-wKhLyO320-29" vertex="1">
          <mxGeometry y="60" width="320" height="120" as="geometry" />
        </mxCell>
        <mxCell id="CT-23ezE2R-wKhLyO320-33" value="" style="group" parent="1" vertex="1" connectable="0">
          <mxGeometry x="1680" y="920" width="320" height="180" as="geometry" />
        </mxCell>
        <mxCell id="CT-23ezE2R-wKhLyO320-34" value="&lt;div&gt;&lt;font style=&quot;font-size: 16px;&quot;&gt;Interface Structure&lt;/font&gt;&lt;/div&gt;" style="rounded=0;whiteSpace=wrap;html=1;fontSize=16;align=left;fillColor=#dae8fc;strokeColor=#6c8ebf;" parent="CT-23ezE2R-wKhLyO320-33" vertex="1">
          <mxGeometry width="160" height="20" as="geometry" />
        </mxCell>
        <mxCell id="CT-23ezE2R-wKhLyO320-35" value="&lt;div align=&quot;left&quot;&gt;Description&lt;/div&gt;" style="rounded=0;whiteSpace=wrap;html=1;align=left;verticalAlign=top;fillColor=#dae8fc;strokeColor=#6c8ebf;" parent="CT-23ezE2R-wKhLyO320-33" vertex="1">
          <mxGeometry y="20" width="320" height="40" as="geometry" />
        </mxCell>
        <mxCell id="CT-23ezE2R-wKhLyO320-36" value="&lt;div align=&quot;left&quot;&gt;- the attachment structure shall be compatible with the current CubeSat design standard&lt;/div&gt;" style="rounded=0;whiteSpace=wrap;html=1;align=left;verticalAlign=top;fillColor=#dae8fc;strokeColor=#6c8ebf;" parent="CT-23ezE2R-wKhLyO320-33" vertex="1">
          <mxGeometry y="60" width="320" height="120" as="geometry" />
        </mxCell>
        <mxCell id="XAHkRUkRZPS79V0xadRh-1" value="" style="group" parent="1" vertex="1" connectable="0">
          <mxGeometry x="863" y="910" width="320" height="220" as="geometry" />
        </mxCell>
        <mxCell id="XAHkRUkRZPS79V0xadRh-2" value="&lt;font style=&quot;font-size: 16px;&quot;&gt;Release Mechanism&lt;br style=&quot;font-size: 16px;&quot;&gt;&lt;/font&gt;" style="rounded=0;whiteSpace=wrap;html=1;fontSize=16;align=left;fillColor=#dae8fc;strokeColor=#6c8ebf;" parent="XAHkRUkRZPS79V0xadRh-1" vertex="1">
          <mxGeometry width="280" height="22" as="geometry" />
        </mxCell>
        <mxCell id="XAHkRUkRZPS79V0xadRh-3" value="&lt;div align=&quot;left&quot;&gt;Associated hardware and software to activate/start the deployment process/actuator of the antenna.&lt;br&gt;&lt;/div&gt;" style="rounded=0;whiteSpace=wrap;html=1;align=left;verticalAlign=top;fillColor=#dae8fc;strokeColor=#6c8ebf;" parent="XAHkRUkRZPS79V0xadRh-1" vertex="1">
          <mxGeometry y="22" width="320" height="55.00000000000001" as="geometry" />
        </mxCell>
        <mxCell id="XAHkRUkRZPS79V0xadRh-4" value="&lt;div align=&quot;left&quot;&gt;- the release mechanism shall have a twofold redundancy against undesired activation (triple voting)&lt;/div&gt;&lt;div align=&quot;left&quot;&gt;&lt;b&gt;- the release mechanism shall be integrated into the main software and hardware parts of the satellite (no additional boards shall be used) further discussion needed!&lt;/b&gt;&lt;/div&gt;&lt;div align=&quot;left&quot;&gt;&lt;b&gt;- Cabling shall withstand thermal and load conditions during launch and in orbit&lt;/b&gt;&lt;/div&gt;&lt;div align=&quot;left&quot;&gt;&lt;b&gt;- failure probability of the release mechanism shall be below X%&lt;/b&gt;&lt;br&gt;&lt;/div&gt;&lt;div align=&quot;left&quot;&gt;&lt;br&gt;&lt;/div&gt;" style="rounded=0;whiteSpace=wrap;html=1;align=left;verticalAlign=top;fillColor=#dae8fc;strokeColor=#6c8ebf;" parent="XAHkRUkRZPS79V0xadRh-1" vertex="1">
          <mxGeometry y="77" width="320" height="143" as="geometry" />
        </mxCell>
        <mxCell id="XAHkRUkRZPS79V0xadRh-21" style="edgeStyle=orthogonalEdgeStyle;rounded=0;orthogonalLoop=1;jettySize=auto;html=1;exitX=0.5;exitY=1;exitDx=0;exitDy=0;" parent="XAHkRUkRZPS79V0xadRh-1" source="XAHkRUkRZPS79V0xadRh-3" target="XAHkRUkRZPS79V0xadRh-3" edge="1">
          <mxGeometry relative="1" as="geometry" />
        </mxCell>
        <mxCell id="XAHkRUkRZPS79V0xadRh-5" value="" style="group" parent="1" vertex="1" connectable="0">
          <mxGeometry x="490" y="910" width="320" height="250" as="geometry" />
        </mxCell>
        <mxCell id="XAHkRUkRZPS79V0xadRh-6" value="&lt;font style=&quot;font-size: 16px;&quot;&gt;Deployment Actuator&lt;br style=&quot;font-size: 16px;&quot;&gt;&lt;/font&gt;" style="rounded=0;whiteSpace=wrap;html=1;fontSize=16;align=left;fillColor=#dae8fc;strokeColor=#6c8ebf;" parent="XAHkRUkRZPS79V0xadRh-5" vertex="1">
          <mxGeometry width="240" height="26.62037037037037" as="geometry" />
        </mxCell>
        <mxCell id="XAHkRUkRZPS79V0xadRh-7" value="&lt;div align=&quot;left&quot;&gt;Device which performs the deployment process (e.g. motor, tensioned springs, etc.)&lt;/div&gt;" style="rounded=0;whiteSpace=wrap;html=1;align=left;verticalAlign=top;fillColor=#dae8fc;strokeColor=#6c8ebf;" parent="XAHkRUkRZPS79V0xadRh-5" vertex="1">
          <mxGeometry y="26.62037037037037" width="320" height="53.24074074074074" as="geometry" />
        </mxCell>
        <mxCell id="XAHkRUkRZPS79V0xadRh-8" value="&lt;div align=&quot;left&quot;&gt;- the power requirement of the deployment actuator shall be within the capability of common CubeSat power supplies&lt;/div&gt;&lt;div align=&quot;left&quot;&gt;- the deployment actuator shall have a twofold redundancy against undesired activation?? depends on actuator type&lt;br&gt;&lt;/div&gt;&lt;div align=&quot;left&quot;&gt;- the deployment actuator shall have a twofold redundancy against undesired&amp;nbsp;staunching??&amp;nbsp;&lt;/div&gt;depends on actuator type&lt;div align=&quot;left&quot;&gt;&lt;b&gt;- the deployment actuator shall be able to deploy the antenna to its full lenght until the retention mechanism comes into play&lt;/b&gt;&lt;/div&gt;&lt;div align=&quot;left&quot;&gt;&lt;b&gt;- failure probability of the whole deployment actuator shall be below X%&lt;/b&gt;&lt;/div&gt;&lt;div align=&quot;left&quot;&gt;&lt;br&gt;&lt;/div&gt;" style="rounded=0;whiteSpace=wrap;html=1;align=left;verticalAlign=top;fillColor=#dae8fc;strokeColor=#6c8ebf;" parent="XAHkRUkRZPS79V0xadRh-5" vertex="1">
          <mxGeometry y="72.91666666666667" width="320" height="177.08333333333334" as="geometry" />
        </mxCell>
        <mxCell id="XAHkRUkRZPS79V0xadRh-9" value="" style="endArrow=classic;html=1;rounded=0;exitX=0.5;exitY=1;exitDx=0;exitDy=0;" parent="1" source="CT-23ezE2R-wKhLyO320-22" edge="1">
          <mxGeometry width="50" height="50" relative="1" as="geometry">
            <mxPoint x="983" y="740" as="sourcePoint" />
            <mxPoint x="983" y="910" as="targetPoint" />
          </mxGeometry>
        </mxCell>
        <mxCell id="XAHkRUkRZPS79V0xadRh-10" value="" style="endArrow=classic;html=1;rounded=0;exitX=0.25;exitY=1;exitDx=0;exitDy=0;entryX=0.851;entryY=-0.08;entryDx=0;entryDy=0;entryPerimeter=0;" parent="1" source="CT-23ezE2R-wKhLyO320-22" target="XAHkRUkRZPS79V0xadRh-7" edge="1">
          <mxGeometry width="50" height="50" relative="1" as="geometry">
            <mxPoint x="853" y="830" as="sourcePoint" />
            <mxPoint x="903" y="780" as="targetPoint" />
          </mxGeometry>
        </mxCell>
        <mxCell id="XAHkRUkRZPS79V0xadRh-11" value="" style="group" parent="1" vertex="1" connectable="0">
          <mxGeometry x="110" y="930" width="320" height="180" as="geometry" />
        </mxCell>
        <mxCell id="XAHkRUkRZPS79V0xadRh-12" value="&lt;font style=&quot;font-size: 16px;&quot;&gt;&lt;b&gt;Retention Mechanism&lt;/b&gt;&lt;br style=&quot;font-size: 16px;&quot;&gt;&lt;/font&gt;" style="rounded=0;whiteSpace=wrap;html=1;fontSize=16;align=left;fillColor=#dae8fc;strokeColor=#6c8ebf;" parent="XAHkRUkRZPS79V0xadRh-11" vertex="1">
          <mxGeometry width="260" height="20" as="geometry" />
        </mxCell>
        <mxCell id="XAHkRUkRZPS79V0xadRh-13" value="&lt;div align=&quot;left&quot;&gt;Mechanism which locks the fully deployed antenna into place and prevents unwanted refolding.&amp;nbsp;&lt;/div&gt;" style="rounded=0;whiteSpace=wrap;html=1;align=left;verticalAlign=top;fillColor=#dae8fc;strokeColor=#6c8ebf;" parent="XAHkRUkRZPS79V0xadRh-11" vertex="1">
          <mxGeometry y="20" width="320" height="40" as="geometry" />
        </mxCell>
        <mxCell id="XAHkRUkRZPS79V0xadRh-14" value="&lt;div align=&quot;left&quot;&gt;&lt;b&gt;&lt;span style=&quot;background-color: initial;&quot;&gt;- the retention mechanism shall have a twofold redundancy&lt;/span&gt;&lt;br&gt;&lt;/b&gt;&lt;/div&gt;&lt;div align=&quot;left&quot;&gt;&lt;b&gt;- the retention mechanism shall prohibit anew refolding of the antenna in orbital conditions&lt;/b&gt;&lt;/div&gt;&lt;div align=&quot;left&quot;&gt;&lt;b&gt;- failure probability of the whole retention mechanism shall be below X%&lt;/b&gt;&lt;br&gt;&lt;/div&gt;" style="rounded=0;whiteSpace=wrap;html=1;align=left;verticalAlign=top;fillColor=#dae8fc;strokeColor=#6c8ebf;" parent="XAHkRUkRZPS79V0xadRh-11" vertex="1">
          <mxGeometry y="60" width="320" height="120" as="geometry" />
        </mxCell>
        <mxCell id="XAHkRUkRZPS79V0xadRh-16" value="" style="endArrow=classic;html=1;rounded=0;exitX=0.081;exitY=0.994;exitDx=0;exitDy=0;exitPerimeter=0;entryX=0.75;entryY=0;entryDx=0;entryDy=0;" parent="1" source="CT-23ezE2R-wKhLyO320-22" target="XAHkRUkRZPS79V0xadRh-12" edge="1">
          <mxGeometry width="50" height="50" relative="1" as="geometry">
            <mxPoint x="1040" y="660" as="sourcePoint" />
            <mxPoint x="1090" y="610" as="targetPoint" />
          </mxGeometry>
        </mxCell>
        <mxCell id="XAHkRUkRZPS79V0xadRh-17" value="" style="group" parent="1" vertex="1" connectable="0">
          <mxGeometry x="2300" y="520" width="320" height="180" as="geometry" />
        </mxCell>
        <mxCell id="XAHkRUkRZPS79V0xadRh-18" value="&lt;font style=&quot;font-size: 16px;&quot;&gt;Health Monitoring (optional)&lt;br style=&quot;font-size: 16px;&quot;&gt;&lt;/font&gt;" style="rounded=0;whiteSpace=wrap;html=1;fontSize=16;align=left;fillColor=#ffe6cc;strokeColor=#d79b00;" parent="XAHkRUkRZPS79V0xadRh-17" vertex="1">
          <mxGeometry width="270" height="20" as="geometry" />
        </mxCell>
        <mxCell id="XAHkRUkRZPS79V0xadRh-19" value="&lt;div align=&quot;left&quot;&gt;Description&lt;/div&gt;" style="rounded=0;whiteSpace=wrap;html=1;align=left;verticalAlign=top;fillColor=#ffe6cc;strokeColor=#d79b00;" parent="XAHkRUkRZPS79V0xadRh-17" vertex="1">
          <mxGeometry y="20" width="320" height="40" as="geometry" />
        </mxCell>
        <mxCell id="XAHkRUkRZPS79V0xadRh-20" value="&lt;div align=&quot;left&quot;&gt;Requirements&lt;/div&gt;" style="rounded=0;whiteSpace=wrap;html=1;align=left;verticalAlign=top;fillColor=#ffe6cc;strokeColor=#d79b00;" parent="XAHkRUkRZPS79V0xadRh-17" vertex="1">
          <mxGeometry y="60" width="320" height="120" as="geometry" />
        </mxCell>
        <mxCell id="7ewyC9bVu6RiVR7lFite-1" value="Comment: Rename &quot;Payload&quot; to something more antenna-specific" style="rounded=0;whiteSpace=wrap;html=1;" parent="1" vertex="1">
          <mxGeometry x="1380" y="1130" width="120" height="60" as="geometry" />
        </mxCell>
        <mxCell id="OhmZFtk0ldM8Ea-4642u-1" value="Monitor and regulate temperature?" style="text;html=1;align=center;verticalAlign=middle;resizable=0;points=[];autosize=1;strokeColor=none;fillColor=none;" parent="1" vertex="1">
          <mxGeometry x="503" y="190" width="210" height="30" as="geometry" />
        </mxCell>
        <mxCell id="OhmZFtk0ldM8Ea-4642u-2" value="Survive autonomously? read state of all devices, execute predefined actions in case of anomaly" style="text;html=1;align=center;verticalAlign=middle;resizable=0;points=[];autosize=1;strokeColor=none;fillColor=none;" parent="1" vertex="1">
          <mxGeometry x="355" y="230" width="530" height="30" as="geometry" />
        </mxCell>
        <mxCell id="a7ualYErZMk_1NxntoGe-14" value="Safe mode for the antenna?" style="text;html=1;align=center;verticalAlign=middle;resizable=0;points=[];autosize=1;strokeColor=none;fillColor=none;" parent="1" vertex="1">
          <mxGeometry x="523" y="260" width="170" height="30" as="geometry" />
        </mxCell>
        <mxCell id="2bYKCemNrX2bpPvKpex--3" style="edgeStyle=orthogonalEdgeStyle;rounded=0;orthogonalLoop=1;jettySize=auto;html=1;exitX=1;exitY=1;exitDx=0;exitDy=0;entryX=0.375;entryY=0;entryDx=0;entryDy=0;entryPerimeter=0;" parent="1" source="CT-23ezE2R-wKhLyO320-26" target="CT-23ezE2R-wKhLyO320-34" edge="1">
          <mxGeometry relative="1" as="geometry">
            <mxPoint x="1650" y="920" as="targetPoint" />
          </mxGeometry>
        </mxCell>
        <mxCell id="2bYKCemNrX2bpPvKpex--4" style="edgeStyle=orthogonalEdgeStyle;rounded=0;orthogonalLoop=1;jettySize=auto;html=1;exitX=0.25;exitY=1;exitDx=0;exitDy=0;entryX=0.438;entryY=-0.15;entryDx=0;entryDy=0;entryPerimeter=0;" parent="1" source="CT-23ezE2R-wKhLyO320-26" target="CT-23ezE2R-wKhLyO320-30" edge="1">
          <mxGeometry relative="1" as="geometry" />
        </mxCell>
      </root>
    </mxGraphModel>
  </diagram>
</mxfile>
