<mxfile host="app.diagrams.net" agent="Mozilla/5.0 (Windows NT 10.0; Win64; x64) AppleWebKit/537.36 (KHTML, like Gecko) Chrome/131.0.0.0 Safari/537.36" version="24.8.6">
  <diagram name="Seite-1" id="YW7766kk76HEMyBwX3tA">
    <mxGraphModel dx="1061" dy="654" grid="1" gridSize="10" guides="1" tooltips="1" connect="1" arrows="1" fold="1" page="0" pageScale="1" pageWidth="827" pageHeight="1169" math="0" shadow="0">
      <root>
        <mxCell id="0" />
        <mxCell id="1" parent="0" />
        <mxCell id="BXwIXDxfIsujzFtAB3y9-13" value="Level 1" style="rounded=0;whiteSpace=wrap;html=1;fontSize=20;" vertex="1" parent="1">
          <mxGeometry x="550" y="130" width="120" height="20" as="geometry" />
        </mxCell>
        <mxCell id="BXwIXDxfIsujzFtAB3y9-14" value="Level 2" style="rounded=0;whiteSpace=wrap;html=1;fontSize=20;" vertex="1" parent="1">
          <mxGeometry x="550" y="280" width="120" height="20" as="geometry" />
        </mxCell>
        <mxCell id="BXwIXDxfIsujzFtAB3y9-15" value="Level 3" style="rounded=0;whiteSpace=wrap;html=1;fontSize=20;" vertex="1" parent="1">
          <mxGeometry x="550" y="410" width="120" height="20" as="geometry" />
        </mxCell>
        <mxCell id="BXwIXDxfIsujzFtAB3y9-28" value="" style="endArrow=classic;html=1;rounded=0;exitX=0.5;exitY=1;exitDx=0;exitDy=0;entryX=0.5;entryY=0;entryDx=0;entryDy=0;edgeStyle=orthogonalEdgeStyle;" edge="1" parent="1" source="BXwIXDxfIsujzFtAB3y9-18" target="BXwIXDxfIsujzFtAB3y9-21">
          <mxGeometry width="50" height="50" relative="1" as="geometry">
            <mxPoint x="960" y="440" as="sourcePoint" />
            <mxPoint x="1220" y="450" as="targetPoint" />
          </mxGeometry>
        </mxCell>
        <mxCell id="BXwIXDxfIsujzFtAB3y9-29" value="" style="endArrow=classic;html=1;rounded=0;exitX=0.5;exitY=1;exitDx=0;exitDy=0;entryX=0.5;entryY=0;entryDx=0;entryDy=0;edgeStyle=orthogonalEdgeStyle;" edge="1" parent="1" source="BXwIXDxfIsujzFtAB3y9-18" target="BXwIXDxfIsujzFtAB3y9-87">
          <mxGeometry width="50" height="50" relative="1" as="geometry">
            <mxPoint x="1120" y="440" as="sourcePoint" />
            <mxPoint x="1241" y="360" as="targetPoint" />
          </mxGeometry>
        </mxCell>
        <mxCell id="BXwIXDxfIsujzFtAB3y9-82" value="" style="group" vertex="1" connectable="0" parent="1">
          <mxGeometry x="880" y="130" width="320" height="70" as="geometry" />
        </mxCell>
        <mxCell id="BXwIXDxfIsujzFtAB3y9-17" value="DORY&lt;font style=&quot;font-size: 16px;&quot;&gt;&lt;br style=&quot;font-size: 16px;&quot;&gt;&lt;/font&gt;" style="rounded=0;whiteSpace=wrap;html=1;fontSize=16;align=left;fillColor=#e1d5e7;strokeColor=#9673a6;" vertex="1" parent="BXwIXDxfIsujzFtAB3y9-82">
          <mxGeometry width="320" height="23.337708333333335" as="geometry" />
        </mxCell>
        <mxCell id="BXwIXDxfIsujzFtAB3y9-18" value="&lt;div align=&quot;left&quot;&gt;Deployable Orbital Radio assemblY&lt;/div&gt;" style="rounded=0;whiteSpace=wrap;html=1;align=left;verticalAlign=top;fillColor=#e1d5e7;strokeColor=#9673a6;" vertex="1" parent="BXwIXDxfIsujzFtAB3y9-82">
          <mxGeometry y="23.333333333333336" width="320" height="46.66666666666667" as="geometry" />
        </mxCell>
        <mxCell id="BXwIXDxfIsujzFtAB3y9-84" value="" style="group" vertex="1" connectable="0" parent="1">
          <mxGeometry x="700" y="280" width="320" height="90" as="geometry" />
        </mxCell>
        <mxCell id="BXwIXDxfIsujzFtAB3y9-21" value="Antenna Booms and deployment mechanism" style="rounded=0;whiteSpace=wrap;html=1;fontSize=16;align=left;fillColor=#ffe6cc;strokeColor=#d79b00;" vertex="1" parent="BXwIXDxfIsujzFtAB3y9-84">
          <mxGeometry width="320" height="40" as="geometry" />
        </mxCell>
        <mxCell id="BXwIXDxfIsujzFtAB3y9-22" value="&lt;div align=&quot;left&quot;&gt;Deployment mechanism of the antenna from the satellite and the antenna.&lt;/div&gt;" style="rounded=0;whiteSpace=wrap;html=1;align=left;verticalAlign=top;fillColor=#ffe6cc;strokeColor=#d79b00;" vertex="1" parent="BXwIXDxfIsujzFtAB3y9-84">
          <mxGeometry y="40" width="320" height="50" as="geometry" />
        </mxCell>
        <mxCell id="BXwIXDxfIsujzFtAB3y9-86" value="" style="group" vertex="1" connectable="0" parent="1">
          <mxGeometry x="1060" y="280" width="320" height="90" as="geometry" />
        </mxCell>
        <mxCell id="BXwIXDxfIsujzFtAB3y9-87" value="Structure" style="rounded=0;whiteSpace=wrap;html=1;fontSize=16;align=left;fillColor=#ffe6cc;strokeColor=#d79b00;" vertex="1" parent="BXwIXDxfIsujzFtAB3y9-86">
          <mxGeometry width="320" height="30" as="geometry" />
        </mxCell>
        <mxCell id="BXwIXDxfIsujzFtAB3y9-88" value="&lt;div align=&quot;left&quot;&gt;&lt;br&gt;&lt;/div&gt;" style="rounded=0;whiteSpace=wrap;html=1;align=left;verticalAlign=top;fillColor=#ffe6cc;strokeColor=#d79b00;" vertex="1" parent="BXwIXDxfIsujzFtAB3y9-86">
          <mxGeometry y="30" width="320" height="60" as="geometry" />
        </mxCell>
        <mxCell id="BXwIXDxfIsujzFtAB3y9-90" value="" style="group" vertex="1" connectable="0" parent="1">
          <mxGeometry x="700" y="410" width="320" height="90" as="geometry" />
        </mxCell>
        <mxCell id="BXwIXDxfIsujzFtAB3y9-85" value="" style="group" vertex="1" connectable="0" parent="BXwIXDxfIsujzFtAB3y9-90">
          <mxGeometry width="320" height="60" as="geometry" />
        </mxCell>
        <mxCell id="BXwIXDxfIsujzFtAB3y9-31" value="&lt;font style=&quot;font-size: 16px;&quot;&gt;Release Mechanism&lt;br style=&quot;font-size: 16px;&quot;&gt;&lt;/font&gt;" style="rounded=0;whiteSpace=wrap;html=1;fontSize=16;align=left;fillColor=#dae8fc;strokeColor=#6c8ebf;" vertex="1" parent="BXwIXDxfIsujzFtAB3y9-85">
          <mxGeometry width="320" height="30" as="geometry" />
        </mxCell>
        <mxCell id="BXwIXDxfIsujzFtAB3y9-32" value="&lt;div align=&quot;left&quot;&gt;Associated hardware and software to activate/start the deployment process.&lt;/div&gt;" style="rounded=0;whiteSpace=wrap;html=1;align=left;verticalAlign=top;fillColor=#dae8fc;strokeColor=#6c8ebf;" vertex="1" parent="BXwIXDxfIsujzFtAB3y9-90">
          <mxGeometry y="30" width="320" height="60" as="geometry" />
        </mxCell>
        <mxCell id="BXwIXDxfIsujzFtAB3y9-93" value="" style="group" vertex="1" connectable="0" parent="1">
          <mxGeometry x="700" y="510" width="320" height="90" as="geometry" />
        </mxCell>
        <mxCell id="BXwIXDxfIsujzFtAB3y9-94" value="" style="group" vertex="1" connectable="0" parent="BXwIXDxfIsujzFtAB3y9-93">
          <mxGeometry width="320" height="60" as="geometry" />
        </mxCell>
        <mxCell id="BXwIXDxfIsujzFtAB3y9-95" value="&lt;font style=&quot;font-size: 16px;&quot;&gt;Deployment Regulator&lt;br style=&quot;font-size: 16px;&quot;&gt;&lt;/font&gt;" style="rounded=0;whiteSpace=wrap;html=1;fontSize=16;align=left;fillColor=#dae8fc;strokeColor=#6c8ebf;" vertex="1" parent="BXwIXDxfIsujzFtAB3y9-94">
          <mxGeometry width="320" height="30" as="geometry" />
        </mxCell>
        <mxCell id="BXwIXDxfIsujzFtAB3y9-96" value="&lt;div align=&quot;left&quot;&gt;Device which regulates the deployment forces (e.g. motor, braked roller, tension springs).&lt;/div&gt;" style="rounded=0;whiteSpace=wrap;html=1;align=left;verticalAlign=top;fillColor=#dae8fc;strokeColor=#6c8ebf;" vertex="1" parent="BXwIXDxfIsujzFtAB3y9-93">
          <mxGeometry y="30" width="320" height="60" as="geometry" />
        </mxCell>
        <mxCell id="BXwIXDxfIsujzFtAB3y9-97" value="" style="group" vertex="1" connectable="0" parent="1">
          <mxGeometry x="700" y="610" width="320" height="90" as="geometry" />
        </mxCell>
        <mxCell id="BXwIXDxfIsujzFtAB3y9-98" value="" style="group" vertex="1" connectable="0" parent="BXwIXDxfIsujzFtAB3y9-97">
          <mxGeometry width="320" height="60" as="geometry" />
        </mxCell>
        <mxCell id="BXwIXDxfIsujzFtAB3y9-99" value="&lt;font style=&quot;font-size: 16px;&quot;&gt;Retention Mechanism&lt;br style=&quot;font-size: 16px;&quot;&gt;&lt;/font&gt;" style="rounded=0;whiteSpace=wrap;html=1;fontSize=16;align=left;fillColor=#dae8fc;strokeColor=#6c8ebf;" vertex="1" parent="BXwIXDxfIsujzFtAB3y9-98">
          <mxGeometry width="320" height="30" as="geometry" />
        </mxCell>
        <mxCell id="BXwIXDxfIsujzFtAB3y9-100" value="&lt;div align=&quot;left&quot;&gt;Mechanism which locks the fully deployed antenna into place and prevents unwanted refolding.&amp;nbsp;&lt;/div&gt;" style="rounded=0;whiteSpace=wrap;html=1;align=left;verticalAlign=top;fillColor=#dae8fc;strokeColor=#6c8ebf;" vertex="1" parent="BXwIXDxfIsujzFtAB3y9-97">
          <mxGeometry y="30" width="320" height="60" as="geometry" />
        </mxCell>
        <mxCell id="BXwIXDxfIsujzFtAB3y9-101" value="" style="group" vertex="1" connectable="0" parent="1">
          <mxGeometry x="1060" y="410" width="320" height="90" as="geometry" />
        </mxCell>
        <mxCell id="BXwIXDxfIsujzFtAB3y9-102" value="" style="group" vertex="1" connectable="0" parent="BXwIXDxfIsujzFtAB3y9-101">
          <mxGeometry width="320" height="60" as="geometry" />
        </mxCell>
        <mxCell id="BXwIXDxfIsujzFtAB3y9-103" value="&lt;font style=&quot;font-size: 16px;&quot;&gt;Payload Structure&lt;br style=&quot;font-size: 16px;&quot;&gt;&lt;/font&gt;" style="rounded=0;whiteSpace=wrap;html=1;fontSize=16;align=left;fillColor=#dae8fc;strokeColor=#6c8ebf;" vertex="1" parent="BXwIXDxfIsujzFtAB3y9-102">
          <mxGeometry width="320" height="30" as="geometry" />
        </mxCell>
        <mxCell id="BXwIXDxfIsujzFtAB3y9-104" value="&lt;div align=&quot;left&quot;&gt;Containment for the Antenna Booms and deployment mechanism&lt;/div&gt;" style="rounded=0;whiteSpace=wrap;html=1;align=left;verticalAlign=top;fillColor=#dae8fc;strokeColor=#6c8ebf;" vertex="1" parent="BXwIXDxfIsujzFtAB3y9-101">
          <mxGeometry y="30" width="320" height="60" as="geometry" />
        </mxCell>
        <mxCell id="BXwIXDxfIsujzFtAB3y9-105" value="" style="group" vertex="1" connectable="0" parent="1">
          <mxGeometry x="1060" y="510" width="320" height="90" as="geometry" />
        </mxCell>
        <mxCell id="BXwIXDxfIsujzFtAB3y9-106" value="" style="group" vertex="1" connectable="0" parent="BXwIXDxfIsujzFtAB3y9-105">
          <mxGeometry width="320" height="60" as="geometry" />
        </mxCell>
        <mxCell id="BXwIXDxfIsujzFtAB3y9-107" value="&lt;font style=&quot;font-size: 16px;&quot;&gt;Interface Structure&lt;br style=&quot;font-size: 16px;&quot;&gt;&lt;/font&gt;" style="rounded=0;whiteSpace=wrap;html=1;fontSize=16;align=left;fillColor=#dae8fc;strokeColor=#6c8ebf;" vertex="1" parent="BXwIXDxfIsujzFtAB3y9-106">
          <mxGeometry width="320" height="30" as="geometry" />
        </mxCell>
        <mxCell id="BXwIXDxfIsujzFtAB3y9-108" value="&lt;div align=&quot;left&quot;&gt;Structure for Interfaces such as for the Cubesat Platform, the electrical equipment and the testing equipment.&lt;/div&gt;" style="rounded=0;whiteSpace=wrap;html=1;align=left;verticalAlign=top;fillColor=#dae8fc;strokeColor=#6c8ebf;" vertex="1" parent="BXwIXDxfIsujzFtAB3y9-105">
          <mxGeometry y="30" width="320" height="60" as="geometry" />
        </mxCell>
        <mxCell id="BXwIXDxfIsujzFtAB3y9-109" style="edgeStyle=orthogonalEdgeStyle;rounded=0;orthogonalLoop=1;jettySize=auto;html=1;exitX=0.5;exitY=1;exitDx=0;exitDy=0;" edge="1" parent="1" source="BXwIXDxfIsujzFtAB3y9-22" target="BXwIXDxfIsujzFtAB3y9-31">
          <mxGeometry relative="1" as="geometry" />
        </mxCell>
        <mxCell id="BXwIXDxfIsujzFtAB3y9-110" style="edgeStyle=orthogonalEdgeStyle;rounded=0;orthogonalLoop=1;jettySize=auto;html=1;exitX=0.5;exitY=1;exitDx=0;exitDy=0;entryX=0.5;entryY=0;entryDx=0;entryDy=0;" edge="1" parent="1" source="BXwIXDxfIsujzFtAB3y9-88" target="BXwIXDxfIsujzFtAB3y9-103">
          <mxGeometry relative="1" as="geometry" />
        </mxCell>
      </root>
    </mxGraphModel>
  </diagram>
</mxfile>
