(kicad_sch (version 20230121) (generator eeschema)

  (uuid c2fa9da3-9987-464b-b556-8aca76950ab8)

  (paper "A4")

  (title_block
    (date "2023-11-19")
    (rev "DRAFT")
    (company "SeeSat e.V.")
  )

  (lib_symbols
  )

)
