<svg width="326" height="53" viewBox="0 0 326 53" fill="none" xmlns="http://www.w3.org/2000/svg">
<path d="M326 44.4505V51.6805H318.619V44.4505H326Z" fill="#FF4545"/>
<path d="M31.9849 2.57682L30.2934 8.90307C25.834 7.39682 21.9896 6.49307 18.9142 6.49307C15.8387 6.49307 13.2245 7.09557 11.3793 8.30057C9.53397 9.50557 8.61133 11.1624 8.61133 13.2712C8.61133 14.7774 8.91888 16.1331 9.53397 17.1874C10.1491 18.2418 11.3793 19.1456 12.917 19.8987C14.4547 20.6518 16.7613 21.5556 19.5293 22.3087C24.6038 23.8149 28.1406 25.6224 30.2934 28.0324C32.4463 30.4424 33.5227 33.6056 33.5227 37.5218C33.5227 42.0406 31.9849 45.6556 28.7557 48.3668C25.5264 51.0781 21.2208 52.2831 15.8387 52.2831C11.0717 52.2831 5.8434 51.0781 0 48.6681L2.15283 42.3418C5.38208 43.5468 7.99623 44.4506 9.84152 44.9024C11.6868 45.3543 13.6859 45.6556 15.6849 45.6556C18.9142 45.6556 21.3745 44.9024 23.2198 43.5468C25.0651 42.1912 25.9878 40.0824 25.9878 37.6724C25.9878 36.0156 25.6802 34.8106 24.9113 33.7562C24.1425 32.7018 23.0661 31.7981 21.3745 30.8943C19.683 29.9906 17.5302 29.0868 14.4547 28.3337C9.68775 27.1287 6.30472 25.3212 4.30567 23.2124C2.30661 21.1037 1.23019 18.0912 1.23019 14.3256C1.23019 9.80682 2.76793 6.19182 5.99718 3.78182C9.22642 1.37182 13.5321 0.0161937 19.0679 0.0161937C23.2198 -0.134431 27.5255 0.769319 31.9849 2.57682Z" fill="black"/>
<path d="M50.438 21.8568H71.9663V28.0324H50.438V45.6556H75.1955V51.6806H43.3644V0.468079H74.4267V6.6437H50.438V21.8568Z" fill="black"/>
<path d="M91.8033 21.8568H113.332V28.0324H91.8033V45.6556H116.561V51.6806H84.5759V0.468079H115.638V6.6437H91.8033V21.8568Z" fill="black"/>
<path d="M161.463 7.09558C165.768 11.4637 167.921 17.79 167.921 26.0743C167.921 34.3587 165.768 40.6849 161.309 45.0531C156.85 49.4212 150.852 51.6806 142.856 51.6806H125.941V0.468079H142.856C151.006 0.468079 157.157 2.72745 161.463 7.09558ZM156.081 40.5343C159.156 37.2206 160.694 32.4006 160.694 25.9237C160.694 19.5975 159.156 14.7775 156.234 11.4637C153.313 8.14995 148.853 6.49308 143.01 6.49308H133.168V45.3543H143.01C148.7 45.5049 153.005 43.8481 156.081 40.5343Z" fill="black"/>
<path d="M178.377 0.468079H185.451V51.6806H178.377V0.468079Z" fill="black"/>
<path d="M233.428 47.6137C229.891 50.7768 224.817 52.2831 218.358 52.2831C211.9 52.2831 206.825 50.7768 203.289 47.6137C199.752 44.4506 197.906 40.0825 197.906 34.5093V0.468079H204.98V34.5093C204.98 38.4256 206.056 41.2875 208.209 43.095C210.362 44.9025 213.745 45.9568 218.205 45.9568C227.123 45.9568 231.583 42.1912 231.583 34.5093V0.468079H238.656V34.5093C238.81 40.0825 237.119 44.4506 233.428 47.6137Z" fill="black"/>
<path d="M295.707 8.90308C295.246 10.2587 294.477 12.8193 293.247 17.0368C292.016 21.2543 290.94 24.4174 290.017 26.8274L281.56 50.1743H274.486L266.029 26.6768C265.106 23.9656 263.876 20.5012 262.646 16.585C261.415 12.6687 260.647 9.95745 260.185 8.75245L258.032 26.6768L254.957 51.6806H248.191L254.803 0.468079H263.568L272.948 27.5806C273.256 28.4843 273.564 29.5387 274.025 30.7437C274.486 31.9487 274.794 33.1537 275.255 34.5093C276.485 38.1243 277.254 40.8356 277.869 42.4924C278.484 40.8356 279.407 38.1243 280.483 34.5093C280.945 33.1537 281.406 31.9487 281.714 30.7437C282.021 29.5387 282.482 28.4843 282.79 27.5806L292.17 0.468079H300.935L307.548 51.6806H300.782L297.552 26.8274L295.707 8.90308Z" fill="black"/>
</svg>
