{
  "bail": 10,
  "collectCoverageFrom": ["**/*.ts", "!**/test/**"],
  "globalSetup": "<rootDir>/globalSetup.ts",
  "reporters": ["default", "jest-junit"],
  "setupFiles": ["<rootDir>/setup.ts"],
  "setupFilesAfterEnv": ["<rootDir>/setup-after-env.ts"],
  "testTimeout": 300000
}
