Flash Image Tool (WIN32): 12.0.40.1434
Flash Programming Tool (DOS): 12.0.40.1433
Flash Programming Tool (EFI64): 12.0.40.1433
Flash Programming Tool (WIN32): 12.0.40.1433
Flash Programming Tool (WIN64): 12.0.40.1433
Flash Programming Tool (LINUX64): 12.0.40.1433
FWUpdate (DOS): 12.0.40.1433
FWUpdate (EFI64): 12.0.45.1509
FWUpdate (WIN32): 12.0.47.1524
FWUpdate (WIN64): 12.0.47.1524
FWUpdate (LINUX64): 12.0.45.1509
MEInfo (DOS): 12.0.40.1433
MEInfo (EFI64): 12.0.45.1509
MEInfo (WIN32): 12.0.47.1524
MEInfo (WIN64): 12.0.47.1524
MEInfo (LINUX64): 12.0.45.1509
MEManuf (DOS): 12.0.40.1433
MEManuf (EFI64): 12.0.40.1433
MEManuf (WIN32): 12.0.40.1433
MEManuf (WIN64): 12.0.47.1524
MEManuf (LINUX64): 12.0.40.1433
Clock Commander Tool (DOS): 12.0.30.7024
Clock Commander Tool (EFI64): 12.0.30.7024
Clock Commander Tool (WIN32): 12.0.30.7024
Manifest Extension Utility (WIN32): 12.0.40.1434
Manifest Extension Utility (LINUX64): 12.0.40.1434


Credits:
* Intel for providing the tools
* Plutomaniac for archiving it for all of us! 