{
  "menu": [
    {
      "url": "home",
      "name": "Home",
      "icon": "home",
      "slug": "home"
    },
    {
      "navheader": "Core",
      "slug": ""
    },
    {
      "url": "",
      "name": "Plan Municipal Desarrollo",
      "icon": "map",
      "slug": "",
      "permission": "menu pmd",
      "submenu": [
        {
          "url": "plan/ejes",
          "name": "Ejes de desarrollo",
          "icon": "compass",
          "slug": "plan.ejes",
          "permission": "menu pmd ejes"
        },
        {
          "url": "plan/programas",
          "name": "Programas",
          "icon": "crosshair",
          "slug": "plan.programas",
          "permission": "menu pmd programas"
        },
        {
          "url": "plan/estrategias",
          "name": "Estrategias",
          "icon": "command",
          "slug": "plan.estrategias",
          "permission": "menu pmd estrategias"
        }
      ]
    },
    {
      "url": "",
      "name": "Seguimiento Actividad Municipal",
      "icon": "navigation",
      "slug": "",
      "permission": "menu sam",
      "submenu": [
        {
          "url": "sam/actividades",
          "name": "Actividades",
          "icon": "check-square",
          "permission": "menu sam actividades",
          "slug": [
            "sam.actividades",
            "sam.historicos"
          ]
        },
        {
          "url": "sam/unidades",
          "name": "Unidades",
          "icon": "feather",
          "slug": "sam.unidades",
          "permission": "menu sam unidades"
        },
        {
          "url": "sam/etiquetas",
          "name": "Etiquetas",
          "icon": "tag",
          "slug": "sam.etiquetas",
          "permission": "menu sam etiquetas"
        },
        {
          "url": "sam/solicitudes",
          "name": "Solicitudes",
          "icon": "git-pull-request",
          "slug": "sam.solicitudes",
          "permission": "menu sam solicitudes"
        }
      ]
    },
    {
      "name": "Organización",
      "icon": "slack",
      "slug": "",
      "badgeClass": "badge rounded-pill badge-light-danger ms-auto me-1",
      "permission": "menu org",
      "submenu": [
        {
          "url": "organizacion/areas",
          "name": "Áreas",
          "icon": "layout",
          "slug": "organizacion.areas",
          "permission": "menu org areas"
        },
        {
          "url": "organizacion/colaboradores",
          "name": "Colaboradores",
          "icon": "user-check",
          "slug": "organizacion.colaboradores",
          "permission": "menu org colaboradores"
        },
        {
          "url": "organizacion/organigrama",
          "name": "Organigrama",
          "icon": "share-2",
          "slug": "organizacion.organigrama",
          "permission": "menu org organigrama"
        }
      ]
    },
    {
      "name": "Seguridad",
      "icon": "lock",
      "slug": "",
      "badgeClass": "badge rounded-pill badge-light-danger ms-auto me-1",
      "permission": "menu seg",
      "submenu": [
        {
          "url": "seguridad/modulos",
          "name": "Modulos",
          "icon": "box",
          "permission": "menu seg modulos",
          "slug": [
            "seguridad.modulos",
            "seguridad.modulos.permisos"
          ]
        },
        {
          "url": "seguridad/roles",
          "name": "Roles",
          "permission": "menu seg roles",
          "icon": "users",
          "slug": [
            "seguridad.roles.list",
            "seguridad.roles.create",
            "seguridad.roles.edit"
          ]
        },
        {
          "url": "seguridad/usuarios",
          "name": "Usuarios",
          "permission": "menu seg usuarios",
          "icon": "user",
          "slug": "seguridad.usuarios"
        }
      ]
    }
  ]
}