{
  "env": {
    "browser": true,
    "es2022": true
  },
  "extends": [
    "eslint:recommended",
    "plugin:react/recommended",
    "plugin:react-hooks/recommended",
    "plugin:@typescript-eslint/recommended",
    "prettier"
  ],
  "parser": "@typescript-eslint/parser",
  "parserOptions": {
    "project": "./tsconfig.json"
  },
  "plugins": [
    "react",
    "react-hooks",
    "eslint-plugin-import",
    "@typescript-eslint"
  ],
  "rules": {
    "semi": [
      "error",
      "always"
    ],
    "quotes": [
      "error",
      "double",
      {
        "avoidEscape": true
      }
    ],
    "no-console": [
      "warn",
      {
        "allow": [
          "warn",
          "error"
        ]
      }
    ],
    "arrow-parens": [
      "error",
      "always"
    ],
    "no-param-reassign": "error",
    "no-sequences": "error",
    "object-shorthand": "error",
    "prefer-const": "error",
    "prefer-object-spread": "error",
    "import/no-default-export": "error",
    "import/no-internal-modules": [
      "error",
      {
        "allow": [
          "unfetch/polyfill/index",
          "promise-polyfill/dist/polyfill"
        ]
      }
    ],
    "import/no-extraneous-dependencies": "error",
    "@typescript-eslint/array-type": [
      "error",
      {
        "default": "array-simple"
      }
    ],
    "@typescript-eslint/prefer-readonly": "error",
    "@typescript-eslint/no-dynamic-delete": "error",
    "@typescript-eslint/no-require-imports": "error",
    "@typescript-eslint/strict-boolean-expressions": [
      "error",
      {
        "allowString": false,
        "allowNumber": false,
        "allowNullableObject": false
      }
    ]
  },
  "settings": {
    "react": {
      "version": "detect"
    }
  }
}
