%YAML 1.1
%TAG !u! tag:unity3d.com,2011:
--- !u!1 &1668790113736126760
GameObject:
  m_ObjectHideFlags: 0
  m_CorrespondingSourceObject: {fileID: 0}
  m_PrefabInstance: {fileID: 0}
  m_PrefabAsset: {fileID: 0}
  serializedVersion: 6
  m_Component:
  - component: {fileID: 8831295011408909192}
  - component: {fileID: 2274712954012086282}
  - component: {fileID: 4022701331853606317}
  m_Layer: 0
  m_Name: Level_02
  m_TagString: Untagged
  m_Icon: {fileID: 0}
  m_NavMeshLayer: 0
  m_StaticEditorFlags: 0
  m_IsActive: 1
--- !u!4 &8831295011408909192
Transform:
  m_ObjectHideFlags: 0
  m_CorrespondingSourceObject: {fileID: 0}
  m_PrefabInstance: {fileID: 0}
  m_PrefabAsset: {fileID: 0}
  m_GameObject: {fileID: 1668790113736126760}
  m_LocalRotation: {x: 0, y: 0, z: 0, w: 1}
  m_LocalPosition: {x: -0.5, y: -0.54, z: 0}
  m_LocalScale: {x: 1, y: 1, z: 1}
  m_Children: []
  m_Father: {fileID: 0}
  m_RootOrder: 0
  m_LocalEulerAnglesHint: {x: 0, y: 0, z: 0}
--- !u!212 &2274712954012086282
SpriteRenderer:
  m_ObjectHideFlags: 0
  m_CorrespondingSourceObject: {fileID: 0}
  m_PrefabInstance: {fileID: 0}
  m_PrefabAsset: {fileID: 0}
  m_GameObject: {fileID: 1668790113736126760}
  m_Enabled: 1
  m_CastShadows: 0
  m_ReceiveShadows: 0
  m_DynamicOccludee: 1
  m_MotionVectors: 1
  m_LightProbeUsage: 1
  m_ReflectionProbeUsage: 1
  m_RayTracingMode: 0
  m_RenderingLayerMask: 1
  m_RendererPriority: 0
  m_Materials:
  - {fileID: 10754, guid: 0000000000000000f000000000000000, type: 0}
  m_StaticBatchInfo:
    firstSubMesh: 0
    subMeshCount: 0
  m_StaticBatchRoot: {fileID: 0}
  m_ProbeAnchor: {fileID: 0}
  m_LightProbeVolumeOverride: {fileID: 0}
  m_ScaleInLightmap: 1
  m_ReceiveGI: 1
  m_PreserveUVs: 0
  m_IgnoreNormalsForChartDetection: 0
  m_ImportantGI: 0
  m_StitchLightmapSeams: 1
  m_SelectedEditorRenderState: 0
  m_MinimumChartSize: 4
  m_AutoUVMaxDistance: 0.5
  m_AutoUVMaxAngle: 89
  m_LightmapParameters: {fileID: 0}
  m_SortingLayerID: 0
  m_SortingLayer: 0
  m_SortingOrder: 0
  m_Sprite: {fileID: 21300000, guid: b7c02bfbfdf336841848d5b9f2e952aa, type: 3}
  m_Color: {r: 1, g: 1, b: 1, a: 1}
  m_FlipX: 0
  m_FlipY: 0
  m_DrawMode: 0
  m_Size: {x: 19.2, y: 10.8}
  m_AdaptiveModeThreshold: 0.5
  m_SpriteTileMode: 0
  m_WasSpriteAssigned: 1
  m_MaskInteraction: 0
  m_SpriteSortPoint: 0
--- !u!60 &4022701331853606317
PolygonCollider2D:
  m_ObjectHideFlags: 0
  m_CorrespondingSourceObject: {fileID: 0}
  m_PrefabInstance: {fileID: 0}
  m_PrefabAsset: {fileID: 0}
  m_GameObject: {fileID: 1668790113736126760}
  m_Enabled: 1
  m_Density: 1
  m_Material: {fileID: 0}
  m_IsTrigger: 0
  m_UsedByEffector: 0
  m_UsedByComposite: 0
  m_Offset: {x: 0, y: 0}
  m_SpriteTilingProperty:
    border: {x: 0, y: 0, z: 0, w: 0}
    pivot: {x: 0.5, y: 0.5}
    oldSize: {x: 19.2, y: 10.8}
    newSize: {x: 19.2, y: 10.8}
    adaptiveTilingThreshold: 0.5
    drawMode: 0
    adaptiveTiling: 0
  m_AutoTiling: 0
  m_Points:
    m_Paths:
    - - {x: 9.599999, y: 0.22}
      - {x: 9.58, y: 0.24}
      - {x: 9.57, y: 0.24}
      - {x: 9.54, y: 0.22}
      - {x: 9.37, y: -0.12}
      - {x: 9.349999, y: -0.14}
      - {x: 9.28, y: -0.26}
      - {x: 9.21, y: -0.37}
      - {x: 9.13, y: -0.5}
      - {x: 8.76, y: -0.5}
      - {x: 8.5, y: -0.76}
      - {x: 8.5, y: -0.77}
      - {x: 7.97, y: -1.3}
      - {x: 7.8799996, y: -1.37}
      - {x: 7.66, y: -1.5799999}
      - {x: 7.64, y: -1.64}
      - {x: 7.54, y: -1.9499999}
      - {x: 7.45, y: -2.23}
      - {x: 7.41, y: -2.33}
      - {x: 7.14, y: -2.84}
      - {x: 7.0699997, y: -2.98}
      - {x: 6.8399997, y: -3.1299999}
      - {x: 6.58, y: -3.3}
      - {x: 6.46, y: -3.37}
      - {x: 6.3399997, y: -3.46}
      - {x: 6.08, y: -3.1999998}
      - {x: 5.93, y: -3.06}
      - {x: 5.47, y: -3.06}
      - {x: 5.46, y: -3.05}
      - {x: 5.4, y: -3.03}
      - {x: 5.29, y: -2.99}
      - {x: 5.0899997, y: -2.9199998}
      - {x: 4.92, y: -2.87}
      - {x: 4.8599997, y: -2.8}
      - {x: 4.81, y: -2.71}
      - {x: 4.69, y: -2.53}
      - {x: 4.58, y: -2.33}
      - {x: 4.4, y: -2.01}
      - {x: 4.36, y: -1.9399999}
      - {x: 3.86, y: -0.96}
      - {x: 3.86, y: -0.94}
      - {x: 3.56, y: -0.16}
      - {x: 3.52, y: -0.06}
      - {x: 3.05, y: 0.64}
      - {x: 2.98, y: 0.72999996}
      - {x: 2.84, y: 0.9}
      - {x: 2.7, y: 1.06}
      - {x: 2.56, y: 1.23}
      - {x: 2.51, y: 1.28}
      - {x: 2.18, y: 1.28}
      - {x: 2.1, y: 1.2099999}
      - {x: 1.88, y: 1}
      - {x: 1.7199999, y: 0.84}
      - {x: 1.7099999, y: 0.79999995}
      - {x: 1.66, y: 0.58}
      - {x: 1.62, y: 0.39999998}
      - {x: 1.53, y: -0.01}
      - {x: 1.41, y: -0.56}
      - {x: 1.41, y: -1.6999999}
      - {x: 1.36, y: -1.76}
      - {x: 0.88, y: -2.37}
      - {x: 0.58, y: -2.57}
      - {x: 0.26999998, y: -2.76}
      - {x: -0.11, y: -3.1499999}
      - {x: -0.28, y: -3.33}
      - {x: -0.35, y: -3.26}
      - {x: -0.47, y: -3.1499999}
      - {x: -0.7, y: -2.9299998}
      - {x: -0.81, y: -2.84}
      - {x: -0.96999997, y: -2.71}
      - {x: -1.3, y: -2.48}
      - {x: -1.35, y: -2.4299998}
      - {x: -1.37, y: -2.33}
      - {x: -1.42, y: -2.23}
      - {x: -1.4599999, y: -2.12}
      - {x: -1.52, y: -1.92}
      - {x: -1.61, y: -1.8199999}
      - {x: -1.81, y: -1.66}
      - {x: -2.01, y: -1.48}
      - {x: -2.05, y: -1.4499999}
      - {x: -2.53, y: -1.4499999}
      - {x: -2.55, y: -1.42}
      - {x: -2.77, y: -1.18}
      - {x: -3.33, y: -0.57}
      - {x: -3.4099998, y: -0.48}
      - {x: -3.46, y: -0.38}
      - {x: -3.6, y: -0.14}
      - {x: -3.6299999, y: -0.12}
      - {x: -3.76, y: -0.08}
      - {x: -4.35, y: 0.089999996}
      - {x: -4.5899997, y: 0.16}
      - {x: -4.69, y: 0.19}
      - {x: -4.74, y: 0.19999999}
      - {x: -5.35, y: -0.39999998}
      - {x: -5.47, y: -0.53999996}
      - {x: -5.83, y: -0.97999996}
      - {x: -6.1099997, y: -1.14}
      - {x: -6.2, y: -1.1899999}
      - {x: -6.48, y: -1.35}
      - {x: -6.64, y: -1.4399999}
      - {x: -6.7799997, y: -1.53}
      - {x: -7.14, y: -1.49}
      - {x: -7.3399997, y: -1.4699999}
      - {x: -7.62, y: -1.4399999}
      - {x: -7.8199997, y: -1.42}
      - {x: -8.01, y: -1.4}
      - {x: -8.19, y: -1.39}
      - {x: -8.25, y: -1.29}
      - {x: -8.55, y: -0.74}
      - {x: -8.62, y: -0.63}
      - {x: -8.62, y: 0.57}
      - {x: -8.63, y: 0.59999996}
      - {x: -8.95, y: 1.28}
      - {x: -9.0199995, y: 1.43}
      - {x: -9.59, y: 1.99}
      - {x: -9.599999, y: 1.99}
      - {x: -9.599999, y: -5.38}
      - {x: -5.94, y: -5.38}
      - {x: -5.93, y: -5.39}
      - {x: -1.13, y: -5.39}
      - {x: -1.12, y: -5.4}
      - {x: 9.599999, y: -5.4}
