{
    "type": "service_account",
    "project_id": "kplay-prod-koralplay",
    "private_key_id": "fe47c54584eedb54c5fb6662e8be83a5b740a37b",
    "private_key": "-----BEGIN PRIVATE KEY-----\nMIIEvgIBADANBgkqhkiG9w0BAQEFAASCBKgwggSkAgEAAoIBAQCtKlBExGChEQtG\nxjxvkMgTun8brH7A2Vd4sRI2dIEQnqikAQdvqUuiCGNo+br34Qp1NpaNWBfwb1vZ\nuw0+O099idlqBnK2ZRJQ8hjfXzl5HGadb1BsAaD5vRpN/ed97y1ew9EMtR7Vj7ZR\nZOMFgOaA9dwYicRM5nL9WVTfDTiQxcaWELmck/7Ed/7mlw8jCqcaXz3+kIIu6tVf\nig5QVTOjwQOg7cD92L+rWJzwr5W1I6wPEs+S+HFn1WMXLvJmpgGd9oxAJq38Kr0p\nCCzkNtwkveD404DMhamrDBVRD4yZUih1ytzGIT795Qevr0ULx5Q3PbNyCrGv5MpO\nq0wK5w2/AgMBAAECggEAO1hRAgA7DXgF4U92ztVTfE9h2F4ZYoYZ0Cb/EuKCiOuW\n5/3iSoY+gV1WlFdhmCnrp5f5qJ8UNTY0yD2uoDE7YM6pUAi9r3yb9lnB5GuCCtuM\n30+SxDEatfv00928RBCAAAYj0rMPyijiVqq4kt5GINQhhddRCvm/VswSpg6l4BcW\nvBBBKsAf032Jz3koPHKbswAa8AyPNf3zV1jPeroINkw8npl2587Dp9g9pIpkngnZ\nfUxjXwrgpPD9BozKN6OXtKj8BxJQVIwHs29JHNtz4jj02FCUUDmscONmxXR05gpQ\nxomYErUicdtswPgRXBn5MA41y7qdId/oyrnwFV4BQQKBgQDmeV+YFKRcQ9tHbKgW\nxkHkdpsa5vtvXbqa9s9UqFjUO60rqNm9uOp8twEX2naHIuDgzm4EPg6PIUs5C0qc\nGFm7XLn29QtDTfIHDoJDXJxwasM5CF71D86TjYXadRabXW+17i2grzS9LtGD0IdS\n9XISbIbYgslnv50hg7JioQfHRwKBgQDAWBB+6kN+t4kBjVJo9PA9z7gfzscBXzHa\nskSQTzNecgLw94Hfa1iLAYTpp3qmncSCUJRfmpkwd9oQnH1V76xvjvajD8PXS0hN\nELt6DiOlD/TUskBV7eLwPqBEVSpKs/AMHrmni/2i90Rn36Xvk+cFwg8CZTKB1DqW\n77BAXaExyQKBgQDYPtuNwxhwJY7yFiYksEKVDR/8/uq9lFEJIzhnc0ldYNzbkSM0\nGvOQrtjMu8LoirY62BVrz5oze4ar8EdB7KsM3DT0XPkDXngPXPKmJ5f09odT1OHb\nx8gItAn6blAW2HV/WwnesWWnd+1HY3oFQZyVYtSnAxfcS3IwRvQyDGtS8wKBgBsE\nw9xwH+cO9QnoxijEL3MfWKfvLfk9XA1yeTskRP0BWvRqcC3oMFnmbrs7sXjyNIZx\nt0Xuu5IZY+JteRW3Qyuwk2i4cDQv+QoKTauJjOxE34l5OJxZfEVvJqgypmwz9oZd\nUor8mTZpMYy919tdlVgzuFQHzx55p3lIViPUgy4xAoGBAK77IgCaMyt1+RH+Iz6B\nehzjnjbVXTtOBQYOdkpTPrgLGVcqF+ZGQgryfde8KNPtv9zxrU/MM556jqDJpeXt\nBddmUm0cQpnDFKCXvmMRNJWx985uMPt8SqFpsbpsuh4L501BRy3d/6yqjlTap14J\njaF+zjMUT82NsEAIK/QaaR4C\n-----END PRIVATE KEY-----\n",
    "client_email": "koralplay@kplay-prod-koralplay.iam.gserviceaccount.com",
    "client_id": "102730443350155067390",
    "auth_uri": "https://accounts.google.com/o/oauth2/auth",
    "token_uri": "https://oauth2.googleapis.com/token",
    "auth_provider_x509_cert_url": "https://www.googleapis.com/oauth2/v1/certs",
    "client_x509_cert_url": "https://www.googleapis.com/robot/v1/metadata/x509/koralplay%40kplay-prod-koralplay.iam.gserviceaccount.com"
  }
  