{
  "collectionName": "components_elements_rassurance_items",
  "info": {
    "name": "rassurance-item",
    "icon": "cog",
    "description": ""
  },
  "options": {},
  "attributes": {
    "title": {
      "type": "string"
    },
    "description": {
      "type": "text"
    },
    "picto": {
      "model": "file",
      "via": "related",
      "allowedTypes": [
        "images"
      ],
      "plugin": "upload",
      "required": false
    }
  }
}
