{
  "collectionName": "components_links_button_links",
  "info": {
    "name": "buttonLink",
    "icon": "phone-slash"
  },
  "options": {},
  "attributes": {
    "buttonText": {
      "type": "string"
    },
    "buttonLink": {
      "type": "string"
    },
    "buttonStyle": {
      "type": "enumeration",
      "enum": [
        "primary",
        "secondary"
      ]
    }
  }
}
