{
  "collectionName": "components_links_nav_links",
  "info": {
    "name": "navLink",
    "icon": "link"
  },
  "options": {},
  "attributes": {
    "linkText": {
      "type": "string"
    },
    "linkUrl": {
      "type": "string"
    },
    "linkTargetBlank": {
      "type": "boolean",
      "default": false
    }
  }
}
