1	2	3	
 0.0000e+00	 1.0000e+00	 5.9199e-01	
 0.0000e+00	 2.0000e+00	 8.2921e+00	
 0.0000e+00	 3.0000e+00	 7.6773e-01	
 0.0000e+00	 4.0000e+00	 7.3426e-01	
 0.0000e+00	 5.0000e+00	 7.1664e-01	
 0.0000e+00	 6.0000e+00	 6.9380e-01	
 0.0000e+00	 7.0000e+00	 6.8823e-01	
 0.0000e+00	 8.0000e+00	 6.6715e-01	
 0.0000e+00	 9.0000e+00	 6.3838e-01	
 0.0000e+00	 1.0000e+01	 7.5210e+00	
 0.0000e+00	 1.1000e+01	 8.0680e-01	
 0.0000e+00	 1.2000e+01	 8.0360e-01	
 0.0000e+00	 1.3000e+01	 7.7840e-01	
 0.0000e+00	 1.4000e+01	 7.7358e-01	
 0.0000e+00	 1.5000e+01	 7.5187e-01	
 0.0000e+00	 1.6000e+01	 7.2671e-01	
 0.0000e+00	 1.7000e+01	 7.0216e-01	
 0.0000e+00	 1.8000e+01	 6.8334e-01	
 0.0000e+00	 1.9000e+01	 6.5923e-01	
 0.0000e+00	 2.0000e+01	 6.5207e-01	
 0.0000e+00	 2.1000e+01	 6.2849e-01	
 0.0000e+00	 2.2000e+01	 6.2589e-01	
 0.0000e+00	 2.3000e+01	 6.0357e-01	
 0.0000e+00	 2.4000e+01	 5.9980e-01	
 0.0000e+00	 2.5000e+01	 5.8656e-01	
 0.0000e+00	 2.6000e+01	 5.6730e-01	
 0.0000e+00	 2.7000e+01	 5.5167e-01	
 0.0000e+00	 2.8000e+01	 5.5240e-01	
 0.0000e+00	 2.9000e+01	 5.3623e-01	
 0.0000e+00	 3.0000e+01	 5.2398e-01	
 0.0000e+00	 3.1000e+01	 5.2251e-01	
 0.0000e+00	 3.2000e+01	 5.0194e-01	
 0.0000e+00	 3.3000e+01	 4.9644e-01	
 0.0000e+00	 3.4000e+01	 4.8394e-01	
 0.0000e+00	 3.5000e+01	 4.8210e-01	
 0.0000e+00	 3.6000e+01	 9.8858e+00	
 0.0000e+00	 3.7000e+01	 6.4028e-01	
 0.0000e+00	 3.8000e+01	 6.2915e-01	
 0.0000e+00	 3.9000e+01	 6.0289e-01	
 0.0000e+00	 4.0000e+01	 7.8968e+00	
 0.0000e+00	 4.1000e+01	 7.7182e-01	
 0.0000e+00	 4.2000e+01	 7.6137e-01	
 0.0000e+00	 4.3000e+01	 7.3508e-01	
 0.0000e+00	 4.4000e+01	 7.3395e-01	
 0.0000e+00	 4.5000e+01	 7.0348e-01	
 0.0000e+00	 4.6000e+01	 6.8860e-01	
 0.0000e+00	 4.7000e+01	 6.6567e-01	
 0.0000e+00	 4.8000e+01	 6.4266e-01	
 0.0000e+00	 4.9000e+01	 6.3872e-01	
 0.0000e+00	 5.0000e+01	 6.1365e-01	
 0.0000e+00	 5.1000e+01	 6.0485e-01	
 0.0000e+00	 5.2000e+01	 5.9450e-01	
 0.0000e+00	 5.3000e+01	 5.8494e-01	
 0.0000e+00	 5.4000e+01	 8.4157e+00	
 0.0000e+00	 5.5000e+01	 7.4946e-01	
 0.0000e+00	 5.6000e+01	 7.3672e-01	
 0.0000e+00	 5.7000e+01	 7.0872e-01	
 0.0000e+00	 5.8000e+01	 6.8638e-01	
 0.0000e+00	 5.9000e+01	 6.9118e-01	
 0.0000e+00	 6.0000e+01	 6.6070e-01	
 0.0000e+00	 6.1000e+01	 6.4930e-01	
 0.0000e+00	 6.2000e+01	 6.3277e-01	
 0.0000e+00	 6.3000e+01	 6.2176e-01	
 0.0000e+00	 6.4000e+01	 5.9616e-01	
 0.0000e+00	 6.5000e+01	 6.0187e-01	
 0.0000e+00	 6.6000e+01	 5.7599e-01	
 0.0000e+00	 6.7000e+01	 5.6469e-01	
 0.0000e+00	 6.8000e+01	 5.6250e-01	
 0.0000e+00	 6.9000e+01	 5.4220e-01	
 0.0000e+00	 7.0000e+01	 5.3952e-01	
 0.0000e+00	 7.1000e+01	 5.1895e-01	
 0.0000e+00	 7.2000e+01	 5.1298e-01	
 0.0000e+00	 7.3000e+01	 4.8922e-01	
 0.0000e+00	 7.4000e+01	 4.7870e-01	
 0.0000e+00	 7.5000e+01	 4.8039e-01	
 0.0000e+00	 7.6000e+01	 9.6782e+00	
 0.0000e+00	 7.7000e+01	 6.4914e-01	
 0.0000e+00	 7.8000e+01	 6.3711e-01	
 0.0000e+00	 7.9000e+01	 6.1300e-01	
 0.0000e+00	 8.0000e+01	 6.0833e-01	
 0.0000e+00	 8.1000e+01	 5.8743e-01	
 0.0000e+00	 8.2000e+01	 5.6950e-01	
 0.0000e+00	 8.3000e+01	 5.5641e-01	
 0.0000e+00	 8.4000e+01	 8.4275e+00	
 0.0000e+00	 8.5000e+01	 7.3623e-01	
 0.0000e+00	 8.6000e+01	 7.1680e-01	
 0.0000e+00	 8.7000e+01	 6.9525e-01	
 0.0000e+00	 8.8000e+01	 6.7559e-01	
 0.0000e+00	 8.9000e+01	 6.5891e-01	
 0.0000e+00	 9.0000e+01	 6.4031e-01	
 0.0000e+00	 9.1000e+01	 6.3275e-01	
 0.0000e+00	 9.2000e+01	 6.1314e-01	
 0.0000e+00	 9.3000e+01	 6.1125e-01	
 0.0000e+00	 9.4000e+01	 8.0864e+00	
 0.0000e+00	 9.5000e+01	 7.6192e-01	
 0.0000e+00	 9.6000e+01	 7.5298e-01	
 0.0000e+00	 9.7000e+01	 7.3803e-01	
 0.0000e+00	 9.8000e+01	 7.1223e-01	
 0.0000e+00	 9.9000e+01	 6.9719e-01	
 0.0000e+00	 1.0000e+02	 6.5661e-01	
 0.0000e+00	 1.0100e+02	 6.6559e-01	
 0.0000e+00	 1.0200e+02	 6.5050e-01	
 0.0000e+00	 1.0300e+02	 6.3473e-01	
 0.0000e+00	 1.0400e+02	 6.1365e-01	
 0.0000e+00	 1.0500e+02	 6.0519e-01	
 0.0000e+00	 1.0600e+02	 5.9027e-01	
 0.0000e+00	 1.0700e+02	 5.7416e-01	
 0.0000e+00	 1.0800e+02	 5.6098e-01	
 0.0000e+00	 1.0900e+02	 5.4820e-01	
 0.0000e+00	 1.1000e+02	 8.8779e+00	
 0.0000e+00	 1.1100e+02	 7.1650e-01	
 0.0000e+00	 1.1200e+02	 6.7469e+00	
 0.0000e+00	 1.1300e+02	 8.9217e-01	
 0.0000e+00	 1.1400e+02	 8.6974e-01	
 0.0000e+00	 1.1500e+02	 8.5115e-01	
 0.0000e+00	 1.1600e+02	 8.1529e-01	
 0.0000e+00	 1.1700e+02	 7.8942e-01	
 0.0000e+00	 1.1800e+02	 7.6930e-01	
 0.0000e+00	 1.1900e+02	 7.4936e-01	
 0.0000e+00	 1.2000e+02	 7.4361e-01	
 0.0000e+00	 1.2100e+02	 7.2281e-01	
 0.0000e+00	 1.2200e+02	 6.8884e-01	
 0.0000e+00	 1.2300e+02	 6.9229e-01	
 0.0000e+00	 1.2400e+02	 6.8336e-01	
 0.0000e+00	 1.2500e+02	 6.4222e-01	
 0.0000e+00	 1.2600e+02	 6.4633e-01	
 0.0000e+00	 1.2700e+02	 6.2992e-01	
 0.0000e+00	 1.2800e+02	 6.1602e-01	
 0.0000e+00	 1.2900e+02	 6.0601e-01	
 0.0000e+00	 1.3000e+02	 5.8654e-01	
 0.0000e+00	 1.3100e+02	 5.8664e-01	
 0.0000e+00	 1.3200e+02	 8.4734e+00	
 0.0000e+00	 1.3300e+02	 7.4112e-01	
 0.0000e+00	 1.3400e+02	 7.1714e-01	
 0.0000e+00	 1.3500e+02	 7.0708e-01	
 0.0000e+00	 1.3600e+02	 6.6918e-01	
 0.0000e+00	 1.3700e+02	 6.6381e-01	
 0.0000e+00	 1.3800e+02	 7.3027e+00	
 0.0000e+00	 1.3900e+02	 8.3147e-01	
 0.0000e+00	 1.4000e+02	 8.1627e-01	
 0.0000e+00	 1.4100e+02	 7.9780e-01	
 0.0000e+00	 1.4200e+02	 7.8150e-01	
 0.0000e+00	 1.4300e+02	 7.5710e-01	
 0.0000e+00	 1.4400e+02	 7.3078e-01	
 0.0000e+00	 1.4500e+02	 7.2449e-01	
 0.0000e+00	 1.4600e+02	 6.9963e-01	
 0.0000e+00	 1.4700e+02	 6.9554e-01	
 0.0000e+00	 1.4800e+02	 6.6843e-01	
 0.0000e+00	 1.4900e+02	 6.4304e-01	
 0.0000e+00	 1.5000e+02	 6.4765e-01	
 0.0000e+00	 1.5100e+02	 6.3337e-01	
 0.0000e+00	 1.5200e+02	 6.0328e-01	
 0.0000e+00	 1.5300e+02	 6.0702e-01	
 0.0000e+00	 1.5400e+02	 5.8698e-01	
 0.0000e+00	 1.5500e+02	 5.7893e-01	
 0.0000e+00	 1.5600e+02	 5.4640e-01	
 0.0000e+00	 1.5700e+02	 5.5738e-01	
 0.0000e+00	 1.5800e+02	 5.2909e-01	
 0.0000e+00	 1.5900e+02	 5.2376e-01	
 0.0000e+00	 1.6000e+02	 5.1024e-01	
 0.0000e+00	 1.6100e+02	 5.0959e-01	
 0.0000e+00	 1.6200e+02	 5.0090e-01	
 0.0000e+00	 1.6300e+02	 4.8507e-01	
 0.0000e+00	 1.6400e+02	 4.6467e-01	
 0.0000e+00	 1.6500e+02	 4.6026e-01	
 0.0000e+00	 1.6600e+02	 4.5464e-01	
 0.0000e+00	 1.6700e+02	 4.4326e-01	
 0.0000e+00	 1.6800e+02	 4.3785e-01	
 0.0000e+00	 1.6900e+02	 4.3421e-01	
 0.0000e+00	 1.7000e+02	 4.2394e-01	
 0.0000e+00	 1.7100e+02	 4.1390e-01	
 0.0000e+00	 1.7200e+02	 4.0307e-01	
 0.0000e+00	 1.7300e+02	 3.9265e-01	
 0.0000e+00	 1.7400e+02	 3.9047e-01	
 0.0000e+00	 1.7500e+02	 1.1403e+01	
 0.0000e+00	 1.7600e+02	 5.4866e-01	
 0.0000e+00	 1.7700e+02	 5.4633e-01	
 0.0000e+00	 1.7800e+02	 5.3379e-01	
 0.0000e+00	 1.7900e+02	 5.2389e-01	
 0.0000e+00	 1.8000e+02	 5.0332e-01	
 0.0000e+00	 1.8100e+02	 5.0467e-01	
 0.0000e+00	 1.8200e+02	 4.8679e-01	
 0.0000e+00	 1.8300e+02	 4.7555e-01	
 0.0000e+00	 1.8400e+02	 4.7092e-01	
 0.0000e+00	 1.8500e+02	 4.4993e-01	
 0.0000e+00	 1.8600e+02	 4.5212e-01	
 0.0000e+00	 1.8700e+02	 4.3031e-01	
 0.0000e+00	 1.8800e+02	 4.2828e-01	
 0.0000e+00	 1.8900e+02	 4.2079e-01	
 0.0000e+00	 1.9000e+02	 4.1448e-01	
 0.0000e+00	 1.9100e+02	 1.1014e+01	
 0.0000e+00	 1.9200e+02	 5.7398e-01	
 0.0000e+00	 1.9300e+02	 5.6363e-01	
 0.0000e+00	 1.9400e+02	 5.6348e-01	
 0.0000e+00	 1.9500e+02	 5.3685e-01	
 0.0000e+00	 1.9600e+02	 5.1810e-01	
 0.0000e+00	 1.9700e+02	 5.2400e-01	
 0.0000e+00	 1.9800e+02	 5.0189e-01	
 0.0000e+00	 1.9900e+02	 5.0736e-01	
 0.0000e+00	 2.0000e+02	 9.5668e+00	
 0.0000e+00	 2.0100e+02	 6.7030e-01	
 0.0000e+00	 2.0200e+02	 6.5433e-01	
 0.0000e+00	 2.0300e+02	 6.2804e-01	
 0.0000e+00	 2.0400e+02	 6.2652e-01	
 0.0000e+00	 2.0500e+02	 6.2332e-01	
 0.0000e+00	 2.0600e+02	 5.8696e-01	
 0.0000e+00	 2.0700e+02	 5.7607e-01	
 0.0000e+00	 2.0800e+02	 5.7373e-01	
 0.0000e+00	 2.0900e+02	 5.4927e-01	
 0.0000e+00	 2.1000e+02	 5.4315e-01	
 0.0000e+00	 2.1100e+02	 5.3897e-01	
 0.0000e+00	 2.1200e+02	 5.1462e-01	
 0.0000e+00	 2.1300e+02	 4.8565e-01	
 0.0000e+00	 2.1400e+02	 5.0429e-01	
 0.0000e+00	 2.1500e+02	 4.8204e-01	
 0.0000e+00	 2.1600e+02	 4.8687e-01	
 0.0000e+00	 2.1700e+02	 4.7929e-01	
 0.0000e+00	 2.1800e+02	 4.5323e-01	
 0.0000e+00	 2.1900e+02	 4.5081e-01	
 0.0000e+00	 2.2000e+02	 4.3140e-01	
 0.0000e+00	 2.2100e+02	 4.4861e-01	
 0.0000e+00	 2.2200e+02	 1.0610e+01	
 0.0000e+00	 2.2300e+02	 5.9342e-01	
 0.0000e+00	 2.2400e+02	 5.8445e-01	
 0.0000e+00	 2.2500e+02	 5.6994e-01	
 0.0000e+00	 2.2600e+02	 5.5208e-01	
 0.0000e+00	 2.2700e+02	 5.6071e-01	
 0.0000e+00	 2.2800e+02	 5.3352e-01	
 0.0000e+00	 2.2900e+02	 9.0383e+00	
 0.0000e+00	 2.3000e+02	 7.1072e-01	
 0.0000e+00	 2.3100e+02	 6.8108e-01	
 0.0000e+00	 2.3200e+02	 6.7349e-01	
 0.0000e+00	 2.3300e+02	 6.5558e-01	
 0.0000e+00	 2.3400e+02	 6.5157e-01	
 0.0000e+00	 2.3500e+02	 6.2750e-01	
 0.0000e+00	 2.3600e+02	 6.0077e-01	
 0.0000e+00	 2.3700e+02	 6.0274e-01	
 0.0000e+00	 2.3800e+02	 5.9147e-01	
 0.0000e+00	 2.3900e+02	 5.7233e-01	
 0.0000e+00	 2.4000e+02	 5.5673e-01	
 0.0000e+00	 2.4100e+02	 5.4172e-01	
 0.0000e+00	 2.4200e+02	 5.4295e-01	
 0.0000e+00	 2.4300e+02	 5.2428e-01	
 0.0000e+00	 2.4400e+02	 5.0345e-01	
 0.0000e+00	 2.4500e+02	 4.9387e-01	
 0.0000e+00	 2.4600e+02	 5.0319e-01	
 0.0000e+00	 2.4700e+02	 4.8373e-01	
 0.0000e+00	 2.4800e+02	 4.6264e-01	
 0.0000e+00	 2.4900e+02	 4.6326e-01	
 0.0000e+00	 2.5000e+02	 4.6428e-01	
 0.0000e+00	 2.5100e+02	 4.5366e-01	
 0.0000e+00	 2.5200e+02	 4.3734e-01	
 0.0000e+00	 2.5300e+02	 4.2848e-01	
 0.0000e+00	 2.5400e+02	 4.1345e-01	
 0.0000e+00	 2.5500e+02	 4.1269e-01	
 0.0000e+00	 2.5600e+02	 4.0595e-01	
 0.0000e+00	 2.5700e+02	 4.1091e-01	
 0.0000e+00	 2.5800e+02	 3.8975e-01	
 0.0000e+00	 2.5900e+02	 3.7448e-01	
 0.0000e+00	 2.6000e+02	 3.8193e-01	
 0.0000e+00	 2.6100e+02	 3.7832e-01	
 0.0000e+00	 2.6200e+02	 3.6783e-01	
 0.0000e+00	 2.6300e+02	 3.5876e-01	
 0.0000e+00	 2.6400e+02	 3.4774e-01	
 0.0000e+00	 2.6500e+02	 3.4525e-01	
 0.0000e+00	 2.6600e+02	 3.3693e-01	
 0.0000e+00	 2.6700e+02	 3.4236e-01	
 0.0000e+00	 2.6800e+02	 3.3762e-01	
 0.0000e+00	 2.6900e+02	 3.2450e-01	
 0.0000e+00	 2.7000e+02	 3.2272e-01	
 0.0000e+00	 2.7100e+02	 3.1362e-01	
 0.0000e+00	 2.7200e+02	 3.0453e-01	
 0.0000e+00	 2.7300e+02	 3.0986e-01	
 0.0000e+00	 2.7400e+02	 3.0063e-01	
 0.0000e+00	 2.7500e+02	 3.0300e-01	
 0.0000e+00	 2.7600e+02	 2.9483e-01	
 0.0000e+00	 2.7700e+02	 2.8834e-01	
 0.0000e+00	 2.7800e+02	 2.8889e-01	
 0.0000e+00	 2.7900e+02	 2.7815e-01	
 0.0000e+00	 2.8000e+02	 1.4334e+01	
 0.0000e+00	 2.8100e+02	 4.3008e-01	
 0.0000e+00	 2.8200e+02	 4.1456e-01	
 0.0000e+00	 2.8300e+02	 4.0116e-01	
 0.0000e+00	 2.8400e+02	 4.0236e-01	
 0.0000e+00	 2.8500e+02	 3.9607e-01	
 0.0000e+00	 2.8600e+02	 3.8899e-01	
 0.0000e+00	 2.8700e+02	 3.8238e-01	
 0.0000e+00	 2.8800e+02	 3.7663e-01	
 0.0000e+00	 2.8900e+02	 3.5516e-01	
 0.0000e+00	 2.9000e+02	 3.6243e-01	
 0.0000e+00	 2.9100e+02	 3.5081e-01	
 0.0000e+00	 2.9200e+02	 3.4811e-01	
 0.0000e+00	 2.9300e+02	 3.3901e-01	
 0.0000e+00	 2.9400e+02	 3.3301e-01	
 0.0000e+00	 2.9500e+02	 3.3346e-01	
 0.0000e+00	 2.9600e+02	 3.3156e-01	
 0.0000e+00	 2.9700e+02	 3.2993e-01	
 0.0000e+00	 2.9800e+02	 3.2759e-01	
 0.0000e+00	 2.9900e+02	 3.0984e-01	
 0.0000e+00	 3.0000e+02	 1.3174e+01	
 0.0000e+00	 3.0100e+02	 4.6149e-01	
 0.0000e+00	 3.0200e+02	 4.4550e-01	
 0.0000e+00	 3.0300e+02	 4.4429e-01	
 0.0000e+00	 3.0400e+02	 4.4149e-01	
 0.0000e+00	 3.0500e+02	 4.1816e-01	
 0.0000e+00	 3.0600e+02	 4.2307e-01	
 0.0000e+00	 3.0700e+02	 4.0921e-01	
 0.0000e+00	 3.0800e+02	 4.1378e-01	
 0.0000e+00	 3.0900e+02	 4.0037e-01	
 0.0000e+00	 3.1000e+02	 4.0025e-01	
 0.0000e+00	 3.1100e+02	 3.8218e-01	
 0.0000e+00	 3.1200e+02	 3.8071e-01	
 0.0000e+00	 3.1300e+02	 3.6915e-01	
 0.0000e+00	 3.1400e+02	 3.6475e-01	
 0.0000e+00	 3.1500e+02	 3.5936e-01	
 0.0000e+00	 3.1600e+02	 3.4396e-01	
 0.0000e+00	 3.1700e+02	 1.2551e+01	
 0.0000e+00	 3.1800e+02	 5.1411e-01	
 0.0000e+00	 3.1900e+02	 5.0502e-01	
 0.0000e+00	 3.2000e+02	 4.8627e-01	
 0.0000e+00	 3.2100e+02	 4.7253e-01	
 0.0000e+00	 3.2200e+02	 4.6369e-01	
 0.0000e+00	 3.2300e+02	 4.5772e-01	
 0.0000e+00	 3.2400e+02	 4.6226e-01	
 0.0000e+00	 3.2500e+02	 4.4397e-01	
 0.0000e+00	 3.2600e+02	 4.3148e-01	
 0.0000e+00	 3.2700e+02	 4.3039e-01	
 0.0000e+00	 3.2800e+02	 4.2049e-01	
 0.0000e+00	 3.2900e+02	 4.0479e-01	
 0.0000e+00	 3.3000e+02	 3.9732e-01	
 0.0000e+00	 3.3100e+02	 4.0051e-01	
 0.0000e+00	 3.3200e+02	 1.1495e+01	
 0.0000e+00	 3.3300e+02	 5.6518e-01	
 0.0000e+00	 3.3400e+02	 5.3349e-01	
 0.0000e+00	 3.3500e+02	 5.3654e-01	
 0.0000e+00	 3.3600e+02	 5.3220e-01	
 0.0000e+00	 3.3700e+02	 5.2206e-01	
 0.0000e+00	 3.3800e+02	 5.1048e-01	
 0.0000e+00	 3.3900e+02	 4.9628e-01	
 0.0000e+00	 3.4000e+02	 4.7583e-01	
 0.0000e+00	 3.4100e+02	 4.7725e-01	
 0.0000e+00	 3.4200e+02	 4.6379e-01	
 0.0000e+00	 3.4300e+02	 4.5601e-01	
 0.0000e+00	 3.4400e+02	 4.5357e-01	
 0.0000e+00	 3.4500e+02	 4.3631e-01	
 0.0000e+00	 3.4600e+02	 4.3724e-01	
 0.0000e+00	 3.4700e+02	 4.2298e-01	
 0.0000e+00	 3.4800e+02	 4.1402e-01	
 0.0000e+00	 3.4900e+02	 4.0456e-01	
 0.0000e+00	 3.5000e+02	 3.9750e-01	
 0.0000e+00	 3.5100e+02	 4.0692e-01	
 0.0000e+00	 3.5200e+02	 3.8001e-01	
 0.0000e+00	 3.5300e+02	 3.7398e-01	
 0.0000e+00	 3.5400e+02	 3.7628e-01	
 0.0000e+00	 3.5500e+02	 3.6708e-01	
 0.0000e+00	 3.5600e+02	 1.2092e+01	
 0.0000e+00	 3.5700e+02	 5.2706e-01	
 0.0000e+00	 3.5800e+02	 5.0627e-01	
 0.0000e+00	 3.5900e+02	 4.9570e-01	
 0.0000e+00	 3.6000e+02	 4.9751e-01	
 0.0000e+00	 3.6100e+02	 4.8370e-01	
 0.0000e+00	 3.6200e+02	 4.7015e-01	
 0.0000e+00	 3.6300e+02	 4.6302e-01	
 0.0000e+00	 3.6400e+02	 4.4899e-01	
 0.0000e+00	 3.6500e+02	 4.4938e-01	
 0.0000e+00	 3.6600e+02	 4.3435e-01	
 0.0000e+00	 3.6700e+02	 4.3004e-01	
 0.0000e+00	 3.6800e+02	 4.2041e-01	
 0.0000e+00	 3.6900e+02	 4.1222e-01	
 0.0000e+00	 3.7000e+02	 4.0473e-01	
 0.0000e+00	 3.7100e+02	 4.0358e-01	
 0.0000e+00	 3.7200e+02	 3.9482e-01	
 0.0000e+00	 3.7300e+02	 3.9007e-01	
 0.0000e+00	 3.7400e+02	 3.7014e-01	
 0.0000e+00	 3.7500e+02	 3.7120e-01	
 0.0000e+00	 3.7600e+02	 3.7067e-01	
 0.0000e+00	 3.7700e+02	 3.6109e-01	
 0.0000e+00	 3.7800e+02	 3.4774e-01	
 0.0000e+00	 3.7900e+02	 3.4348e-01	
 0.0000e+00	 3.8000e+02	 3.3911e-01	
 0.0000e+00	 3.8100e+02	 3.3488e-01	
 0.0000e+00	 3.8200e+02	 3.3713e-01	
 0.0000e+00	 3.8300e+02	 3.2193e-01	
 0.0000e+00	 3.8400e+02	 3.1387e-01	
 0.0000e+00	 3.8500e+02	 3.2221e-01	
 0.0000e+00	 3.8600e+02	 3.1029e-01	
 0.0000e+00	 3.8700e+02	 3.0683e-01	
 0.0000e+00	 3.8800e+02	 2.9660e-01	
 0.0000e+00	 3.8900e+02	 2.9548e-01	
 0.0000e+00	 3.9000e+02	 2.9371e-01	
 0.0000e+00	 3.9100e+02	 1.3763e+01	
 0.0000e+00	 3.9200e+02	 4.4036e-01	
 0.0000e+00	 3.9300e+02	 4.3004e-01	
 0.0000e+00	 3.9400e+02	 4.1515e-01	
 0.0000e+00	 3.9500e+02	 4.1477e-01	
 0.0000e+00	 3.9600e+02	 4.0339e-01	
 0.0000e+00	 3.9700e+02	 4.0280e-01	
 0.0000e+00	 3.9800e+02	 3.9983e-01	
 0.0000e+00	 3.9900e+02	 3.7984e-01	
 0.0000e+00	 4.0000e+02	 3.7476e-01	
 0.0000e+00	 4.0100e+02	 3.6666e-01	
 0.0000e+00	 4.0200e+02	 3.5927e-01	
 0.0000e+00	 4.0300e+02	 3.6326e-01	
 0.0000e+00	 4.0400e+02	 3.5766e-01	
 0.0000e+00	 4.0500e+02	 3.5326e-01	
 0.0000e+00	 4.0600e+02	 3.4815e-01	
 0.0000e+00	 4.0700e+02	 3.2729e-01	
 0.0000e+00	 4.0800e+02	 3.2035e-01	
 0.0000e+00	 4.0900e+02	 3.2504e-01	
 0.0000e+00	 4.1000e+02	 1.2939e+01	
 0.0000e+00	 4.1100e+02	 4.7369e-01	
 0.0000e+00	 4.1200e+02	 4.7223e-01	
 0.0000e+00	 4.1300e+02	 4.7538e-01	
 0.0000e+00	 4.1400e+02	 4.5452e-01	
 0.0000e+00	 4.1500e+02	 4.3668e-01	
 0.0000e+00	 4.1600e+02	 4.3005e-01	
 0.0000e+00	 4.1700e+02	 4.1907e-01	
 0.0000e+00	 4.1800e+02	 4.0812e-01	
 0.0000e+00	 4.1900e+02	 4.1449e-01	
 0.0000e+00	 4.2000e+02	 4.0353e-01	
 0.0000e+00	 4.2100e+02	 3.9295e-01	
 0.0000e+00	 4.2200e+02	 3.8716e-01	
 0.0000e+00	 4.2300e+02	 3.8292e-01	
 0.0000e+00	 4.2400e+02	 1.1740e+01	
 0.0000e+00	 4.2500e+02	 5.4288e-01	
 0.0000e+00	 4.2600e+02	 5.3390e-01	
 0.0000e+00	 4.2700e+02	 5.2677e-01	
 0.0000e+00	 4.2800e+02	 5.1625e-01	
 0.0000e+00	 4.2900e+02	 5.0296e-01	
 0.0000e+00	 4.3000e+02	 4.9663e-01	
 0.0000e+00	 4.3100e+02	 4.7512e-01	
 0.0000e+00	 4.3200e+02	 4.7463e-01	
 0.0000e+00	 4.3300e+02	 4.6029e-01	
 0.0000e+00	 4.3400e+02	 4.4244e-01	
 0.0000e+00	 4.3500e+02	 4.3780e-01	
 0.0000e+00	 4.3600e+02	 4.3630e-01	
 0.0000e+00	 4.3700e+02	 4.2426e-01	
 0.0000e+00	 4.3800e+02	 4.1425e-01	
 0.0000e+00	 4.3900e+02	 4.0802e-01	
 0.0000e+00	 4.4000e+02	 4.1339e-01	
 0.0000e+00	 4.4100e+02	 4.0424e-01	
 0.0000e+00	 4.4200e+02	 3.8488e-01	
 0.0000e+00	 4.4300e+02	 3.7612e-01	
 0.0000e+00	 4.4400e+02	 3.8302e-01	
 0.0000e+00	 4.4500e+02	 3.6731e-01	
 0.0000e+00	 4.4600e+02	 3.6028e-01	
 0.0000e+00	 4.4700e+02	 3.4959e-01	
 0.0000e+00	 4.4800e+02	 3.6049e-01	
 0.0000e+00	 4.4900e+02	 3.4707e-01	
 0.0000e+00	 4.5000e+02	 3.3768e-01	
 0.0000e+00	 4.5100e+02	 3.3331e-01	
 0.0000e+00	 4.5200e+02	 3.2320e-01	
 0.0000e+00	 4.5300e+02	 3.2357e-01	
 0.0000e+00	 4.5400e+02	 3.1777e-01	
 0.0000e+00	 4.5500e+02	 3.1302e-01	
 0.0000e+00	 4.5600e+02	 3.0687e-01	
 0.0000e+00	 4.5700e+02	 3.0650e-01	
 0.0000e+00	 4.5800e+02	 3.0434e-01	
 0.0000e+00	 4.5900e+02	 1.3670e+01	
 0.0000e+00	 4.6000e+02	 4.4227e-01	
 0.0000e+00	 4.6100e+02	 4.2782e-01	
 0.0000e+00	 4.6200e+02	 4.3099e-01	
 0.0000e+00	 4.6300e+02	 4.2630e-01	
 0.0000e+00	 4.6400e+02	 4.1102e-01	
 0.0000e+00	 4.6500e+02	 4.0249e-01	
 0.0000e+00	 4.6600e+02	 3.9605e-01	
 0.0000e+00	 4.6700e+02	 3.9140e-01	
 0.0000e+00	 4.6800e+02	 1.1249e+01	
 0.0000e+00	 4.6900e+02	 5.3494e-01	
 0.0000e+00	 4.7000e+02	 5.3004e-01	
 0.0000e+00	 4.7100e+02	 5.3724e-01	
 0.0000e+00	 4.7200e+02	 5.0968e-01	
 0.0000e+00	 4.7300e+02	 5.0799e-01	
 0.0000e+00	 4.7400e+02	 4.9897e-01	
 0.0000e+00	 4.7500e+02	 4.8171e-01	
 0.0000e+00	 4.7600e+02	 4.7583e-01	
 0.0000e+00	 4.7700e+02	 4.7078e-01	
 0.0000e+00	 4.7800e+02	 4.4974e-01	
 0.0000e+00	 4.7900e+02	 4.3142e-01	
 0.0000e+00	 4.8000e+02	 4.2522e-01	
 0.0000e+00	 4.8100e+02	 4.2614e-01	
 0.0000e+00	 4.8200e+02	 4.2324e-01	
 0.0000e+00	 4.8300e+02	 4.1776e-01	
 0.0000e+00	 4.8400e+02	 4.0336e-01	
 0.0000e+00	 4.8500e+02	 3.9726e-01	
 0.0000e+00	 4.8600e+02	 3.8267e-01	
 0.0000e+00	 4.8700e+02	 3.7834e-01	
 0.0000e+00	 4.8800e+02	 3.7297e-01	
 0.0000e+00	 4.8900e+02	 3.7894e-01	
 0.0000e+00	 4.9000e+02	 3.8505e-01	
 0.0000e+00	 4.9100e+02	 3.5988e-01	
 0.0000e+00	 4.9200e+02	 3.5766e-01	
 0.0000e+00	 4.9300e+02	 3.4927e-01	
 0.0000e+00	 4.9400e+02	 3.3911e-01	
 0.0000e+00	 4.9500e+02	 3.3384e-01	
 0.0000e+00	 4.9600e+02	 3.4017e-01	
 0.0000e+00	 4.9700e+02	 3.2564e-01	
 0.0000e+00	 4.9800e+02	 3.2455e-01	
 0.0000e+00	 4.9900e+02	 3.0957e-01	
 0.0000e+00	 5.0000e+02	 3.0993e-01	
 0.0000e+00	 5.0100e+02	 3.0617e-01	
 0.0000e+00	 5.0200e+02	 3.0884e-01	
 0.0000e+00	 5.0300e+02	 3.0211e-01	
 0.0000e+00	 5.0400e+02	 2.9959e-01	
 0.0000e+00	 5.0500e+02	 2.8161e-01	
 0.0000e+00	 5.0600e+02	 2.8278e-01	
 0.0000e+00	 5.0700e+02	 2.8653e-01	
 0.0000e+00	 5.0800e+02	 2.7683e-01	
 0.0000e+00	 5.0900e+02	 2.7398e-01	
 0.0000e+00	 5.1000e+02	 2.7124e-01	
 0.0000e+00	 5.1100e+02	 2.6678e-01	
 0.0000e+00	 5.1200e+02	 2.5638e-01	
 0.0000e+00	 5.1300e+02	 2.6115e-01	
 0.0000e+00	 5.1400e+02	 2.5324e-01	
 0.0000e+00	 5.1500e+02	 2.5328e-01	
 0.0000e+00	 5.1600e+02	 2.4371e-01	
 0.0000e+00	 5.1700e+02	 2.4089e-01	
 0.0000e+00	 5.1800e+02	 2.4571e-01	
 0.0000e+00	 5.1900e+02	 2.3482e-01	
 0.0000e+00	 5.2000e+02	 2.3715e-01	
 0.0000e+00	 5.2100e+02	 2.3562e-01	
 0.0000e+00	 5.2200e+02	 2.3390e-01	
 0.0000e+00	 5.2300e+02	 2.3078e-01	
 0.0000e+00	 5.2400e+02	 2.2146e-01	
 0.0000e+00	 5.2500e+02	 2.2556e-01	
 0.0000e+00	 5.2600e+02	 2.1769e-01	
 0.0000e+00	 5.2700e+02	 2.1444e-01	
 0.0000e+00	 5.2800e+02	 2.1549e-01	
 0.0000e+00	 5.2900e+02	 2.1284e-01	
 0.0000e+00	 5.3000e+02	 2.0872e-01	
 0.0000e+00	 5.3100e+02	 2.0872e-01	
 0.0000e+00	 5.3200e+02	 2.0421e-01	
 0.0000e+00	 5.3300e+02	 1.9978e-01	
 0.0000e+00	 5.3400e+02	 2.0486e-01	
 0.0000e+00	 5.3500e+02	 1.9788e-01	
 0.0000e+00	 5.3600e+02	 1.9605e-01	
 0.0000e+00	 5.3700e+02	 1.9194e-01	
 0.0000e+00	 5.3800e+02	 1.8959e-01	
 0.0000e+00	 5.3900e+02	 1.9126e-01	
 0.0000e+00	 5.4000e+02	 1.8518e-01	
 0.0000e+00	 5.4100e+02	 1.8535e-01	
 0.0000e+00	 5.4200e+02	 1.9356e-01	
 0.0000e+00	 5.4300e+02	 1.8567e-01	
 0.0000e+00	 5.4400e+02	 1.7766e-01	
 0.0000e+00	 5.4500e+02	 1.8153e-01	
 0.0000e+00	 5.4600e+02	 1.7821e-01	
 0.0000e+00	 5.4700e+02	 1.7239e-01	
 0.0000e+00	 5.4800e+02	 1.7198e-01	
 0.0000e+00	 5.4900e+02	 1.7147e-01	
 0.0000e+00	 5.5000e+02	 1.7293e-01	
 0.0000e+00	 5.5100e+02	 1.8649e+01	
 0.0000e+00	 5.5200e+02	 2.8269e-01	
 0.0000e+00	 5.5300e+02	 2.6252e-01	
 0.0000e+00	 5.5400e+02	 2.7057e-01	
 0.0000e+00	 5.5500e+02	 2.6627e-01	
 0.0000e+00	 5.5600e+02	 2.5397e-01	
 0.0000e+00	 5.5700e+02	 2.6100e-01	
 0.0000e+00	 5.5800e+02	 2.5952e-01	
 0.0000e+00	 5.5900e+02	 2.5217e-01	
 0.0000e+00	 5.6000e+02	 2.5026e-01	
 0.0000e+00	 5.6100e+02	 2.5292e-01	
 0.0000e+00	 5.6200e+02	 2.4640e-01	
 0.0000e+00	 5.6300e+02	 2.4254e-01	
 0.0000e+00	 5.6400e+02	 2.3822e-01	
 0.0000e+00	 5.6500e+02	 2.3434e-01	
 0.0000e+00	 5.6600e+02	 2.2706e-01	
 0.0000e+00	 5.6700e+02	 2.2295e-01	
 0.0000e+00	 5.6800e+02	 2.2235e-01	
 0.0000e+00	 5.6900e+02	 2.2174e-01	
 0.0000e+00	 5.7000e+02	 2.1994e-01	
 0.0000e+00	 5.7100e+02	 2.2239e-01	
 0.0000e+00	 5.7200e+02	 2.1547e-01	
 0.0000e+00	 5.7300e+02	 2.0926e-01	
 0.0000e+00	 5.7400e+02	 2.1276e-01	
 0.0000e+00	 5.7500e+02	 2.0922e-01	
 0.0000e+00	 5.7600e+02	 2.0630e-01	
 0.0000e+00	 5.7700e+02	 2.0117e-01	
 0.0000e+00	 5.7800e+02	 1.9975e-01	
 0.0000e+00	 5.7900e+02	 2.0013e-01	
 0.0000e+00	 5.8000e+02	 1.9990e-01	
 0.0000e+00	 5.8100e+02	 1.9576e-01	
 0.0000e+00	 5.8200e+02	 1.9130e-01	
 0.0000e+00	 5.8300e+02	 1.8810e-01	
 0.0000e+00	 5.8400e+02	 1.9380e-01	
 0.0000e+00	 5.8500e+02	 1.9281e-01	
 0.0000e+00	 5.8600e+02	 1.8715e-01	
 0.0000e+00	 5.8700e+02	 1.8142e-01	
 0.0000e+00	 5.8800e+02	 1.7773e-01	
 0.0000e+00	 5.8900e+02	 1.7417e-01	
 0.0000e+00	 5.9000e+02	 1.7396e-01	
 0.0000e+00	 5.9100e+02	 1.7052e-01	
 0.0000e+00	 5.9200e+02	 1.7523e-01	
 0.0000e+00	 5.9300e+02	 1.6992e-01	
 0.0000e+00	 5.9400e+02	 1.7120e-01	
 0.0000e+00	 5.9500e+02	 1.6351e-01	
 0.0000e+00	 5.9600e+02	 1.6779e-01	
 0.0000e+00	 5.9700e+02	 1.6767e-01	
 0.0000e+00	 5.9800e+02	 1.6784e-01	
 0.0000e+00	 5.9900e+02	 1.5953e-01	
 0.0000e+00	 6.0000e+02	 1.6449e-01	
 0.0000e+00	 6.0100e+02	 1.6478e-01	
 0.0000e+00	 6.0200e+02	 1.5858e-01	
 0.0000e+00	 6.0300e+02	 1.5511e-01	
 0.0000e+00	 6.0400e+02	 1.5321e-01	
 0.0000e+00	 6.0500e+02	 1.5542e-01	
 0.0000e+00	 6.0600e+02	 1.5043e-01	
 0.0000e+00	 6.0700e+02	 1.4957e-01	
 0.0000e+00	 6.0800e+02	 1.5297e-01	
 0.0000e+00	 6.0900e+02	 1.4883e-01	
 0.0000e+00	 6.1000e+02	 1.4778e-01	
 0.0000e+00	 6.1100e+02	 1.4573e-01	
 0.0000e+00	 6.1200e+02	 1.4177e-01	
 0.0000e+00	 6.1300e+02	 1.4248e-01	
 0.0000e+00	 6.1400e+02	 1.4383e-01	
 0.0000e+00	 6.1500e+02	 1.4158e-01	
 0.0000e+00	 6.1600e+02	 1.3970e-01	
 0.0000e+00	 6.1700e+02	 1.3782e-01	
 0.0000e+00	 6.1800e+02	 1.3543e-01	
 0.0000e+00	 6.1900e+02	 1.3075e-01	
 0.0000e+00	 6.2000e+02	 1.3892e-01	
 0.0000e+00	 6.2100e+02	 1.3714e-01	
 0.0000e+00	 6.2200e+02	 1.3391e-01	
 0.0000e+00	 6.2300e+02	 1.3336e-01	
 0.0000e+00	 6.2400e+02	 1.3449e-01	
 0.0000e+00	 6.2500e+02	 1.2918e-01	
 0.0000e+00	 6.2600e+02	 1.2921e-01	
 0.0000e+00	 6.2700e+02	 1.2529e-01	
 0.0000e+00	 6.2800e+02	 1.2506e-01	
 0.0000e+00	 6.2900e+02	 1.2950e-01	
 0.0000e+00	 6.3000e+02	 1.2509e-01	
 0.0000e+00	 6.3100e+02	 1.2335e-01	
 0.0000e+00	 6.3200e+02	 1.2258e-01	
 0.0000e+00	 6.3300e+02	 1.1933e-01	
 0.0000e+00	 6.3400e+02	 1.2212e-01	
 0.0000e+00	 6.3500e+02	 1.1964e-01	
 0.0000e+00	 6.3600e+02	 1.2489e-01	
 0.0000e+00	 6.3700e+02	 1.2121e-01	
 0.0000e+00	 6.3800e+02	 1.1675e-01	
 0.0000e+00	 6.3900e+02	 1.1885e-01	
 0.0000e+00	 6.4000e+02	 1.1623e-01	
 0.0000e+00	 6.4100e+02	 2.1926e+01	
 0.0000e+00	 6.4200e+02	 2.0036e-01	
 0.0000e+00	 6.4300e+02	 1.9722e-01	
 0.0000e+00	 6.4400e+02	 1.9891e-01	
 0.0000e+00	 6.4500e+02	 1.9704e-01	
 0.0000e+00	 6.4600e+02	 1.9288e-01	
 0.0000e+00	 6.4700e+02	 1.8651e-01	
 0.0000e+00	 6.4800e+02	 1.8863e-01	
 0.0000e+00	 6.4900e+02	 1.8307e-01	
 0.0000e+00	 6.5000e+02	 1.8591e-01	
 0.0000e+00	 6.5100e+02	 1.8551e-01	
 0.0000e+00	 6.5200e+02	 1.7738e-01	
 0.0000e+00	 6.5300e+02	 1.7336e-01	
 0.0000e+00	 6.5400e+02	 1.7524e-01	
 0.0000e+00	 6.5500e+02	 1.8677e-01	
 0.0000e+00	 6.5600e+02	 1.7541e-01	
 0.0000e+00	 6.5700e+02	 1.7185e-01	
 0.0000e+00	 6.5800e+02	 1.6902e-01	
 0.0000e+00	 6.5900e+02	 1.6332e-01	
 0.0000e+00	 6.6000e+02	 1.6375e-01	
 0.0000e+00	 6.6100e+02	 1.5971e-01	
 0.0000e+00	 6.6200e+02	 1.6362e-01	
 0.0000e+00	 6.6300e+02	 1.6126e-01	
 0.0000e+00	 6.6400e+02	 1.5941e-01	
 0.0000e+00	 6.6500e+02	 1.5930e-01	
 0.0000e+00	 6.6600e+02	 1.6206e-01	
 0.0000e+00	 6.6700e+02	 1.5600e-01	
 0.0000e+00	 6.6800e+02	 1.5357e-01	
 0.0000e+00	 6.6900e+02	 1.5251e-01	
 0.0000e+00	 6.7000e+02	 1.4909e-01	
 0.0000e+00	 6.7100e+02	 1.5360e-01	
 0.0000e+00	 6.7200e+02	 1.4756e-01	
 0.0000e+00	 6.7300e+02	 1.5003e-01	
 0.0000e+00	 6.7400e+02	 1.4945e-01	
 0.0000e+00	 6.7500e+02	 1.5011e-01	
 0.0000e+00	 6.7600e+02	 1.4768e-01	
 0.0000e+00	 6.7700e+02	 1.4085e-01	
 0.0000e+00	 6.7800e+02	 1.4248e-01	
 0.0000e+00	 6.7900e+02	 1.3888e-01	
 0.0000e+00	 6.8000e+02	 1.4115e-01	
 0.0000e+00	 6.8100e+02	 1.3774e-01	
 0.0000e+00	 6.8200e+02	 1.3626e-01	
 0.0000e+00	 6.8300e+02	 1.3994e-01	
 0.0000e+00	 6.8400e+02	 1.4040e-01	
 0.0000e+00	 6.8500e+02	 1.3068e-01	
 0.0000e+00	 6.8600e+02	 1.3712e-01	
 0.0000e+00	 6.8700e+02	 1.3217e-01	
 0.0000e+00	 6.8800e+02	 1.3207e-01	
 0.0000e+00	 6.8900e+02	 1.3079e-01	
 0.0000e+00	 6.9000e+02	 1.3110e-01	
 0.0000e+00	 6.9100e+02	 1.3057e-01	
 0.0000e+00	 6.9200e+02	 1.2700e-01	
 0.0000e+00	 6.9300e+02	 1.2747e-01	
 0.0000e+00	 6.9400e+02	 1.2778e-01	
 0.0000e+00	 6.9500e+02	 1.2247e-01	
 0.0000e+00	 6.9600e+02	 1.2352e-01	
 0.0000e+00	 6.9700e+02	 1.2137e-01	
 0.0000e+00	 6.9800e+02	 1.2161e-01	
 0.0000e+00	 6.9900e+02	 1.1914e-01	
 0.0000e+00	 7.0000e+02	 1.1824e-01	
 0.0000e+00	 7.0100e+02	 1.2139e-01	
 0.0000e+00	 7.0200e+02	 1.1985e-01	
 0.0000e+00	 7.0300e+02	 1.1667e-01	
 0.0000e+00	 7.0400e+02	 2.1907e+01	
 0.0000e+00	 7.0500e+02	 2.0328e-01	
 0.0000e+00	 7.0600e+02	 2.0201e-01	
 0.0000e+00	 7.0700e+02	 1.9209e-01	
 0.0000e+00	 7.0800e+02	 1.9441e-01	
 0.0000e+00	 7.0900e+02	 1.8593e-01	
 0.0000e+00	 7.1000e+02	 1.8501e-01	
 0.0000e+00	 7.1100e+02	 1.8717e-01	
 0.0000e+00	 7.1200e+02	 1.8838e-01	
 0.0000e+00	 7.1300e+02	 1.8352e-01	
 0.0000e+00	 7.1400e+02	 1.7664e-01	
 0.0000e+00	 7.1500e+02	 1.7941e-01	
 0.0000e+00	 7.1600e+02	 1.8488e-01	
 0.0000e+00	 7.1700e+02	 1.7922e-01	
 0.0000e+00	 7.1800e+02	 1.7330e-01	
 0.0000e+00	 7.1900e+02	 1.7623e-01	
 0.0000e+00	 7.2000e+02	 1.7100e-01	
 0.0000e+00	 7.2100e+02	 1.7375e-01	
 0.0000e+00	 7.2200e+02	 1.6634e-01	
 0.0000e+00	 7.2300e+02	 1.7109e-01	
 0.0000e+00	 7.2400e+02	 1.6803e-01	
 0.0000e+00	 7.2500e+02	 1.6426e-01	
 0.0000e+00	 7.2600e+02	 1.6688e-01	
 0.0000e+00	 7.2700e+02	 1.6359e-01	
 0.0000e+00	 7.2800e+02	 1.9039e+01	
 0.0000e+00	 7.2900e+02	 2.6461e-01	
 0.0000e+00	 7.3000e+02	 2.5655e-01	
 0.0000e+00	 7.3100e+02	 2.6115e-01	
 0.0000e+00	 7.3200e+02	 2.5105e-01	
 0.0000e+00	 7.3300e+02	 2.5089e-01	
 0.0000e+00	 7.3400e+02	 2.4944e-01	
 0.0000e+00	 7.3500e+02	 2.5581e-01	
 0.0000e+00	 7.3600e+02	 2.3937e-01	
 0.0000e+00	 7.3700e+02	 2.3658e-01	
 0.0000e+00	 7.3800e+02	 2.2668e-01	
 0.0000e+00	 7.3900e+02	 2.3366e-01	
 0.0000e+00	 7.4000e+02	 2.3753e-01	
 0.0000e+00	 7.4100e+02	 2.2403e-01	
 0.0000e+00	 7.4200e+02	 2.2663e-01	
 0.0000e+00	 7.4300e+02	 2.2120e-01	
 0.0000e+00	 7.4400e+02	 2.1661e-01	
 0.0000e+00	 7.4500e+02	 2.1370e-01	
 0.0000e+00	 7.4600e+02	 2.1874e-01	
 0.0000e+00	 7.4700e+02	 2.1471e-01	
 0.0000e+00	 7.4800e+02	 2.0741e-01	
 0.0000e+00	 7.4900e+02	 2.0559e-01	
 0.0000e+00	 7.5000e+02	 2.0598e-01	
 0.0000e+00	 7.5100e+02	 2.0452e-01	
 0.0000e+00	 7.5200e+02	 2.0212e-01	
 0.0000e+00	 7.5300e+02	 1.9835e-01	
 0.0000e+00	 7.5400e+02	 1.9990e-01	
 0.0000e+00	 7.5500e+02	 1.9481e-01	
 0.0000e+00	 7.5600e+02	 1.8710e-01	
 0.0000e+00	 7.5700e+02	 1.9122e-01	
 0.0000e+00	 7.5800e+02	 1.8786e-01	
 0.0000e+00	 7.5900e+02	 1.9000e-01	
 0.0000e+00	 7.6000e+02	 1.8780e-01	
 0.0000e+00	 7.6100e+02	 1.7682e-01	
 0.0000e+00	 7.6200e+02	 1.7770e-01	
 0.0000e+00	 7.6300e+02	 1.8030e-01	
 0.0000e+00	 7.6400e+02	 1.8345e-01	
 0.0000e+00	 7.6500e+02	 1.7838e-01	
 0.0000e+00	 7.6600e+02	 1.7783e-01	
 0.0000e+00	 7.6700e+02	 1.8310e+01	
 0.0000e+00	 7.6800e+02	 2.7712e-01	
 0.0000e+00	 7.6900e+02	 2.7646e-01	
 0.0000e+00	 7.7000e+02	 2.8016e-01	
 0.0000e+00	 7.7100e+02	 2.7650e-01	
 0.0000e+00	 7.7200e+02	 2.6921e-01	
 0.0000e+00	 7.7300e+02	 2.6329e-01	
 0.0000e+00	 7.7400e+02	 2.6172e-01	
 0.0000e+00	 7.7500e+02	 2.6020e-01	
 0.0000e+00	 7.7600e+02	 2.4930e-01	
 0.0000e+00	 7.7700e+02	 2.4873e-01	
 0.0000e+00	 7.7800e+02	 2.4514e-01	
 0.0000e+00	 7.7900e+02	 2.4727e-01	
 0.0000e+00	 7.8000e+02	 2.3461e-01	
 0.0000e+00	 7.8100e+02	 2.3214e-01	
 0.0000e+00	 7.8200e+02	 2.3023e-01	
 0.0000e+00	 7.8300e+02	 2.2664e-01	
 0.0000e+00	 7.8400e+02	 2.2941e-01	
 0.0000e+00	 7.8500e+02	 2.2634e-01	
 0.0000e+00	 7.8600e+02	 2.2128e-01	
 0.0000e+00	 7.8700e+02	 2.2123e-01	
 0.0000e+00	 7.8800e+02	 2.1820e-01	
 0.0000e+00	 7.8900e+02	 2.1498e-01	
 0.0000e+00	 7.9000e+02	 2.0851e-01	
 0.0000e+00	 7.9100e+02	 2.1159e-01	
 0.0000e+00	 7.9200e+02	 2.1073e-01	
 0.0000e+00	 7.9300e+02	 2.0937e-01	
 0.0000e+00	 7.9400e+02	 2.0386e-01	
 0.0000e+00	 7.9500e+02	 1.9751e-01	
 0.0000e+00	 7.9600e+02	 2.0087e-01	
 0.0000e+00	 7.9700e+02	 1.9206e-01	
 0.0000e+00	 7.9800e+02	 1.9514e-01	
 0.0000e+00	 7.9900e+02	 1.9213e-01	
 0.0000e+00	 8.0000e+02	 1.8258e-01	
 0.0000e+00	 8.0100e+02	 1.8672e-01	
 0.0000e+00	 8.0200e+02	 1.9375e-01	
 0.0000e+00	 8.0300e+02	 1.8113e-01	
 0.0000e+00	 8.0400e+02	 1.8174e-01	
 0.0000e+00	 8.0500e+02	 1.8235e-01	
 0.0000e+00	 8.0600e+02	 1.8094e-01	
 0.0000e+00	 8.0700e+02	 1.8141e-01	
 0.0000e+00	 8.0800e+02	 1.7867e-01	
 0.0000e+00	 8.0900e+02	 1.7464e-01	
 0.0000e+00	 8.1000e+02	 1.7141e-01	
 0.0000e+00	 8.1100e+02	 1.6636e-01	
 0.0000e+00	 8.1200e+02	 1.8616e+01	
 0.0000e+00	 8.1300e+02	 2.8321e-01	
 0.0000e+00	 8.1400e+02	 2.7888e-01	
 0.0000e+00	 8.1500e+02	 2.7076e-01	
 0.0000e+00	 8.1600e+02	 2.6408e-01	
 0.0000e+00	 8.1700e+02	 2.6553e-01	
 0.0000e+00	 8.1800e+02	 2.5592e-01	
 0.0000e+00	 8.1900e+02	 2.6234e-01	
 0.0000e+00	 8.2000e+02	 2.5382e-01	
 0.0000e+00	 8.2100e+02	 2.4661e-01	
 0.0000e+00	 8.2200e+02	 2.4563e-01	
 0.0000e+00	 8.2300e+02	 2.4335e-01	
 0.0000e+00	 8.2400e+02	 2.4084e-01	
 0.0000e+00	 8.2500e+02	 2.4047e-01	
 0.0000e+00	 8.2600e+02	 2.3865e-01	
 0.0000e+00	 8.2700e+02	 2.2886e-01	
 0.0000e+00	 8.2800e+02	 2.2772e-01	
 0.0000e+00	 8.2900e+02	 2.2301e-01	
 0.0000e+00	 8.3000e+02	 2.2407e-01	
 0.0000e+00	 8.3100e+02	 2.2729e-01	
 0.0000e+00	 8.3200e+02	 2.1716e-01	
 0.0000e+00	 8.3300e+02	 2.2140e-01	
 0.0000e+00	 8.3400e+02	 2.1419e-01	
 0.0000e+00	 8.3500e+02	 2.0856e-01	
 0.0000e+00	 8.3600e+02	 2.0441e-01	
 0.0000e+00	 8.3700e+02	 2.0417e-01	
 0.0000e+00	 8.3800e+02	 1.9993e-01	
 0.0000e+00	 8.3900e+02	 2.0042e-01	
 0.0000e+00	 8.4000e+02	 1.7368e+01	
 0.0000e+00	 8.4100e+02	 3.3208e-01	
 0.0000e+00	 8.4200e+02	 3.2048e-01	
 0.0000e+00	 8.4300e+02	 3.1076e-01	
 0.0000e+00	 8.4400e+02	 3.1273e-01	
 0.0000e+00	 8.4500e+02	 3.0162e-01	
 0.0000e+00	 8.4600e+02	 2.9709e-01	
 0.0000e+00	 8.4700e+02	 2.9341e-01	
 0.0000e+00	 8.4800e+02	 2.9357e-01	
 0.0000e+00	 8.4900e+02	 2.8457e-01	
 0.0000e+00	 8.5000e+02	 2.8376e-01	
 0.0000e+00	 8.5100e+02	 2.7515e-01	
 0.0000e+00	 8.5200e+02	 2.8359e-01	
 0.0000e+00	 8.5300e+02	 2.7439e-01	
 0.0000e+00	 8.5400e+02	 2.6961e-01	
 0.0000e+00	 8.5500e+02	 2.6959e-01	
 0.0000e+00	 8.5600e+02	 2.6311e-01	
 0.0000e+00	 8.5700e+02	 2.5963e-01	
 0.0000e+00	 8.5800e+02	 2.5947e-01	
 0.0000e+00	 8.5900e+02	 2.4970e-01	
 0.0000e+00	 8.6000e+02	 2.4679e-01	
 0.0000e+00	 8.6100e+02	 2.4308e-01	
 0.0000e+00	 8.6200e+02	 1.5520e+01	
 0.0000e+00	 8.6300e+02	 3.7830e-01	
 0.0000e+00	 8.6400e+02	 3.7137e-01	
 0.0000e+00	 8.6500e+02	 3.7128e-01	
 0.0000e+00	 8.6600e+02	 3.5324e-01	
 0.0000e+00	 8.6700e+02	 3.6114e-01	
 0.0000e+00	 8.6800e+02	 3.4614e-01	
 0.0000e+00	 8.6900e+02	 3.3925e-01	
 0.0000e+00	 8.7000e+02	 3.2824e-01	
 0.0000e+00	 8.7100e+02	 3.3489e-01	
 0.0000e+00	 8.7200e+02	 3.2558e-01	
 0.0000e+00	 8.7300e+02	 3.3128e-01	
 0.0000e+00	 8.7400e+02	 3.2208e-01	
 0.0000e+00	 8.7500e+02	 3.0494e-01	
 0.0000e+00	 8.7600e+02	 3.1849e-01	
 0.0000e+00	 8.7700e+02	 2.9990e-01	
 0.0000e+00	 8.7800e+02	 3.0205e-01	
 0.0000e+00	 8.7900e+02	 2.8490e-01	
 0.0000e+00	 8.8000e+02	 2.9587e-01	
 0.0000e+00	 8.8100e+02	 2.8902e-01	
 0.0000e+00	 8.8200e+02	 2.7887e-01	
 0.0000e+00	 8.8300e+02	 2.7932e-01	
 0.0000e+00	 8.8400e+02	 2.7256e-01	
 0.0000e+00	 8.8500e+02	 2.7111e-01	
 0.0000e+00	 8.8600e+02	 2.6309e-01	
 0.0000e+00	 8.8700e+02	 2.6711e-01	
 0.0000e+00	 8.8800e+02	 2.5706e-01	
 0.0000e+00	 8.8900e+02	 2.5270e-01	
 0.0000e+00	 8.9000e+02	 2.5258e-01	
 0.0000e+00	 8.9100e+02	 2.4671e-01	
 0.0000e+00	 8.9200e+02	 2.4645e-01	
 0.0000e+00	 8.9300e+02	 2.4391e-01	
 0.0000e+00	 8.9400e+02	 2.3213e-01	
 0.0000e+00	 8.9500e+02	 2.3021e-01	
 0.0000e+00	 8.9600e+02	 2.3953e-01	
 0.0000e+00	 8.9700e+02	 2.2736e-01	
 0.0000e+00	 8.9800e+02	 2.2942e-01	
 0.0000e+00	 8.9900e+02	 2.2051e-01	
 0.0000e+00	 9.0000e+02	 1.6178e+01	
 0.0000e+00	 9.0100e+02	 3.5625e-01	
 0.0000e+00	 9.0200e+02	 3.4460e-01	
 0.0000e+00	 9.0300e+02	 3.3216e-01	
 0.0000e+00	 9.0400e+02	 3.3391e-01	
 0.0000e+00	 9.0500e+02	 3.2594e-01	
 0.0000e+00	 9.0600e+02	 3.2221e-01	
 0.0000e+00	 9.0700e+02	 3.2032e-01	
 0.0000e+00	 9.0800e+02	 3.1323e-01	
 0.0000e+00	 9.0900e+02	 3.0285e-01	
 0.0000e+00	 9.1000e+02	 3.0290e-01	
 0.0000e+00	 9.1100e+02	 3.0531e-01	
 0.0000e+00	 9.1200e+02	 2.9238e-01	
 0.0000e+00	 9.1300e+02	 2.9927e-01	
 0.0000e+00	 9.1400e+02	 2.8524e-01	
 0.0000e+00	 9.1500e+02	 2.8157e-01	
 0.0000e+00	 9.1600e+02	 2.8715e-01	
 0.0000e+00	 9.1700e+02	 2.7205e-01	
 0.0000e+00	 9.1800e+02	 2.7475e-01	
 0.0000e+00	 9.1900e+02	 2.7273e-01	
 0.0000e+00	 9.2000e+02	 2.6414e-01	
 0.0000e+00	 9.2100e+02	 2.6020e-01	
 0.0000e+00	 9.2200e+02	 2.6160e-01	
 0.0000e+00	 9.2300e+02	 2.6124e-01	
 0.0000e+00	 9.2400e+02	 2.5111e-01	
 0.0000e+00	 9.2500e+02	 2.4925e-01	
 0.0000e+00	 9.2600e+02	 2.4348e-01	
 0.0000e+00	 9.2700e+02	 2.3589e-01	
 0.0000e+00	 9.2800e+02	 2.3454e-01	
 0.0000e+00	 9.2900e+02	 2.3465e-01	
 0.0000e+00	 9.3000e+02	 2.3173e-01	
 0.0000e+00	 9.3100e+02	 2.3129e-01	
 0.0000e+00	 9.3200e+02	 2.2519e-01	
 0.0000e+00	 9.3300e+02	 2.2431e-01	
 0.0000e+00	 9.3400e+02	 2.1735e-01	
 0.0000e+00	 9.3500e+02	 2.2358e-01	
 0.0000e+00	 9.3600e+02	 2.1349e-01	
 0.0000e+00	 9.3700e+02	 2.1557e-01	
 0.0000e+00	 9.3800e+02	 2.1727e-01	
 0.0000e+00	 9.3900e+02	 2.0784e-01	
 0.0000e+00	 9.4000e+02	 1.6610e+01	
 0.0000e+00	 9.4100e+02	 1.2792e+01	
 0.0000e+00	 9.4200e+02	 4.9683e-01	
 0.0000e+00	 9.4300e+02	 4.7500e-01	
 0.0000e+00	 9.4400e+02	 4.6986e-01	
 0.0000e+00	 9.4500e+02	 4.5499e-01	
 0.0000e+00	 9.4600e+02	 4.5434e-01	
 0.0000e+00	 9.4700e+02	 4.4324e-01	
 0.0000e+00	 9.4800e+02	 4.3797e-01	
 0.0000e+00	 9.4900e+02	 4.2874e-01	
 0.0000e+00	 9.5000e+02	 4.2546e-01	
 0.0000e+00	 9.5100e+02	 4.1149e-01	
 0.0000e+00	 9.5200e+02	 4.0337e-01	
 0.0000e+00	 9.5300e+02	 3.9542e-01	
 0.0000e+00	 9.5400e+02	 3.8825e-01	
 0.0000e+00	 9.5500e+02	 3.8177e-01	
 0.0000e+00	 9.5600e+02	 3.7926e-01	
 0.0000e+00	 9.5700e+02	 3.7080e-01	
 0.0000e+00	 9.5800e+02	 3.6051e-01	
 0.0000e+00	 9.5900e+02	 3.6426e-01	
 0.0000e+00	 9.6000e+02	 3.5529e-01	
 0.0000e+00	 9.6100e+02	 3.4139e-01	
 0.0000e+00	 9.6200e+02	 3.3938e-01	
 0.0000e+00	 9.6300e+02	 3.3396e-01	
 0.0000e+00	 9.6400e+02	 3.2643e-01	
 0.0000e+00	 9.6500e+02	 3.3227e-01	
 0.0000e+00	 9.6600e+02	 3.1547e-01	
 0.0000e+00	 9.6700e+02	 3.0784e-01	
 0.0000e+00	 9.6800e+02	 3.0477e-01	
 0.0000e+00	 9.6900e+02	 3.0754e-01	
 0.0000e+00	 9.7000e+02	 2.9836e-01	
 0.0000e+00	 9.7100e+02	 2.8818e-01	
 0.0000e+00	 9.7200e+02	 2.9375e-01	
 0.0000e+00	 9.7300e+02	 2.9079e-01	
 0.0000e+00	 9.7400e+02	 2.8017e-01	
 0.0000e+00	 9.7500e+02	 2.7247e-01	
 0.0000e+00	 9.7600e+02	 2.7386e-01	
 0.0000e+00	 9.7700e+02	 2.6968e-01	
 0.0000e+00	 9.7800e+02	 2.6685e-01	
 0.0000e+00	 9.7900e+02	 2.6806e-01	
 0.0000e+00	 9.8000e+02	 2.5596e-01	
 0.0000e+00	 9.8100e+02	 2.5945e-01	
 0.0000e+00	 9.8200e+02	 2.5019e-01	
 0.0000e+00	 9.8300e+02	 2.5226e-01	
 0.0000e+00	 9.8400e+02	 2.4548e-01	
 0.0000e+00	 9.8500e+02	 2.4632e-01	
 0.0000e+00	 9.8600e+02	 2.4311e-01	
 0.0000e+00	 9.8700e+02	 2.4232e-01	
 0.0000e+00	 9.8800e+02	 2.3646e-01	
 0.0000e+00	 9.8900e+02	 2.3092e-01	
 0.0000e+00	 9.9000e+02	 2.3026e-01	
 0.0000e+00	 9.9100e+02	 2.2538e-01	
 0.0000e+00	 9.9200e+02	 2.2221e-01	
 0.0000e+00	 9.9300e+02	 2.1667e-01	
 0.0000e+00	 9.9400e+02	 2.2214e-01	
 0.0000e+00	 9.9500e+02	 2.1362e-01	
 0.0000e+00	 9.9600e+02	 2.1439e-01	
 0.0000e+00	 9.9700e+02	 2.1086e-01	
 0.0000e+00	 9.9800e+02	 2.0860e-01	
 0.0000e+00	 9.9900e+02	 2.0530e-01	
 0.0000e+00	 1.0000e+03	 2.0218e-01	
 0.0000e+00	 1.0010e+03	 2.0547e-01	
 0.0000e+00	 1.0020e+03	 1.9661e-01	
 0.0000e+00	 1.0030e+03	 1.9239e-01	
 0.0000e+00	 1.0040e+03	 1.9297e-01	
 0.0000e+00	 1.0050e+03	 1.8884e-01	
 0.0000e+00	 1.0060e+03	 1.9254e-01	
 0.0000e+00	 1.0070e+03	 1.9245e-01	
 0.0000e+00	 1.0080e+03	 1.8775e-01	
 0.0000e+00	 1.0090e+03	 1.9111e-01	
 0.0000e+00	 1.0100e+03	 1.8031e+01	
 0.0000e+00	 1.0110e+03	 3.0208e-01	
 0.0000e+00	 1.0120e+03	 2.9941e-01	
 0.0000e+00	 1.0130e+03	 2.8868e-01	
 0.0000e+00	 1.0140e+03	 2.8700e-01	
 0.0000e+00	 1.0150e+03	 2.8419e-01	
 0.0000e+00	 1.0160e+03	 2.8255e-01	
 0.0000e+00	 1.0170e+03	 2.6877e-01	
 0.0000e+00	 1.0180e+03	 2.6685e-01	
 0.0000e+00	 1.0190e+03	 2.6429e-01	
 0.0000e+00	 1.0200e+03	 2.6425e-01	
 0.0000e+00	 1.0210e+03	 2.6308e-01	
 0.0000e+00	 1.0220e+03	 2.5480e-01	
 0.0000e+00	 1.0230e+03	 2.4817e-01	
 0.0000e+00	 1.0240e+03	 2.5097e-01	
 0.0000e+00	 1.0250e+03	 2.4973e-01	
 0.0000e+00	 1.0260e+03	 2.4322e-01	
 0.0000e+00	 1.0270e+03	 2.3902e-01	
 0.0000e+00	 1.0280e+03	 2.3678e-01	
 0.0000e+00	 1.0290e+03	 2.3890e-01	
 0.0000e+00	 1.0300e+03	 2.3305e-01	
 0.0000e+00	 1.0310e+03	 2.2884e-01	
 0.0000e+00	 1.0320e+03	 2.2939e-01	
 0.0000e+00	 1.0330e+03	 2.2368e-01	
 0.0000e+00	 1.0340e+03	 2.2401e-01	
 0.0000e+00	 1.0350e+03	 2.1716e-01	
 0.0000e+00	 1.0360e+03	 2.1630e-01	
 0.0000e+00	 1.0370e+03	 2.1568e-01	
 0.0000e+00	 1.0380e+03	 2.1284e-01	
 0.0000e+00	 1.0390e+03	 2.0231e-01	
 0.0000e+00	 1.0400e+03	 2.0429e-01	
 0.0000e+00	 1.0410e+03	 2.0218e-01	
 0.0000e+00	 1.0420e+03	 1.9987e-01	
 0.0000e+00	 1.0430e+03	 2.0436e-01	
 0.0000e+00	 1.0440e+03	 1.9999e-01	
 0.0000e+00	 1.0450e+03	 1.9411e-01	
 0.0000e+00	 1.0460e+03	 1.9183e-01	
 0.0000e+00	 1.0470e+03	 1.8964e-01	
 0.0000e+00	 1.0480e+03	 1.9304e-01	
 0.0000e+00	 1.0490e+03	 1.8688e-01	
 0.0000e+00	 1.0500e+03	 1.8399e-01	
 0.0000e+00	 1.0510e+03	 1.8449e-01	
 0.0000e+00	 1.0520e+03	 1.8606e-01	
 0.0000e+00	 1.0530e+03	 1.7868e-01	
 0.0000e+00	 1.0540e+03	 1.7648e-01	
 0.0000e+00	 1.0550e+03	 1.7448e-01	
 0.0000e+00	 1.0560e+03	 1.8067e-01	
 0.0000e+00	 1.0570e+03	 1.6764e-01	
 0.0000e+00	 1.0580e+03	 1.6903e-01	
 0.0000e+00	 1.0590e+03	 1.6549e-01	
 0.0000e+00	 1.0600e+03	 1.6970e-01	
 0.0000e+00	 1.0610e+03	 1.7113e-01	
 0.0000e+00	 1.0620e+03	 1.6523e-01	
 0.0000e+00	 1.0630e+03	 1.6502e-01	
 0.0000e+00	 1.0640e+03	 1.6136e-01	
 0.0000e+00	 1.0650e+03	 1.5910e-01	
 0.0000e+00	 1.0660e+03	 1.5616e-01	
 0.0000e+00	 1.0670e+03	 1.5643e-01	
 0.0000e+00	 1.0680e+03	 1.5953e-01	
 0.0000e+00	 1.0690e+03	 1.5450e-01	
 0.0000e+00	 1.0700e+03	 1.5369e-01	
 0.0000e+00	 1.0710e+03	 1.5181e-01	
 0.0000e+00	 1.0720e+03	 1.4902e-01	
 0.0000e+00	 1.0730e+03	 1.4799e-01	
 0.0000e+00	 1.0740e+03	 1.4809e-01	
 0.0000e+00	 1.0750e+03	 1.9910e+01	
 0.0000e+00	 1.0760e+03	 2.4562e-01	
 0.0000e+00	 1.0770e+03	 2.5034e-01	
 0.0000e+00	 1.0780e+03	 2.4424e-01	
 0.0000e+00	 1.0790e+03	 2.3401e-01	
 0.0000e+00	 1.0800e+03	 2.4231e-01	
 0.0000e+00	 1.0810e+03	 2.3527e-01	
 0.0000e+00	 1.0820e+03	 2.2279e-01	
 0.0000e+00	 1.0830e+03	 2.2696e-01	
 0.0000e+00	 1.0840e+03	 2.2723e-01	
 0.0000e+00	 1.0850e+03	 2.1625e-01	
 0.0000e+00	 1.0860e+03	 2.1891e-01	
 0.0000e+00	 1.0870e+03	 2.1437e-01	
 0.0000e+00	 1.0880e+03	 2.1460e-01	
 0.0000e+00	 1.0890e+03	 2.1456e-01	
 0.0000e+00	 1.0900e+03	 2.0591e-01	
 0.0000e+00	 1.0910e+03	 2.0674e-01	
 0.0000e+00	 1.0920e+03	 2.0537e-01	
 0.0000e+00	 1.0930e+03	 2.0601e-01	
 0.0000e+00	 1.0940e+03	 1.9317e-01	
 0.0000e+00	 1.0950e+03	 1.9970e-01	
 0.0000e+00	 1.0960e+03	 1.9828e-01	
 0.0000e+00	 1.0970e+03	 1.9349e-01	
 0.0000e+00	 1.0980e+03	 1.9363e-01	
 0.0000e+00	 1.0990e+03	 1.8886e-01	
 0.0000e+00	 1.1000e+03	 1.9142e-01	
 0.0000e+00	 1.1010e+03	 1.8396e-01	
 0.0000e+00	 1.1020e+03	 1.8182e-01	
 0.0000e+00	 1.1030e+03	 1.8500e-01	
 0.0000e+00	 1.1040e+03	 1.8229e-01	
 0.0000e+00	 1.1050e+03	 1.7766e-01	
 0.0000e+00	 1.1060e+03	 1.7791e-01	
 0.0000e+00	 1.1070e+03	 1.7416e-01	
 0.0000e+00	 1.1080e+03	 1.7474e-01	
 0.0000e+00	 1.1090e+03	 1.6996e-01	
 0.0000e+00	 1.1100e+03	 1.6589e-01	
 0.0000e+00	 1.1110e+03	 1.7465e-01	
 0.0000e+00	 1.1120e+03	 1.6548e-01	
 0.0000e+00	 1.1130e+03	 1.6042e-01	
 0.0000e+00	 1.1140e+03	 1.6357e-01	
 0.0000e+00	 1.1150e+03	 1.6052e-01	
 0.0000e+00	 1.1160e+03	 1.6178e-01	
 0.0000e+00	 1.1170e+03	 1.6462e-01	
 0.0000e+00	 1.1180e+03	 1.6216e-01	
 0.0000e+00	 1.1190e+03	 1.5706e-01	
 0.0000e+00	 1.1200e+03	 1.5301e-01	
 0.0000e+00	 1.1210e+03	 1.5489e-01	
 0.0000e+00	 1.1220e+03	 1.5107e-01	
 0.0000e+00	 1.1230e+03	 1.5385e-01	
 0.0000e+00	 1.1240e+03	 1.5452e-01	
