000 (4561.000.000) 05/18 16:24:17 Job submitted from host: <10.33.133.57:9618?addrs=10.33.133.57-9618+[--1]-9618&noUDP&sock=1379_7530_4>
...
001 (4561.000.000) 05/18 16:24:31 Job executing on host: <10.33.133.164:9618?addrs=10.33.133.164-9618+[--1]-9618&noUDP&sock=1201_5d55_3>
...
006 (4561.000.000) 05/18 16:24:39 Image size of job updated: 203896
	200  -  MemoryUsage of job (MB)
	203896  -  ResidentSetSize of job (KB)
...
006 (4561.000.000) 05/18 16:29:39 Image size of job updated: 967640
	944  -  MemoryUsage of job (MB)
	966604  -  ResidentSetSize of job (KB)
...
006 (4561.000.000) 05/18 16:39:39 Image size of job updated: 968164
	945  -  MemoryUsage of job (MB)
	967128  -  ResidentSetSize of job (KB)
...
006 (4561.000.000) 05/18 16:44:40 Image size of job updated: 968188
	945  -  MemoryUsage of job (MB)
	967152  -  ResidentSetSize of job (KB)
...
006 (4561.000.000) 05/18 16:49:41 Image size of job updated: 969668
	946  -  MemoryUsage of job (MB)
	968632  -  ResidentSetSize of job (KB)
...
006 (4561.000.000) 05/18 17:54:46 Image size of job updated: 969880
	947  -  MemoryUsage of job (MB)
	968864  -  ResidentSetSize of job (KB)
...
006 (4561.000.000) 05/18 20:25:02 Image size of job updated: 970188
	947  -  MemoryUsage of job (MB)
	969172  -  ResidentSetSize of job (KB)
...
006 (4561.000.000) 05/18 21:25:09 Image size of job updated: 970500
	947  -  MemoryUsage of job (MB)
	969172  -  ResidentSetSize of job (KB)
...
010 (4561.000.000) 05/18 22:10:44 Job was suspended.
	Number of processes actually suspended: 5
...
011 (4561.000.000) 05/18 22:25:46 Job was unsuspended.
...
004 (4561.000.000) 05/18 22:25:46 Job was evicted.
	(0) Job was not checkpointed.
		Usr 0 05:32:42, Sys 0 00:07:00  -  Run Remote Usage
		Usr 0 00:00:00, Sys 0 00:00:00  -  Run Local Usage
	0  -  Run Bytes Sent By Job
	0  -  Run Bytes Received By Job
	Partitionable Resources :    Usage  Request Allocated
	   Cpus                 :                 4         4
	   Disk (KB)            :        3        3   4166173
	   Gpus                 :                           0
	   Memory (MB)          :      947     4096      4096
...
001 (4561.000.000) 05/18 22:30:31 Job executing on host: <10.33.137.142:9618?addrs=10.33.137.142-9618+[--1]-9618&noUDP&sock=1170_19e5_3>
...
006 (4561.000.000) 05/18 22:35:39 Image size of job updated: 3536796
	3073  -  MemoryUsage of job (MB)
	3146360  -  ResidentSetSize of job (KB)
...
004 (4561.000.000) 05/19 00:03:59 Job was evicted.
	(0) Job was not checkpointed.
		Usr 0 03:03:50, Sys 0 00:04:12  -  Run Remote Usage
		Usr 0 00:00:00, Sys 0 00:00:00  -  Run Local Usage
	0  -  Run Bytes Sent By Job
	0  -  Run Bytes Received By Job
	Partitionable Resources :    Usage  Request Allocated
	   Cpus                 :                 4         4
	   Disk (KB)            :        3        3   4263325
	   Gpus                 :                           0
	   Memory (MB)          :     3073     4096      4096
...
001 (4561.000.000) 05/19 00:06:46 Job executing on host: <10.33.137.127:9618?addrs=10.33.137.127-9618+[--1]-9618&noUDP&sock=1147_5337_3>
...
009 (4561.000.000) 05/19 04:47:23 Job was aborted by the user.
	The system macro SYSTEM_PERIODIC_REMOVE expression '( JobStatus == 5 && CurrentTime - EnteredCurrentStatus > 3600 * 24 * 30 ) || ( ProportionalSetSizeKb > ( 1024 * My.RequestMemory ) ) || ( ( JobStatus == 2 ) && ( ( RemoteWallClockTime - CumulativeSuspensionTime ) > My.RequestWalltime ) )' evaluated to TRUE
...
