<?xml version="1.0" encoding="UTF-8" standalone="no"?>
<svg
   xmlns:dc="http://purl.org/dc/elements/1.1/"
   xmlns:cc="http://creativecommons.org/ns#"
   xmlns:rdf="http://www.w3.org/1999/02/22-rdf-syntax-ns#"
   xmlns:svg="http://www.w3.org/2000/svg"
   xmlns="http://www.w3.org/2000/svg"
   width="10.133152cm"
   height="3.190794cm"
   viewBox="0 0 95.644544 30.117188"
   preserveAspectRatio="none"
   version="1.1"
   id="svg1778">
  <metadata
     id="metadata1784">
    <rdf:RDF>
      <cc:Work
         rdf:about="">
        <dc:format>image/svg+xml</dc:format>
        <dc:type
           rdf:resource="http://purl.org/dc/dcmitype/StillImage" />
        <dc:title></dc:title>
      </cc:Work>
    </rdf:RDF>
  </metadata>
  <defs
     id="defs1782">
    <rect
       x="39.353851"
       y="6.5163636"
       width="36.413448"
       height="19.453335"
       id="rect1788" />
  </defs>
  <text
     xml:space="preserve"
     id="text1786"
     style="font-style:normal;font-variant:normal;font-weight:normal;font-stretch:normal;font-size:9.98937px;line-height:1.25;font-family:'Liberation Mono';-inkscape-font-specification:'Liberation Mono';letter-spacing:0.00749203px;word-spacing:0px;white-space:pre;shape-inside:url(#rect1788);fill:#000000;fill-opacity:1;stroke:none;"
     transform="translate(-3.4343388,-2.9968111)" />
  <g
     aria-label="2B C6 DE D5 12
CF B0 69 10 56
8C FB 1D 8F 60
B5 03 1D 60 B5"
     id="text1794"
     style="font-style:normal;font-variant:normal;font-weight:normal;font-stretch:normal;font-size:6.65958px;line-height:1.25;font-family:'Liberation Mono';-inkscape-font-specification:'Liberation Mono';letter-spacing:0.00749203px;word-spacing:0px;fill:#000000;fill-opacity:1;stroke:none;stroke-width:0.249734"
     transform="translate(5.4941536)">
    <path
       id="path1976"
       style="font-style:normal;font-variant:normal;font-weight:normal;font-stretch:normal;font-size:6.65958px;font-family:monospace;-inkscape-font-specification:monospace;stroke-width:0.249734"
       d="m 36.183594,0 c -0.21028,0 -0.423842,0.02783545 -0.640625,0.08203125 -0.214616,0.05419581 -0.432964,0.1340106 -0.65625,0.24023437 V 0.984375 c 0.242797,-0.14524475 0.47267,-0.25268029 0.689453,-0.32421875 0.216783,-0.0715385 0.423821,-0.10742187 0.621094,-0.10742187 0.277482,0 0.494091,0.0765527 0.652343,0.23046874 0.16042,0.15391609 0.242188,0.36769288 0.242188,0.63867188 0,0.1712587 -0.03936,0.339151 -0.115235,0.5039062 -0.07587,0.1625875 -0.222669,0.3761495 -0.439453,0.640625 -0.114895,0.1344057 -0.323457,0.3640637 -0.626953,0.6914063 -0.303496,0.3273427 -0.657115,0.7057496 -1.0625,1.1328125 v 0.5527344 h 2.949219 V 4.390625 h -2.230469 c 0.472588,-0.4964335 0.822944,-0.8698399 1.052735,-1.1191406 0.231958,-0.2493007 0.407898,-0.4450284 0.529297,-0.5859375 0.216783,-0.2514685 0.373365,-0.4813412 0.46875,-0.6894531 0.09755,-0.2081119 0.146484,-0.4149351 0.146484,-0.6230469 0,-0.4097203 -0.145058,-0.740719 -0.435547,-0.99218752 C 37.039803,0.12722302 36.658349,0 36.183594,0 Z m 12.730468,0 c -0.654685,0 -1.155315,0.21508612 -1.5,0.64648438 -0.344685,0.43139852 -0.515624,1.05577412 -0.515624,1.87304682 -10e-7,0.8151049 0.170939,1.4396952 0.515624,1.8710938 0.344685,0.4313986 0.845315,0.6464844 1.5,0.6464844 0.184266,0 0.360421,-0.019573 0.527344,-0.058594 0.166923,-0.039021 0.324814,-0.097739 0.476563,-0.1757812 V 3.7363281 C 49.753213,3.8880764 49.593584,3.998774 49.4375,4.0703125 c -0.153916,0.069371 -0.31376,0.1054687 -0.478516,0.1054687 -0.351188,0 -0.616945,-0.138533 -0.796875,-0.4160156 -0.177762,-0.2796503 -0.265625,-0.6939407 -0.265625,-1.2402344 0,-0.5484615 0.08786,-0.9607987 0.265625,-1.2382812 0.17993,-0.2796503 0.445687,-0.41992188 0.796875,-0.41992188 0.164756,0 0.3246,0.0358834 0.478516,0.10742188 0.156084,0.0693707 0.315713,0.1802831 0.480469,0.3320312 V 0.234375 C 49.770556,0.15633304 49.612451,0.09761472 49.443359,0.05859375 49.274269,0.01957277 49.098328,0 48.914062,0 Z m 39.488282,0 c -0.21028,0 -0.421889,0.02783545 -0.638672,0.08203125 -0.214615,0.05419581 -0.434917,0.1340106 -0.658203,0.24023437 V 0.984375 c 0.242797,-0.14524475 0.47267,-0.25268029 0.689453,-0.32421875 0.216783,-0.0715385 0.423821,-0.10742187 0.621094,-0.10742187 0.277482,0 0.496045,0.0765527 0.654296,0.23046874 0.160421,0.15391609 0.240235,0.36769288 0.240235,0.63867188 0,0.1712587 -0.03741,0.339151 -0.113281,0.5039062 -0.07587,0.1625875 -0.22267,0.3761495 -0.439454,0.640625 -0.114894,0.1344057 -0.323456,0.3640637 -0.626953,0.6914063 -0.303496,0.3273427 -0.659068,0.7057496 -1.064453,1.1328125 v 0.5527344 h 2.949219 V 4.390625 h -2.230469 c 0.472588,-0.4964335 0.824898,-0.8698399 1.054688,-1.1191406 0.231958,-0.2493007 0.407898,-0.4450284 0.529297,-0.5859375 0.216783,-0.2514685 0.373365,-0.4813412 0.46875,-0.6894531 0.09755,-0.2081119 0.146484,-0.4149351 0.146484,-0.6230469 0,-0.4097203 -0.145058,-0.740719 -0.435547,-0.99218752 C 89.260507,0.12722302 88.877099,0 88.402344,0 Z M 52.810547,0.00585938 c -0.654685,0 -1.145314,0.21029994 -1.472656,0.63085937 -0.327343,0.41839155 -0.492188,1.04950615 -0.492188,1.89062505 0,0.8844754 0.133747,1.5251616 0.400391,1.921875 0.268811,0.3967132 0.699197,0.59375 1.291015,0.59375 0.485595,0 0.862263,-0.1500579 1.128907,-0.4492188 0.26881,-0.2991608 0.402343,-0.719546 0.402343,-1.2636719 0,-0.5072727 -0.11896,-0.8985134 -0.357421,-1.1738281 -0.238462,-0.2774825 -0.57577,-0.4160156 -1.013672,-0.4160156 -0.214616,0 -0.402295,0.035883 -0.560547,0.1074218 -0.158252,0.069371 -0.286784,0.1735441 -0.388672,0.3144532 0.0087,-0.4552448 0.10132,-0.799292 0.28125,-1.03125 0.182098,-0.23412587 0.448068,-0.3496094 0.794922,-0.3496094 0.145244,0 0.295088,0.0243586 0.451172,0.0742188 0.158251,0.0476923 0.322881,0.1192444 0.49414,0.21679685 V 0.20117188 C 53.604776,0.13613691 53.441884,0.08720498 53.279297,0.0546875 53.118877,0.02217001 52.962295,0.00585938 52.810547,0.00585938 Z M 38.910156,0.08789062 V 4.9433594 h 1.4375 c 0.57014,0 0.998788,-0.1126508 1.28711,-0.3359375 0.288322,-0.2254546 0.43164,-0.557977 0.43164,-0.9980469 0,-0.3468531 -0.09134,-0.6321821 -0.273437,-0.8554688 C 41.613039,2.5284514 41.365546,2.391442 41.046875,2.34375 c 0.283986,-0.043357 0.49581,-0.1490538 0.636719,-0.3203125 0.143077,-0.1712587 0.214844,-0.406132 0.214844,-0.703125 0,-0.3923776 -0.135486,-0.69554088 -0.404297,-0.91015625 C 41.225329,0.19554087 40.84409,0.08789062 40.347656,0.08789062 Z m 19.990235,0 V 4.9433594 h 0.984375 c 0.741398,0 1.287482,-0.1974662 1.638672,-0.5898438 0.351188,-0.3945454 0.527343,-1.0058725 0.527343,-1.8339844 0,-0.8324475 -0.176155,-1.4452983 -0.527343,-1.8398437 -0.35119,-0.39454544 -0.897274,-0.59179688 -1.638672,-0.59179688 z m 4.210937,0 V 4.9433594 h 2.94336 V 4.390625 H 63.769531 V 2.6308594 h 2.125 V 2.078125 h -2.125 v -1.4375 h 2.222657 V 0.08789062 Z m 7.839844,0 V 4.9433594 h 1.027344 c 0.793426,0 1.36387,-0.1909419 1.71289,-0.5703125 0.349021,-0.3815384 0.523438,-1.0026519 0.523438,-1.8632813 0,-0.8584614 -0.174417,-1.4763128 -0.523438,-1.8535156 -0.34902,-0.37937062 -0.919464,-0.56835938 -1.71289,-0.56835938 z m 4.199219,0 V 2.7988281 c 0.175594,-0.084546 0.348272,-0.1463113 0.519531,-0.1875 0.173427,-0.043357 0.346319,-0.064453 0.517578,-0.064453 0.290489,0 0.521886,0.076553 0.695312,0.2304688 0.175595,0.1517482 0.263672,0.3537855 0.263672,0.6074218 0,0.2753147 -0.08808,0.4856147 -0.263672,0.6308594 -0.175594,0.1430769 -0.433302,0.2148438 -0.771484,0.2148438 -0.190769,-10e-8 -0.381496,-0.021096 -0.572266,-0.064453 C 75.350461,4.1204911 75.166258,4.0537248 74.986328,3.9648438 V 4.828125 c 0.221119,0.069371 0.437943,0.1215647 0.650391,0.15625 0.212447,0.034685 0.422747,0.052734 0.630859,0.052734 0.559301,0 1.001212,-0.1485342 1.324219,-0.4433594 0.325175,-0.296993 0.488281,-0.6995438 0.488281,-1.2089844 0,-0.4855944 -0.150057,-0.8800973 -0.449219,-1.1835937 -0.29916,-0.3034966 -0.690616,-0.4550781 -1.171875,-0.4550781 -0.09972,0 -0.192368,0.00826 -0.28125,0.023437 -0.08888,0.013007 -0.173911,0.034104 -0.251953,0.064453 V 0.93359375 h 1.861328 V 0.08789062 Z m 9.296875,0 L 83.355469,0.328125 V 0.92578125 L 84.455078,0.6796875 V 4.390625 h -1.021484 v 0.5527344 h 2.679687 V 4.390625 H 85.105469 V 0.08789062 Z m -44.876954,0.5390625 h 0.763672 c 0.32084,0 0.550713,0.0556709 0.689454,0.1640625 0.140909,0.10839161 0.210937,0.28433188 0.210937,0.52929688 0,0.270979 -0.07177,0.466492 -0.214844,0.5878906 -0.140909,0.1213986 -0.369043,0.1835938 -0.685547,0.1835938 h -0.763672 z m 19.990235,0 h 0.310547 c 0.554964,10e-9 0.94142,0.13700943 1.158203,0.41015628 0.218951,0.270979 0.328125,0.7648694 0.328125,1.4824218 0,0.711049 -0.109174,1.2034157 -0.328125,1.4765626 -0.218951,0.2709789 -0.605407,0.40625 -1.158203,0.40625 H 59.560547 Z M 71.910156,0.953125 h 0.259766 c 0.377203,0 0.646221,0.1172219 0.80664,0.3535156 0.160421,0.2362938 0.240235,0.6373209 0.240235,1.203125 0,0.5701399 -0.07981,0.9744291 -0.240235,1.2128906 C 72.816143,3.95895 72.547125,4.078125 72.169922,4.078125 H 71.910156 Z M 52.511719,2.5097656 c 0.208112,0 0.367956,0.076767 0.478515,0.2285156 0.112728,0.1517483 0.167969,0.3683578 0.167969,0.6523438 0,0.283986 -0.05524,0.5025486 -0.167969,0.6542969 -0.110559,0.1495804 -0.270403,0.2246093 -0.478515,0.2246093 -0.208112,0 -0.367957,-0.075029 -0.478516,-0.2246093 C 51.924812,3.8931736 51.871094,3.674611 51.871094,3.390625 c 0,-0.2861539 0.05372,-0.5027634 0.162109,-0.6523438 0.110559,-0.1517482 0.270404,-0.2285156 0.478516,-0.2285156 z M 39.570312,2.625 h 0.777344 c 0.364196,0 0.631476,0.073076 0.802735,0.2226562 0.171258,0.1474126 0.255859,0.3807621 0.255859,0.6972657 0,0.3056643 -0.08155,0.5257507 -0.244141,0.6601562 -0.162587,0.1322378 -0.432914,0.1972657 -0.814453,0.1972657 h -0.777344 z m -2.800781,5.7324219 c -0.617832,0 -1.100412,0.2235631 -1.447265,0.6679687 -0.344686,0.4422378 -0.517578,1.0600884 -0.517578,1.8535154 0,0.797762 0.171154,1.415399 0.513671,1.855469 0.344686,0.44007 0.829004,0.660156 1.451172,0.660156 0.197273,0 0.382999,-0.02283 0.558594,-0.06836 0.175594,-0.04336 0.346749,-0.108385 0.513672,-0.197266 v -0.673828 c -0.158252,0.132237 -0.329407,0.233364 -0.513672,0.302734 -0.182098,0.06937 -0.367824,0.103516 -0.558594,0.103516 -0.427062,0 -0.746536,-0.16463 -0.958984,-0.49414 -0.212447,-0.329511 -0.320313,-0.824925 -0.320313,-1.488282 0,-0.665524 0.107866,-1.1646299 0.320313,-1.4941404 0.212448,-0.3295105 0.531922,-0.4941406 0.958984,-0.4941406 0.186434,0 0.370422,0.036098 0.554688,0.1054688 0.184266,0.069371 0.357159,0.1685434 0.517578,0.3007812 V 8.625 C 37.674874,8.5361189 37.503719,8.4691379 37.328125,8.4257812 37.15253,8.3802566 36.966804,8.3574219 36.769531,8.3574219 Z m 15.654297,0 c -0.535455,0 -0.936482,0.2102999 -1.203125,0.6308593 -0.266643,0.4183916 -0.400391,1.0495058 -0.400391,1.8906248 10e-7,0.838951 0.133748,1.468112 0.400391,1.888672 0.266643,0.418391 0.66767,0.626953 1.203125,0.626953 0.537622,0 0.940388,-0.208562 1.207031,-0.626953 0.266644,-0.418392 0.398438,-1.047553 0.398438,-1.888672 0,-0.843287 -0.131794,-1.4741863 -0.398438,-1.8925779 C 53.364216,8.5679365 52.96145,8.3574219 52.423828,8.3574219 Z m 8.306641,0 c -0.598322,0 -1.056543,0.2170389 -1.373047,0.6484375 -0.314335,0.4292308 -0.470703,1.0536066 -0.470703,1.8730466 0,0.869301 0.130271,1.504772 0.392578,1.910156 0.262308,0.403217 0.676598,0.605469 1.240234,0.605469 0.479092,0 0.850759,-0.143318 1.115235,-0.43164 0.264475,-0.288322 0.396484,-0.696088 0.396484,-1.220703 0,-0.526784 -0.128747,-0.932597 -0.386719,-1.21875 -0.255804,-0.288322 -0.617685,-0.431641 -1.085937,-0.431641 -0.238462,0 -0.450501,0.05872 -0.634766,0.175781 -0.184266,0.114895 -0.327585,0.279311 -0.43164,0.496094 -10e-7,-0.609161 0.10765,-1.0686917 0.322265,-1.3808595 0.214615,-0.3143357 0.529089,-0.4726563 0.945313,-0.4726563 0.166922,0 0.326552,0.02305 0.480468,0.066406 0.153916,0.041189 0.300927,0.1014308 0.4375,0.1816406 V 8.5527344 c -0.14958,-0.062867 -0.306377,-0.1100608 -0.466796,-0.1425782 -0.16042,-0.034685 -0.32005,-0.052734 -0.480469,-0.052734 z m 3.666015,0 c -0.481258,0 -0.854665,0.1452721 -1.11914,0.4335937 -0.262308,0.2861539 -0.392578,0.6904428 -0.392578,1.2128904 0,0.528951 0.127008,0.936288 0.382812,1.22461 0.257972,0.288321 0.621593,0.433593 1.089844,0.433593 0.238462,0 0.4505,-0.05698 0.634766,-0.171875 0.184265,-0.117063 0.325846,-0.285169 0.427734,-0.501953 0,0.609162 -0.10765,1.070431 -0.322266,1.384766 -0.212447,0.312168 -0.525182,0.46875 -0.941406,0.46875 -0.166923,0 -0.328506,-0.02131 -0.482422,-0.0625 -0.153916,-0.04336 -0.298973,-0.103384 -0.435547,-0.183594 v 0.603516 c 0.149581,0.06286 0.304425,0.112011 0.464844,0.144531 0.160419,0.03469 0.320264,0.05078 0.478516,0.05078 0.600489,0 1.058711,-0.2153 1.373047,-0.644531 0.316503,-0.431399 0.474609,-1.053821 0.474609,-1.871094 0,-0.869301 -0.132223,-1.5067245 -0.394531,-1.9121091 -0.262308,-0.4053846 -0.674645,-0.609375 -1.238282,-0.609375 z m 12.128907,0 c -0.535455,0 -0.936482,0.2102999 -1.203125,0.6308593 -0.266644,0.4183916 -0.400391,1.0495058 -0.400391,1.8906248 0,0.838951 0.133747,1.468112 0.400391,1.888672 0.266643,0.418391 0.66767,0.626953 1.203125,0.626953 0.537622,0 0.938434,-0.208562 1.205078,-0.626953 0.266643,-0.418392 0.40039,-1.047553 0.40039,-1.888672 0,-0.843287 -0.133747,-1.4741863 -0.40039,-1.8925779 C 77.463825,8.5679365 77.063013,8.3574219 76.525391,8.3574219 Z m 12.324218,0 c -0.598321,0 -1.056543,0.2170389 -1.373047,0.6484375 -0.314335,0.4292308 -0.470703,1.0536066 -0.470703,1.8730466 0,0.869301 0.13027,1.504772 0.392579,1.910156 0.262307,0.403217 0.674644,0.605469 1.238281,0.605469 0.47909,0 0.850759,-0.143318 1.115234,-0.43164 0.264476,-0.288322 0.398438,-0.696088 0.398438,-1.220703 0,-0.526784 -0.1307,-0.932596 -0.388672,-1.21875 -0.255805,-0.288322 -0.617686,-0.431641 -1.085938,-0.431641 -0.238462,0 -0.448547,0.05872 -0.632812,0.175781 -0.184266,0.114895 -0.329538,0.279311 -0.433594,0.496094 0,-0.609161 0.10765,-1.0686917 0.322266,-1.3808595 0.214615,-0.3143357 0.531041,-0.4726563 0.947265,-0.4726563 0.166924,1e-7 0.326553,0.02305 0.480469,0.066406 0.153916,0.041189 0.298974,0.1014308 0.435547,0.1816406 V 8.5527344 C 89.645341,8.4898671 89.490497,8.4426736 89.330078,8.4101562 89.169659,8.3754709 89.010029,8.3574219 88.849609,8.3574219 Z M 46.810547,8.4394531 V 13.300781 H 48.375 c 0.635175,0 1.093181,-0.106127 1.375,-0.316406 0.281818,-0.21028 0.421875,-0.549326 0.421875,-1.017578 0,-0.381538 -0.0946,-0.678177 -0.283203,-0.890625 -0.186433,-0.212447 -0.463285,-0.336194 -0.833984,-0.373047 0.31,-0.02818 0.544658,-0.131046 0.705078,-0.306641 C 49.920185,10.22089 50,9.9781838 50,9.6660156 50,9.2584632 49.86299,8.9518231 49.589844,8.7480469 49.318865,8.5421028 48.914791,8.4394531 48.375,8.4394531 Z m -7.683594,0.00586 v 4.8554685 h 0.660156 V 10.982422 H 41.78125 V 10.429688 H 39.787109 V 8.9980469 h 2.199219 V 8.4453125 Z m 33.068359,0 -1.003906,0.2402344 v 0.8652343 l 0.998047,-0.2460937 v 3.1503905 h -1.072265 v 0.845703 h 3.078124 V 12.455078 H 73.123047 V 8.4453125 Z m 11.033204,0 v 2.4394535 c 0.151748,-0.08021 0.311593,-0.140668 0.478515,-0.179688 0.166924,-0.04119 0.338077,-0.06055 0.513672,-0.06055 0.362028,0 0.644095,0.09612 0.845703,0.289063 0.203776,0.192936 0.304688,0.46174 0.304688,0.808594 0,0.351188 -0.09765,0.623683 -0.294922,0.814453 -0.195105,0.190769 -0.47391,0.285156 -0.835938,0.285156 -0.21028,0 -0.415579,-0.0261 -0.617187,-0.07813 -0.201609,-0.0542 -0.402122,-0.135749 -0.601563,-0.244141 V 13.1875 c 0.169092,0.06937 0.359819,0.121563 0.572266,0.15625 0.214615,0.03469 0.451012,0.05078 0.708984,0.05078 0.535455,0 0.95584,-0.146581 1.263672,-0.441406 0.31,-0.294825 0.464844,-0.69933 0.464844,-1.210937 0,-0.507273 -0.146582,-0.908085 -0.441406,-1.205079 -0.294826,-0.296992 -0.694329,-0.445312 -1.197266,-0.445312 -0.09539,0 -0.189771,0.0081 -0.285156,0.02539 -0.09322,0.01517 -0.188033,0.03953 -0.28125,0.07422 V 8.9980469 H 85.6875 V 8.4453125 Z m -18.81836,0.4257813 c 0.279651,0 0.497998,0.1011259 0.65625,0.3027343 0.16042,0.2016084 0.240235,0.4804131 0.240235,0.8359379 0,0.355524 -0.07981,0.634329 -0.240235,0.835937 -0.158252,0.201609 -0.376599,0.302734 -0.65625,0.302735 -0.292657,-1e-6 -0.512744,-0.09634 -0.660156,-0.28711 -0.145245,-0.190769 -0.21875,-0.47436 -0.21875,-0.851562 0,-0.3750352 0.07329,-0.6588405 0.220703,-0.8496098 0.147413,-0.192937 0.367714,-0.2890624 0.658203,-0.2890624 z M 52.423828,9.1699219 c 0.223287,0 0.386393,0.1372241 0.488281,0.4082031 0.101888,0.270979 0.152344,0.704627 0.152344,1.300781 0,0.593986 -0.05046,1.025897 -0.152344,1.296875 -0.101888,0.27098 -0.264994,0.40625 -0.488281,0.40625 -0.221119,0 -0.382486,-0.13527 -0.484375,-0.40625 -0.101888,-0.270978 -0.152344,-0.702889 -0.152344,-1.296875 0,-0.596154 0.05046,-1.029802 0.152344,-1.300781 0.101889,-0.270979 0.263256,-0.4082031 0.484375,-0.4082031 z m 24.101563,0 c 0.223286,0 0.386393,0.1372241 0.488281,0.4082031 0.101888,0.270979 0.152344,0.704627 0.152344,1.300781 0,0.593986 -0.05046,1.025897 -0.152344,1.296875 -0.101888,0.27098 -0.264995,0.40625 -0.488281,0.40625 -0.221119,0 -0.382487,-0.13527 -0.484375,-0.40625 -0.101888,-0.270978 -0.154297,-0.702889 -0.154297,-1.296875 0,-0.596154 0.05241,-1.029802 0.154297,-1.300781 0.101888,-0.270979 0.263256,-0.4082031 0.484375,-0.4082031 z M 47.736328,9.203125 H 48.375 c 0.238462,0 0.409617,0.04567 0.513672,0.1367188 0.106224,0.088881 0.158203,0.2322 0.158203,0.4316406 0,0.1994403 -0.05219,0.3429746 -0.15625,0.4296876 -0.101888,0.08671 -0.272828,0.130859 -0.515625,0.130859 h -0.638672 z m 4.6875,1.267578 c -0.112727,0 -0.209067,0.03915 -0.287109,0.117188 -0.07804,0.07804 -0.117188,0.17612 -0.117188,0.291015 0,0.114896 0.03915,0.211021 0.117188,0.289063 0.07804,0.07587 0.174382,0.113281 0.287109,0.113281 0.114895,0 0.211021,-0.03915 0.289063,-0.117188 0.07804,-0.07804 0.117187,-0.172428 0.117187,-0.285156 0,-0.114895 -0.03914,-0.212973 -0.117187,-0.291015 -0.07804,-0.07804 -0.174168,-0.117188 -0.289063,-0.117188 z m 24.101563,0 c -0.112728,0 -0.209068,0.03915 -0.28711,0.117188 -0.07804,0.07804 -0.117187,0.17612 -0.117187,0.291015 0,0.114896 0.03915,0.211021 0.117187,0.289063 0.07804,0.07587 0.174382,0.113281 0.28711,0.113281 0.114895,0 0.21102,-0.03915 0.289062,-0.117188 0.07804,-0.07804 0.117188,-0.172428 0.117188,-0.285156 0,-0.114895 -0.03915,-0.212973 -0.117188,-0.291015 -0.07804,-0.07804 -0.174167,-0.117188 -0.289062,-0.117188 z m -16.019532,0.134766 c 0.29049,0 0.508838,0.09439 0.65625,0.285156 0.147412,0.190769 0.222657,0.47436 0.222657,0.851563 0,0.375034 -0.07525,0.660578 -0.222657,0.853515 -0.147412,0.190769 -0.36576,0.285156 -0.65625,0.285156 -0.27965,0 -0.499737,-0.101125 -0.660156,-0.302734 -0.16042,-0.201608 -0.240234,-0.480413 -0.240234,-0.835937 0,-0.355525 0.07981,-0.63433 0.240234,-0.835938 0.160419,-0.201609 0.380506,-0.300781 0.660156,-0.300781 z m 28.119141,0 c 0.290489,0 0.508837,0.09439 0.65625,0.285156 0.147413,0.190769 0.220703,0.47436 0.220703,0.851563 0,0.375034 -0.07329,0.660578 -0.220703,0.853515 -0.147413,0.190769 -0.365761,0.285156 -0.65625,0.285156 -0.279651,0 -0.499737,-0.101125 -0.660156,-0.302734 -0.16042,-0.201608 -0.240235,-0.480413 -0.240235,-0.835937 0,-0.355525 0.07981,-0.63433 0.240235,-0.835938 0.160419,-0.201609 0.380505,-0.300781 0.660156,-0.300781 z M 47.736328,11.095703 H 48.375 c 0.294825,0 0.50491,0.05698 0.632812,0.171875 0.127902,0.114895 0.191407,0.304098 0.191407,0.566406 0,0.257972 -0.06003,0.438913 -0.183594,0.542969 -0.121399,0.104056 -0.33496,0.15625 -0.640625,0.15625 h -0.638672 z m -11.380859,5.619141 c -0.450909,0 -0.806052,0.114175 -1.06836,0.341797 -0.262308,0.225454 -0.394531,0.532094 -0.394531,0.917968 0,0.275315 0.07829,0.509973 0.234375,0.705079 0.158252,0.195104 0.3766,0.328851 0.65625,0.40039 -0.325175,0.07154 -0.57462,0.216596 -0.748047,0.435547 -0.171258,0.216783 -0.255859,0.49885 -0.255859,0.845703 0,0.435735 0.138533,0.776305 0.416015,1.023438 0.279651,0.244965 0.665891,0.367187 1.160157,0.367187 0.494266,0 0.882459,-0.122007 1.162109,-0.369141 0.279651,-0.247132 0.417969,-0.591394 0.417969,-1.029296 0,-0.344686 -0.08634,-0.625014 -0.259766,-0.841797 -0.171258,-0.216784 -0.418966,-0.360103 -0.74414,-0.431641 0.27965,-0.07154 0.498213,-0.205286 0.654297,-0.40039 0.158251,-0.195106 0.236328,-0.429764 0.236328,-0.705079 0,-0.385874 -0.13027,-0.692514 -0.392578,-0.917968 -0.262308,-0.227622 -0.621142,-0.341797 -1.074219,-0.341797 z m 4.429687,0 c -0.617832,0 -1.100412,0.223563 -1.447265,0.667968 -0.344686,0.442238 -0.515625,1.060089 -0.515625,1.853516 0,0.797762 0.171154,1.415399 0.513672,1.855469 0.344685,0.44007 0.82705,0.660156 1.449218,0.660156 0.197273,0 0.384952,-0.02283 0.560547,-0.06836 0.175594,-0.04336 0.346749,-0.108385 0.513672,-0.197266 V 20.8125 c -0.158252,0.132238 -0.329407,0.233364 -0.513672,0.302734 -0.182098,0.06937 -0.369777,0.103516 -0.560547,0.103516 -0.427063,0 -0.746537,-0.16463 -0.958984,-0.494141 -0.212447,-0.32951 -0.31836,-0.824924 -0.31836,-1.488281 0,-0.665525 0.105913,-1.162677 0.31836,-1.492187 0.212447,-0.32951 0.531921,-0.496094 0.958984,-0.496094 0.186434,0 0.372375,0.0361 0.556641,0.105469 0.184265,0.06937 0.357158,0.170496 0.517578,0.302734 v -0.673828 c -0.166923,-0.08888 -0.338078,-0.155866 -0.513672,-0.199219 -0.175595,-0.04553 -0.363274,-0.06836 -0.560547,-0.06836 z m 31.722656,0 c -0.450909,0 -0.808005,0.117436 -1.070312,0.351562 -0.262308,0.234126 -0.392578,0.553814 -0.392578,0.957032 0,0.262307 0.0635,0.483917 0.191406,0.666015 0.127902,0.17993 0.315582,0.311939 0.560547,0.396485 -0.273147,0.08021 -0.486708,0.227005 -0.640625,0.439453 -0.153916,0.212448 -0.232422,0.468417 -0.232422,0.767578 0,0.466084 0.138748,0.826442 0.414063,1.080078 0.275314,0.253637 0.664816,0.378906 1.169921,0.378906 0.507273,0 0.898514,-0.125269 1.173829,-0.378906 0.275314,-0.253636 0.414062,-0.613994 0.414062,-1.080078 0,-0.296994 -0.07677,-0.551225 -0.228515,-0.763672 -0.151749,-0.212447 -0.362049,-0.360981 -0.63086,-0.443359 0.240629,-0.08671 0.423094,-0.220461 0.548828,-0.400391 0.125734,-0.182098 0.189453,-0.40197 0.189453,-0.662109 0,-0.403218 -0.13027,-0.722906 -0.392578,-0.957032 -0.262308,-0.234126 -0.621142,-0.351562 -1.074219,-0.351562 z m 12.324219,0 c -0.598321,0 -1.056543,0.217039 -1.373047,0.648437 -0.314335,0.429231 -0.470703,1.053606 -0.470703,1.873047 0,0.869301 0.13027,1.506725 0.392578,1.91211 0.262308,0.403216 0.676598,0.603515 1.240235,0.603515 0.47909,0 0.850759,-0.143318 1.115234,-0.431641 0.264475,-0.288321 0.396485,-0.694134 0.396484,-1.21875 10e-7,-0.526783 -0.128746,-0.934549 -0.386718,-1.220703 -0.255804,-0.288321 -0.617686,-0.43164 -1.085938,-0.43164 -0.238462,0 -0.4505,0.05872 -0.634765,0.175781 -0.184266,0.114895 -0.327585,0.279311 -0.431641,0.496094 0,-0.609161 0.105697,-1.068692 0.320312,-1.38086 0.214616,-0.314335 0.531042,-0.472656 0.947266,-0.472656 0.166923,0 0.326553,0.02305 0.480469,0.06641 0.153916,0.04119 0.298973,0.101431 0.435547,0.181641 v -0.605469 c -0.149581,-0.06286 -0.304425,-0.110058 -0.464844,-0.142578 -0.160419,-0.03469 -0.320049,-0.05273 -0.480469,-0.05273 z m 3.744141,0 c -0.518111,0 -0.909352,0.213777 -1.173828,0.638672 -0.264476,0.424895 -0.396485,1.052532 -0.396485,1.882812 0,0.828111 0.132009,1.454011 0.396485,1.878906 0.264476,0.424896 0.655717,0.636719 1.173828,0.636719 0.518112,0 0.909352,-0.211823 1.173828,-0.636719 0.266643,-0.424895 0.400391,-1.050795 0.400391,-1.878906 0,-0.83028 -0.133748,-1.457917 -0.400391,-1.882812 -0.264476,-0.424895 -0.655716,-0.638672 -1.173828,-0.638672 z m -37.75,0.08203 v 4.861328 h 1.564453 c 0.635175,0 1.093182,-0.104173 1.375,-0.314453 0.281818,-0.210279 0.423828,-0.551279 0.423828,-1.019531 0,-0.381538 -0.0946,-0.678177 -0.283203,-0.890625 -0.186433,-0.212448 -0.465238,-0.336194 -0.835938,-0.373047 0.310001,-0.02818 0.544659,-0.131046 0.705079,-0.306641 0.160419,-0.175594 0.242187,-0.418301 0.242187,-0.730468 0,-0.407553 -0.137009,-0.714193 -0.410156,-0.917969 -0.270979,-0.205944 -0.677006,-0.308594 -1.216797,-0.308594 z m -3.830078,0.0059 v 4.855469 h 0.958984 v -2.117187 h 1.878906 v -0.845704 h -1.878906 v -1.046874 h 2.064453 v -0.845704 z m 13.351562,0 -1.09375,0.242188 v 0.597656 l 1.09961,-0.248047 v 3.710938 h -1.021485 v 0.552734 h 2.679688 v -0.552734 h -1.007813 v -4.302735 z m 2.56836,0 v 4.855469 h 0.986328 c 0.741398,0 1.287483,-0.195513 1.638672,-0.587891 0.351188,-0.394546 0.527343,-1.005873 0.527343,-1.833984 0,-0.832448 -0.176155,-1.447251 -0.527343,-1.841797 -0.351189,-0.394545 -0.897274,-0.591797 -1.638672,-0.591797 z m 12.197265,0 v 4.855469 h 0.958985 v -2.117187 h 1.880859 v -0.845704 h -1.880859 v -1.046874 h 2.066406 v -0.845704 z m -38.757812,0.419922 c 0.266643,0 0.468895,0.07024 0.605469,0.208985 0.138741,0.138741 0.207031,0.339039 0.207031,0.603515 0,0.26014 -0.06829,0.45913 -0.207031,0.595703 -0.138742,0.136574 -0.340994,0.205079 -0.605469,0.205079 -0.262308,0 -0.462821,-0.0685 -0.601563,-0.205079 -0.138741,-0.136573 -0.207031,-0.335563 -0.207031,-0.595703 0,-0.262308 0.06829,-0.462821 0.207031,-0.601562 0.138742,-0.140909 0.339255,-0.210938 0.601563,-0.210938 z m 52.220703,0.01367 c 0.307833,0 0.535967,0.164631 0.685547,0.494141 0.151748,0.32951 0.228515,0.831663 0.228515,1.505859 0,0.672028 -0.07677,1.172443 -0.228515,1.501953 -0.14958,0.329511 -0.377714,0.494141 -0.685547,0.494141 -0.305664,0 -0.535752,-0.16463 -0.6875,-0.494141 -0.149581,-0.32951 -0.222656,-0.829925 -0.222656,-1.501953 0,-0.674196 0.07308,-1.176349 0.222656,-1.505859 0.151748,-0.32951 0.381836,-0.494141 0.6875,-0.494141 z m -25,0.107422 h 0.3125 c 0.554965,0 0.94142,0.13701 1.158203,0.410156 0.218951,0.27098 0.328125,0.764869 0.328125,1.482422 0,0.711049 -0.109174,1.203416 -0.328125,1.476563 -0.218951,0.270979 -0.605406,0.40625 -1.158203,0.40625 h -0.3125 z m 8.93164,0.146484 c 0.19077,0 0.340828,0.05546 0.449219,0.166016 0.11056,0.108391 0.166016,0.256711 0.166016,0.445312 0,0.190769 -0.05546,0.342351 -0.166016,0.455079 -0.108391,0.110559 -0.258449,0.166015 -0.449219,0.166015 -0.188601,0 -0.338658,-0.05546 -0.449218,-0.166015 -0.108392,-0.112728 -0.16211,-0.26431 -0.16211,-0.455079 0,-0.186433 0.05546,-0.334753 0.166016,-0.445312 0.110559,-0.110559 0.258878,-0.166016 0.445312,-0.166016 z m -20.753906,0.07031 h 0.636719 c 0.238462,0 0.409616,0.04567 0.513672,0.136719 0.106223,0.08888 0.160156,0.234153 0.160156,0.433593 0,0.199441 -0.05219,0.341021 -0.15625,0.427735 -0.101888,0.08671 -0.274781,0.130859 -0.517578,0.130859 h -0.636719 z m 36.814453,1.220703 c -0.117062,0 -0.216235,0.04219 -0.300781,0.128906 -0.08238,0.08671 -0.125,0.189363 -0.125,0.308594 0,0.125734 0.04088,0.230122 0.121094,0.3125 0.08238,0.08238 0.183289,0.125 0.304687,0.125 0.123567,0 0.227955,-0.04241 0.3125,-0.126953 0.08671,-0.08454 0.13086,-0.189148 0.13086,-0.310547 0,-0.119231 -0.04415,-0.22188 -0.13086,-0.308594 -0.08671,-0.08671 -0.191101,-0.128906 -0.3125,-0.128906 z m -3.960937,0.181641 c 0.290489,0 0.508837,0.09439 0.65625,0.285156 0.147413,0.190769 0.222656,0.476312 0.222656,0.853515 0,0.375035 -0.07524,0.658626 -0.222656,0.851563 -0.147413,0.190769 -0.365761,0.285156 -0.65625,0.285156 -0.279651,0 -0.499737,-0.101126 -0.660156,-0.302734 -0.16042,-0.201609 -0.240235,-0.47846 -0.240235,-0.833985 0,-0.355524 0.07981,-0.634328 0.240235,-0.835937 0.160419,-0.201608 0.380505,-0.302734 0.660156,-0.302734 z m -48.251953,0.390625 c 0.290489,0 0.517314,0.08134 0.677734,0.246093 0.162587,0.164756 0.242188,0.396366 0.242188,0.69336 0,0.303496 -0.07981,0.536417 -0.240235,0.701172 -0.158252,0.162587 -0.384862,0.24414 -0.679687,0.24414 -0.288322,0 -0.513194,-0.08134 -0.675781,-0.246093 -0.160421,-0.166924 -0.240235,-0.400059 -0.240235,-0.699219 0,-0.299161 0.07808,-0.530772 0.236328,-0.69336 0.16042,-0.164754 0.38703,-0.246093 0.679688,-0.246093 z m 15.398437,0.09961 h 0.636719 c 0.294825,0 0.506864,0.05893 0.634766,0.173828 0.127902,0.114895 0.191406,0.302145 0.191406,0.564453 0,0.257972 -0.06198,0.438913 -0.185547,0.542969 -0.121399,0.104055 -0.33496,0.15625 -0.640625,0.15625 h -0.636719 z m 20.753906,0.03906 c 0.216783,0 0.3912,0.0685 0.523438,0.205078 0.132238,0.134405 0.199219,0.313822 0.199219,0.537109 0,0.218951 -0.06677,0.398368 -0.201172,0.537109 -0.132237,0.138742 -0.306869,0.207032 -0.521485,0.207032 -0.214615,0 -0.387293,-0.0685 -0.519531,-0.205078 -0.132238,-0.136575 -0.199219,-0.315776 -0.199219,-0.539063 10e-7,-0.223287 0.06698,-0.402704 0.199219,-0.537109 0.132238,-0.136574 0.304916,-0.205078 0.519531,-0.205078 z M 48.40625,25.074219 c -0.535455,0 -0.936482,0.2103 -1.203125,0.630859 -0.266643,0.418391 -0.400391,1.047553 -0.400391,1.888672 0,0.838951 0.133748,1.468113 0.400391,1.888672 0.266643,0.418391 0.66767,0.628906 1.203125,0.628906 0.537622,0 0.940388,-0.210515 1.207031,-0.628906 0.266644,-0.418391 0.400391,-1.047553 0.400391,-1.888672 0,-0.843287 -0.133747,-1.474187 -0.400391,-1.892578 -0.266643,-0.418391 -0.669409,-0.626953 -1.207031,-0.626953 z m 3.851562,0 c -0.19944,0 -0.408216,0.01783 -0.625,0.05469 -0.216783,0.03469 -0.436869,0.08514 -0.660156,0.152344 v 0.871094 c 0.223287,-0.08671 0.440326,-0.151739 0.648438,-0.197266 0.208112,-0.04553 0.401886,-0.06836 0.583984,-0.06836 0.238461,0 0.422665,0.05045 0.552734,0.152343 0.132239,0.09972 0.199219,0.239992 0.199219,0.419922 0,0.171259 -0.06698,0.305006 -0.199219,0.400391 -0.130069,0.09322 -0.314273,0.138672 -0.552734,0.138672 h -0.513672 v 0.845703 h 0.513672 c 0.277482,0 0.492783,0.0685 0.644531,0.205078 0.151748,0.134406 0.228516,0.326871 0.228516,0.576172 0,0.203776 -0.07677,0.364929 -0.228516,0.486328 -0.151748,0.119231 -0.357048,0.179688 -0.617187,0.179688 -0.26014,0 -0.5098,-0.0261 -0.746094,-0.07813 -0.236293,-0.0542 -0.45638,-0.132487 -0.660156,-0.234375 v 0.890625 c 0.216783,0.07804 0.443393,0.1385 0.679687,0.179687 0.238462,0.04119 0.481598,0.0625 0.726563,0.0625 0.574475,0 1.011171,-0.123961 1.3125,-0.371094 0.301329,-0.247132 0.453125,-0.605752 0.453125,-1.076172 0,-0.351189 -0.09134,-0.634994 -0.273438,-0.849609 -0.182098,-0.216782 -0.446116,-0.355316 -0.792968,-0.416015 0.305664,-0.05636 0.540322,-0.175324 0.705078,-0.357422 0.164755,-0.184266 0.246093,-0.420663 0.246093,-0.708985 10e-7,-0.392377 -0.14158,-0.700541 -0.427734,-0.923828 -0.286154,-0.223287 -0.685658,-0.333984 -1.197266,-0.333984 z m 24.267579,0 c -0.535455,0 -0.936482,0.2103 -1.203125,0.630859 -0.266644,0.418391 -0.400391,1.047553 -0.400391,1.888672 0,0.838951 0.133747,1.468113 0.400391,1.888672 0.266643,0.418391 0.66767,0.628906 1.203125,0.628906 0.537622,0 0.938434,-0.210515 1.205078,-0.628906 0.266643,-0.418391 0.40039,-1.047553 0.40039,-1.888672 0,-0.843287 -0.133747,-1.474187 -0.40039,-1.892578 -0.266644,-0.418391 -0.667456,-0.626953 -1.205078,-0.626953 z m -3.63086,0.0059 c -0.654685,0 -1.145313,0.2103 -1.472656,0.63086 -0.327343,0.418392 -0.490234,1.047553 -0.490234,1.888671 0,0.884476 0.131794,1.525162 0.398437,1.921875 0.268811,0.396714 0.699198,0.595704 1.291016,0.595704 0.485594,-10e-7 0.862263,-0.150059 1.128906,-0.449219 0.268811,-0.299162 0.404297,-0.7215 0.404297,-1.265625 0,-0.507273 -0.120914,-0.898514 -0.359375,-1.173828 -0.238461,-0.277483 -0.57577,-0.416016 -1.013672,-0.416016 -0.214616,0 -0.400342,0.03588 -0.558594,0.107422 -0.158252,0.06937 -0.288737,0.175497 -0.390625,0.316406 0.0087,-0.455245 0.103273,-0.799292 0.283203,-1.03125 0.182098,-0.234126 0.446116,-0.351562 0.792969,-0.351562 0.145245,0 0.295088,0.02631 0.451172,0.07617 0.158251,0.04769 0.322882,0.119244 0.494141,0.216796 v -0.871093 c -0.164755,-0.06503 -0.327647,-0.113965 -0.490235,-0.146485 -0.160419,-0.03252 -0.317002,-0.04883 -0.46875,-0.04883 z m -38.001953,0.08203 v 4.853516 h 1.4375 c 0.57014,0 0.998788,-0.110698 1.28711,-0.333984 0.288322,-0.225455 0.433593,-0.557977 0.433593,-0.998047 0,-0.346854 -0.09134,-0.632182 -0.273437,-0.855469 -0.17993,-0.225453 -0.429376,-0.362463 -0.748047,-0.410156 0.283986,-0.04336 0.495809,-0.151007 0.636719,-0.322266 0.143076,-0.171259 0.214843,-0.404178 0.214843,-0.701172 0,-0.392377 -0.133532,-0.697494 -0.402343,-0.912109 -0.268812,-0.214615 -0.652005,-0.320313 -1.148438,-0.320313 z m 4.150391,0 v 2.4375 c 0.151748,-0.08021 0.311592,-0.138714 0.478515,-0.177734 0.166923,-0.04119 0.338078,-0.0625 0.513672,-0.0625 0.362028,0 0.644095,0.09613 0.845703,0.289063 0.203776,0.192937 0.304688,0.463694 0.304688,0.810546 0,0.35119 -0.09765,0.621732 -0.294922,0.8125 -0.195105,0.19077 -0.473909,0.28711 -0.835937,0.28711 -0.21028,0 -0.417532,-0.0261 -0.619141,-0.07813 -0.201608,-0.0542 -0.402122,-0.135749 -0.601563,-0.244141 v 0.666016 c 0.169091,0.06937 0.359818,0.121563 0.572266,0.15625 0.214615,0.03469 0.451012,0.05273 0.708984,0.05273 0.535455,0 0.957793,-0.148535 1.265625,-0.443359 0.31,-0.294826 0.464844,-0.697376 0.464844,-1.208985 0,-0.507272 -0.146581,-0.910038 -0.441406,-1.207031 -0.294825,-0.296993 -0.694329,-0.445312 -1.197266,-0.445312 -0.09538,0 -0.191724,0.0081 -0.287109,0.02539 -0.09322,0.01517 -0.18608,0.04148 -0.279297,0.07617 v -1.193359 h 1.861328 v -0.552735 z m 21.304687,0 -1.09375,0.240235 V 26 l 1.09961,-0.246094 v 3.708985 h -1.021485 v 0.552734 h 2.679688 v -0.552734 h -1.007813 v -4.300782 z m 2.56836,0 v 4.853516 h 0.986328 c 0.741398,0 1.287483,-0.195513 1.638672,-0.587891 0.351188,-0.394545 0.527343,-1.005872 0.527343,-1.833984 0,-0.832447 -0.176155,-1.445298 -0.527343,-1.839844 -0.351189,-0.394545 -0.897274,-0.591797 -1.638672,-0.591797 z m 20.179687,0 v 4.853516 h 1.4375 c 0.57014,0 0.998787,-0.110698 1.287109,-0.333984 0.288322,-0.225455 0.431641,-0.557977 0.431641,-0.998047 0,-0.346854 -0.08939,-0.632182 -0.271484,-0.855469 -0.17993,-0.225453 -0.429376,-0.362463 -0.748047,-0.410156 0.283986,-0.04336 0.495809,-0.151007 0.636719,-0.322266 0.143076,-0.171259 0.214843,-0.404178 0.214843,-0.701172 0,-0.392377 -0.135485,-0.697494 -0.404296,-0.912109 -0.268811,-0.214615 -0.650051,-0.320313 -1.146485,-0.320313 z m 4.150391,0 v 2.4375 c 0.151748,-0.08021 0.311593,-0.138714 0.478515,-0.177734 0.166924,-0.04119 0.338078,-0.0625 0.513672,-0.0625 0.362028,0 0.642142,0.09613 0.84375,0.289063 0.203777,0.192937 0.306641,0.463694 0.306641,0.810546 0,0.35119 -0.0996,0.621732 -0.296875,0.8125 -0.195105,0.19077 -0.471957,0.28711 -0.833985,0.28711 -0.210279,0 -0.417531,-0.0261 -0.61914,-0.07813 -0.201609,-0.0542 -0.402123,-0.135749 -0.601563,-0.244141 v 0.666016 c 0.169091,0.06937 0.359819,0.121563 0.572266,0.15625 0.214615,0.03469 0.451012,0.05273 0.708984,0.05273 0.535455,0 0.957793,-0.148535 1.265625,-0.443359 0.31,-0.294826 0.464844,-0.697376 0.464844,-1.208985 0,-0.507272 -0.146581,-0.910038 -0.441406,-1.207031 -0.294825,-0.296993 -0.694328,-0.445312 -1.197266,-0.445312 -0.09538,0 -0.191724,0.0081 -0.287109,0.02539 -0.09322,0.01517 -0.18608,0.04148 -0.279297,0.07617 v -1.193359 h 1.859375 v -0.552735 z m -51.69336,0.539063 h 0.763672 c 0.32084,0 0.550712,0.05372 0.689453,0.162109 0.140909,0.108392 0.210938,0.286286 0.210938,0.53125 0,0.27098 -0.06981,0.466492 -0.212891,0.587891 -0.140909,0.121399 -0.370996,0.181641 -0.6875,0.18164 h -0.763672 z m 28.023438,0 h 0.3125 c 0.554965,0 0.94142,0.137009 1.158203,0.410156 0.218951,0.270979 0.328125,0.76487 0.328125,1.482422 0,0.711049 -0.109174,1.203416 -0.328125,1.476562 -0.218951,0.27098 -0.605406,0.40625 -1.158203,0.40625 h -0.3125 z m 20.179687,0 h 0.763672 c 0.32084,0 0.550712,0.05372 0.689453,0.162109 0.14091,0.108392 0.210938,0.286286 0.210938,0.53125 0,0.27098 -0.07177,0.466492 -0.214844,0.587891 -0.140909,0.121399 -0.369043,0.18164 -0.685547,0.18164 H 83.755859 Z M 48.40625,25.886719 c 0.223287,0 0.386393,0.135271 0.488281,0.40625 0.101888,0.270979 0.152344,0.704628 0.152344,1.300781 0,0.593986 -0.05046,1.025896 -0.152344,1.296875 -0.101888,0.270979 -0.264994,0.40625 -0.488281,0.40625 -0.221119,0 -0.382487,-0.135271 -0.484375,-0.40625 -0.101888,-0.270979 -0.152344,-0.702889 -0.152344,-1.296875 0,-0.596153 0.05046,-1.029802 0.152344,-1.300781 0.101888,-0.270979 0.263256,-0.40625 0.484375,-0.40625 z m 28.119141,0 c 0.223286,0 0.386393,0.135271 0.488281,0.40625 0.101888,0.270979 0.152344,0.704628 0.152344,1.300781 0,0.593986 -0.05046,1.025896 -0.152344,1.296875 -0.101888,0.270979 -0.264995,0.40625 -0.488281,0.40625 -0.221119,0 -0.382487,-0.135271 -0.484375,-0.40625 -0.101888,-0.270979 -0.154297,-0.702889 -0.154297,-1.296875 0,-0.596153 0.05241,-1.029802 0.154297,-1.300781 0.101888,-0.270979 0.263256,-0.40625 0.484375,-0.40625 z M 48.40625,27.1875 c -0.112727,0 -0.207114,0.03915 -0.285156,0.117188 -0.07804,0.07804 -0.117188,0.174167 -0.117188,0.289062 0,0.114895 0.03915,0.211021 0.117188,0.289062 0.07804,0.07587 0.172429,0.113282 0.285156,0.113282 0.114895,0 0.211021,-0.03915 0.289062,-0.117188 0.07804,-0.07804 0.117188,-0.172429 0.117188,-0.285156 0,-0.114895 -0.03915,-0.21102 -0.117188,-0.289062 C 48.617271,27.226646 48.521145,27.1875 48.40625,27.1875 Z m 28.119141,0 c -0.112728,0 -0.209068,0.03915 -0.28711,0.117188 -0.07804,0.07804 -0.117187,0.174167 -0.117187,0.289062 0,0.114895 0.03915,0.211021 0.117187,0.289062 0.07804,0.07587 0.174382,0.113282 0.28711,0.113282 0.114895,0 0.21102,-0.03915 0.289062,-0.117188 0.07804,-0.07804 0.117188,-0.172429 0.117188,-0.285156 0,-0.114895 -0.03915,-0.211021 -0.117188,-0.289062 -0.07804,-0.07804 -0.174167,-0.117188 -0.289062,-0.117188 z m -3.929688,0.396484 c 0.208112,0 0.367956,0.07481 0.478516,0.226563 0.112727,0.151748 0.167969,0.370311 0.167969,0.654297 -10e-7,0.283986 -0.05524,0.502549 -0.167969,0.654297 -0.11056,0.14958 -0.270404,0.224609 -0.478516,0.224609 -0.208112,0 -0.367956,-0.07503 -0.478515,-0.224609 -0.108393,-0.151748 -0.16211,-0.370311 -0.16211,-0.654297 0,-0.286154 0.05372,-0.504717 0.16211,-0.654297 0.110559,-0.151749 0.270403,-0.226563 0.478515,-0.226563 z m -37.042969,0.113282 h 0.777344 c 0.364196,0 0.631476,0.07503 0.802734,0.224609 0.171259,0.147413 0.257813,0.378809 0.257813,0.695313 0,0.305664 -0.08155,0.52575 -0.244141,0.660156 -0.162587,0.132238 -0.434867,0.199218 -0.816406,0.199218 h -0.777344 z m 48.203125,0 h 0.777344 c 0.364196,0 0.631476,0.07503 0.802735,0.224609 0.171258,0.147413 0.257812,0.378809 0.257812,0.695313 0,0.305664 -0.08155,0.52575 -0.244141,0.660156 -0.162587,0.132238 -0.434867,0.199218 -0.816406,0.199218 h -0.777344 z" />
  </g>
  <g
     id="QRcode-4"
     transform="scale(1.0385156)">
    <rect
       x="0"
       y="0"
       width="29"
       height="29"
       fill="#ffffff"
       id="rect1857" />
    <path
       style="stroke:#000000"
       transform="translate(0,0.5)"
       d="m 0,0 h 1 m 0,0 h 1 m 0,0 h 1 m 0,0 h 1 m 0,0 h 1 m 0,0 h 1 m 0,0 h 1 m 2,0 h 1 m 1,0 h 1 m 1,0 h 1 m 2,0 h 1 m 1,0 h 1 m 0,0 h 1 m 2,0 h 1 m 0,0 h 1 m 0,0 h 1 m 0,0 h 1 m 0,0 h 1 m 0,0 h 1 m 0,0 h 1 M 0,1 h 1 m 5,0 h 1 m 1,0 h 1 m 0,0 h 1 m 0,0 h 1 m 1,0 h 1 m 2,0 h 1 m 2,0 h 1 m 3,0 h 1 m 5,0 h 1 M 0,2 h 1 m 1,0 h 1 m 0,0 h 1 m 0,0 h 1 m 1,0 h 1 m 2,0 h 1 m 0,0 h 1 m 3,0 h 1 m 0,0 h 1 m 2,0 h 1 m 0,0 h 1 m 0,0 h 1 m 1,0 h 1 m 1,0 h 1 m 0,0 h 1 m 0,0 h 1 m 1,0 h 1 M 0,3 h 1 m 1,0 h 1 m 0,0 h 1 m 0,0 h 1 m 1,0 h 1 m 1,0 h 1 m 1,0 h 1 m 1,0 h 1 m 0,0 h 1 m 0,0 h 1 m 0,0 h 1 m 3,0 h 1 m 2,0 h 1 m 1,0 h 1 m 0,0 h 1 m 0,0 h 1 m 1,0 h 1 M 0,4 h 1 m 1,0 h 1 m 0,0 h 1 m 0,0 h 1 m 1,0 h 1 m 2,0 h 1 m 1,0 h 1 m 2,0 h 1 m 3,0 h 1 m 0,0 h 1 m 2,0 h 1 m 1,0 h 1 m 0,0 h 1 m 0,0 h 1 m 1,0 h 1 M 0,5 h 1 m 5,0 h 1 m 1,0 h 1 m 0,0 h 1 m 0,0 h 1 m 2,0 h 1 m 1,0 h 1 m 2,0 h 1 m 1,0 h 1 m 1,0 h 1 m 5,0 h 1 M 0,6 h 1 m 0,0 h 1 m 0,0 h 1 m 0,0 h 1 m 0,0 h 1 m 0,0 h 1 m 0,0 h 1 m 1,0 h 1 m 1,0 h 1 m 1,0 h 1 m 1,0 h 1 m 1,0 h 1 m 1,0 h 1 m 1,0 h 1 m 1,0 h 1 m 0,0 h 1 m 0,0 h 1 m 0,0 h 1 m 0,0 h 1 m 0,0 h 1 m 0,0 h 1 M 9,7 h 1 m 2,0 h 1 m 1,0 h 1 m 0,0 h 1 m 0,0 h 1 m 3,0 h 1 M 0,8 h 1 m 0,0 h 1 m 0,0 h 1 m 0,0 h 1 m 0,0 h 1 m 1,0 h 1 m 0,0 h 1 m 0,0 h 1 m 2,0 h 1 m 0,0 h 1 m 0,0 h 1 m 1,0 h 1 m 1,0 h 1 m 3,0 h 1 m 1,0 h 1 m 1,0 h 1 m 1,0 h 1 M 0,9 h 1 m 0,0 h 1 m 2,0 h 1 m 6,0 h 1 m 4,0 h 1 m 0,0 h 1 m 0,0 h 1 m 0,0 h 1 m 0,0 h 1 m 1,0 h 1 m 0,0 h 1 m 0,0 h 1 m 1,0 h 1 m 0,0 h 1 m 0,0 h 1 M 1,10 h 1 m 1,0 h 1 m 0,0 h 1 m 0,0 h 1 m 0,0 h 1 m 3,0 h 1 m 4,0 h 1 m 0,0 h 1 m 8,0 h 1 M 1,11 h 1 m 1,0 h 1 m 0,0 h 1 m 3,0 h 1 m 0,0 h 1 m 1,0 h 1 m 0,0 h 1 m 2,0 h 1 m 0,0 h 1 m 1,0 h 1 m 1,0 h 1 m 2,0 h 1 m 0,0 h 1 m 0,0 h 1 m 1,0 h 1 M 2,12 h 1 m 1,0 h 1 m 1,0 h 1 m 1,0 h 1 m 0,0 h 1 m 2,0 h 1 m 0,0 h 1 m 0,0 h 1 m 0,0 h 1 m 1,0 h 1 m 1,0 h 1 m 3,0 h 1 m 1,0 h 1 m 0,0 h 1 m 0,0 h 1 M 0,13 h 1 m 6,0 h 1 m 1,0 h 1 m 1,0 h 1 m 2,0 h 1 m 1,0 h 1 m 0,0 h 1 m 0,0 h 1 m 0,0 h 1 m 0,0 h 1 m 0,0 h 1 m 0,0 h 1 m 0,0 h 1 m 0,0 h 1 m 0,0 h 1 m 2,0 h 1 M 0,14 h 1 m 1,0 h 1 m 2,0 h 1 m 0,0 h 1 m 7,0 h 1 m 0,0 h 1 m 0,0 h 1 m 5,0 h 1 m 1,0 h 1 M 0,15 h 1 m 7,0 h 1 m 6,0 h 1 m 0,0 h 1 m 1,0 h 1 m 0,0 h 1 m 1,0 h 1 m 2,0 h 1 m 0,0 h 1 M 0,16 h 1 m 2,0 h 1 m 1,0 h 1 m 0,0 h 1 m 1,0 h 1 m 3,0 h 1 m 0,0 h 1 m 0,0 h 1 m 0,0 h 1 m 1,0 h 1 m 0,0 h 1 m 7,0 h 1 m 0,0 h 1 M 0,17 h 1 m 0,0 h 1 m 1,0 h 1 m 0,0 h 1 m 0,0 h 1 m 2,0 h 1 m 0,0 h 1 m 1,0 h 1 m 1,0 h 1 m 2,0 h 1 m 1,0 h 1 m 0,0 h 1 m 0,0 h 1 m 0,0 h 1 m 0,0 h 1 m 1,0 h 1 m 2,0 h 1 m 0,0 h 1 M 0,18 h 1 m 4,0 h 1 m 0,0 h 1 m 2,0 h 1 m 2,0 h 1 m 0,0 h 1 m 0,0 h 1 m 0,0 h 1 m 2,0 h 1 m 1,0 h 1 m 1,0 h 1 m 0,0 h 1 m 1,0 h 1 M 0,19 h 1 m 2,0 h 1 m 4,0 h 1 m 0,0 h 1 m 0,0 h 1 m 3,0 h 1 m 1,0 h 1 m 1,0 h 1 m 2,0 h 1 m 0,0 h 1 m 1,0 h 1 m 0,0 h 1 m 2,0 h 1 M 0,20 h 1 m 3,0 h 1 m 0,0 h 1 m 0,0 h 1 m 1,0 h 1 m 0,0 h 1 m 0,0 h 1 m 1,0 h 1 m 0,0 h 1 m 3,0 h 1 m 2,0 h 1 m 0,0 h 1 m 0,0 h 1 m 0,0 h 1 m 0,0 h 1 m 1,0 h 1 m 0,0 h 1 M 8,21 h 1 m 0,0 h 1 m 1,0 h 1 m 4,0 h 1 m 0,0 h 1 m 2,0 h 1 m 3,0 h 1 m 0,0 h 1 m 0,0 h 1 m 0,0 h 1 M 0,22 h 1 m 0,0 h 1 m 0,0 h 1 m 0,0 h 1 m 0,0 h 1 m 0,0 h 1 m 0,0 h 1 m 1,0 h 1 m 3,0 h 1 m 2,0 h 1 m 2,0 h 1 m 0,0 h 1 m 0,0 h 1 m 1,0 h 1 m 1,0 h 1 M 0,23 h 1 m 5,0 h 1 m 3,0 h 1 m 1,0 h 1 m 2,0 h 1 m 3,0 h 1 m 0,0 h 1 m 3,0 h 1 M 0,24 h 1 m 1,0 h 1 m 0,0 h 1 m 0,0 h 1 m 1,0 h 1 m 1,0 h 1 m 0,0 h 1 m 0,0 h 1 m 1,0 h 1 m 0,0 h 1 m 0,0 h 1 m 0,0 h 1 m 1,0 h 1 m 2,0 h 1 m 0,0 h 1 m 0,0 h 1 m 0,0 h 1 m 0,0 h 1 m 1,0 h 1 M 0,25 h 1 m 1,0 h 1 m 0,0 h 1 m 0,0 h 1 m 1,0 h 1 m 1,0 h 1 m 1,0 h 1 m 0,0 h 1 m 0,0 h 1 m 4,0 h 1 m 0,0 h 1 m 1,0 h 1 m 2,0 h 1 m 4,0 h 1 M 0,26 h 1 m 1,0 h 1 m 0,0 h 1 m 0,0 h 1 m 1,0 h 1 m 1,0 h 1 m 0,0 h 1 m 0,0 h 1 m 2,0 h 1 m 1,0 h 1 m 0,0 h 1 m 0,0 h 1 m 3,0 h 1 m 0,0 h 1 m 0,0 h 1 m 0,0 h 1 m 2,0 h 1 M 0,27 h 1 m 5,0 h 1 m 1,0 h 1 m 6,0 h 1 m 0,0 h 1 m 2,0 h 1 m 0,0 h 1 m 2,0 h 1 m 0,0 h 1 m 0,0 h 1 m 1,0 h 1 M 0,28 h 1 m 0,0 h 1 m 0,0 h 1 m 0,0 h 1 m 0,0 h 1 m 0,0 h 1 m 0,0 h 1 m 1,0 h 1 m 1,0 h 1 m 1,0 h 1 m 0,0 h 1 m 0,0 h 1 m 0,0 h 1 m 0,0 h 1 m 0,0 h 1 m 1,0 h 1 m 6,0 h 1"
       id="path1859" />
  </g>
</svg>
