﻿a.address,a.p_type,a.p_protocol,a.in_degree,a.out_degree
0xa0557234eb7b3c503388202d3768cfa2f1ae9dc2,lending,instadapp,4,0
0xf4030086522a5beea4988f8ca5b36dbc97bee88c,derivatives,hegic,1,0
0x5f4ec3df9cbd43714fe2740f5e3616155c5b8419,derivatives,hegic,1,0
0x26fa0665660c1d3a3666584669511d3c66ad37cb,derivatives,synthetix,22,0
0x7af65f1740c0eb816a27fd808eaf6ab09f6fa646,derivatives,synthetix,43,0
0xdc338c7544654c7dadfeb7e44076e457963113b0,derivatives,synthetix,29,0
0x8ef8ca2acaaafec19fb366c11561718357f780f2,derivatives,synthetix,27,0
0x6fb7f0e78582746bd01bcb6dfbfe62ca5f4f9175,derivatives,synthetix,26,0
0x00b416da876fe42dd02813da435cc030f0d72434,lending,maker,5,0
0x9dacc11dcd0aa13386d295eaeebbd38130897e6f,lending,maker,5,0
0x3d9819210a31b4961b30ef54be2aed79b9c9cd3b,lending,compound,59101,0
0x62f18c451af964197341d3c86d27e98c41bb8fcc,lending,compound,1,0
0xc64c4cba055efa614ce01f4bad8a9f519c4f8fab,lending,compound,1,0
0xb3319f5d18bc0d84dd1b4825dcde5d5f7266d407,lending,compound,6471,0
0x6c8c6b02e7b2be14d4fa6022dfd6d75921d90e4e,lending,compound,13190,0
0xf5dce57282a584d2746faf1593d3121fcac444dc,lending,compound,12577,0
0x158079ee67fce2f58472a96584a73c7ab9ac95c1,lending,compound,1457,0
0x4ddc2d193948926d02f9b1fe9e1daa0718270ed5,lending,compound,95870,0
0x39aa39c021dfbae8fac545936693ac917d5e7563,lending,compound,249653,0
0xf859a1ad94bcf445a406b892ef0d3082f4174088,lending,compound,4311,0
0xde4a25a0b9589689945d842c5ba0cf4f0d4eb3ac,dex,balancer,1,0
0xd632f22692fac7611d2aa1c0d552930d43caed3b,dex,curvefinance,2847,0
0x7eefbd48fd63d441ec7435d024ec7c5131019add,dex,0x,1,0
0x62e479060c89c48199fc7ad43b1432cc585ba1b9,derivatives,barnbridge,95,0
0xc45f49be156888a1c0c93dc0fe7dc89091e291f5,derivatives,barnbridge,43,0
0x575ccd8e2d300e2377b43478339e364000318e2c,dex,curvefinance,5097,0
0xb51f09b6f103d697dc5d64dc904ad6a2dad39987,assets,fei,2,0
0x74b235fef146cdb5be0d3786a9f3774674b3615e,assets,fei,1,0
0x37349d9cc523d28e6abfc03fc5f44879bc8bffd9,assets,fei,1,0
0x1434f99edb2bd03decccfe21288767b8324b7403,assets,fei,1,0
0x243c601cc5daa3ac250b14509804188347bd2afb,assets,fei,1,0
0x5a8cb4556e5d5935af06beab8292905f48131479,assets,fei,1,0
0xd6960adba53212bbe96e54a7afeda2066437d000,assets,fei,1,0
0x947b7742c403f20e5faccdac5e092c943e7d0277,assets,convex,5,90
0xcafea2d407f1307d1413e84b2730f0870fd72dc0,derivatives,nexus,1,0
0x7e62b7e279dfc78deb656e34d6a435cc08a44666,lending,maker,1,0
0x39dce47a67ad34344eab877eae3ef1fa2a1d50bb,dex,0x,5,0
0xc02aaa39b223fe8d0a0e5c4f27ead9083c756cc2,dex,0x,1262748,0
0x3f27c540adae3a9e8c875c61e3b970b559d7f65d,derivatives,synthetix,140,0
0x631443c4121ca7b4c90dc79a37b1dce8b79adeec,derivatives,synthetix,1,0
0x88c8cf3a212c0369698d13fe98fcb76620389841,derivatives,synthetix,11,0
0xd4db55cf39c37beaa3a47f2555d57b4ea2d9ff39,derivatives,synthetix,1,0
0x22602469d704bffb0936c7a7cfcd18f7aa269375,derivatives,synthetix,8,0
0x136b1ec699c62b0606854056f02dc7bb80482d63,derivatives,synthetix,1,0
0xfe33ae95a9f0da8a845af33516edc240dcd711d6,derivatives,synthetix,4,0
0x23d5381713841724a67b731026b32322228ca3c7,derivatives,synthetix,1,0
0x5299d6f7472dcc137d7f3c4bcfbbb514babf341a,derivatives,synthetix,25,0
0x9956c5019a24fbd5b506ad070b771577bac5c343,derivatives,synthetix,1,0
0xe36e2d3c7c34281fa3bc737950a68571736880a1,derivatives,synthetix,39,0
0xd1b420854527e4b0e489bd37ec8f9db1e6305515,derivatives,synthetix,1,0
0x23348160d7f5aca21195df2b70f28fce2b0be9fc,derivatives,synthetix,4,0
0xc69d8b688a309fdea9273dde1a46bf1e51928a55,derivatives,synthetix,1,0
0x757de3ac6b830a931ef178c6634c5c551773155c,derivatives,synthetix,5,0
0x68a8b098967ae077dcff5cc8e29b7cb15f1a3cc8,derivatives,synthetix,1,0
0xf4eebdd0704021ef2a6bbe993fdf93030cd784b4,derivatives,synthetix,4,0
0x71892d13ba2b19f196760f619ee9c67534a49e37,derivatives,synthetix,1,0
0xd50c1746d835d2770dda3703b69187bffeb14126,derivatives,synthetix,4,0
0x01ada1140ca795897c45016dfd296382267b264a,derivatives,synthetix,1,0
0xcb98f42221b2c251a4e74a1609722ee09f0cc08e,derivatives,synthetix,3,0
0xe20117888ab22acf65b02c196a9f8423b502876c,derivatives,synthetix,1,0
0x4adf728e2df4945082cdd6053869f51278fae196,derivatives,synthetix,2,0
0xd636802a5b903b23726189d9b89daad2750177fa,derivatives,synthetix,1,0
0x8a8079c7149b8a1611e5c5d978dca3be16545f83,derivatives,synthetix,3,0
0xd3d2e2692501a5c9ca623199d38826e513033a17,lending,maker,7410,0
0xb671f2210b1f6621a2607ea63e6b2dc3e2464d1f,derivatives,synthetix,997,0
0x11164f6a47c3f8472d19b9add516fc780cb7ee02,derivatives,synthetix,2,0
0x3ff860c0f28d69f392543a16a397d0dae85d16de,lending,maker,1,0
0x5f122465bcf86f45922036970be6dd7f58820214,lending,maker,1,0
0xca3d75ac011bf5ad07a98d02f18225f9bd9a6bdf,dex,curvefinance,2311,0
0x80466c64868e1ab14a1ddf27a676c3fcbe638fe5,dex,curvefinance,1568,0
0x07d91f5fb9bf7798734c3f606db065549f6893bb,dex,1inch,1,0
0xcafea19bb9ab657f8ea74363c937446c0846a320,derivatives,nexus,1,0
0x182b723a58739a9c974cfdb385ceadb237453c28,dex,curvefinance,3778,0
0xdc24316b9ae028f1497c275eb9192a3ea0f67022,dex,curvefinance,11651,0
0xba100000625a3754423978a60c9317c58a424e3d,lending,maker,65908,0
0x103cc17c2b1586e5cd9bad308690bcd0bbe54d5e,assets,vesper,2326,0
0x4b2e76ebbc9f2923d83f5fbde695d8733db1a17b,assets,vesper,875,0
0x949424e8ef3a9fb1859e4a2fea8b891bc4d28385,assets,vesper,2,0
0x0c49066c0808ee8c673553b7cbd99bcc9abf113d,assets,vesper,2612,0
0x3a51f72104fd7c9257730c437b250e99516202fc,assets,vesper,3,0
0x5e227ad1969ea493b43f840cff78d08a6fc17796,lending,maker,1,0
0xbaa65281c2fa2baacb2cb550ba051525a480d3f4,lending,maker,1,0
0x35d1b3f3d7966a1dfe207aa4514c12a259a0492b,lending,maker,532,0
0x65c79fcb50ca1594b025960e539ed7a9a6d434a3,lending,maker,9,0
0x6b175474e89094c44da98b954eedeac495271d0f,lending,maker,1257644,0
0x9759a6ac90977b93b58547b4a71c78317f391a28,lending,maker,356,0
0x19c0976f590d67707e62397c87829d896dc0f1f1,lending,maker,28,0
0x197e90f9fad81970ba7976f33cbd77088e5d7cf7,lending,maker,16,0
0xa950524441892a31ebddf91d3ceefa04bf454466,lending,maker,109,0
0x2f0b23f53734252bda2277357e97e1517d6b042a,lending,maker,90,0
0x3d0b1912b66114d4096f48a8cee3a56c231772ca,lending,maker,14,0
0x82ecd135dce65fbc6dbdd0e4237e0af93ffd5038,lending,maker,8,0
0x07ee93aeea0a36fff2a9b95dd22bd6049ee54f26,lending,maker,3,0
0x5ef30b9986345249bc32d8928b7ee64de9435e39,lending,maker,113,0
0x456bcf03c84ae67e840c7a0036562d360b6d09c1,assets,vesper,1,0
0xffc4c270244f9c0890c744f042f5f25f9ff8d4b5,assets,vesper,2,0
0x1b93556ab8dccef01cd7823c617a6d340f53fb58,lending,maker,1,0
0x2a842bc64343fad4ec4a8424ba7ff3c0a70b6e55,derivatives,dydx,2,0
0xa9b99766e6c676cf1975c0d3166f96c0848ff5ad,lending,instadapp,44,0
0x6d903f6003cca6255d85cca4d3b5e5146dc33925,lending,compound,5,0
0xf592ef673057a451c49c9433e278c5d59b56132c,lending,compound,1,0
0xa3d87fffce63b53e0d54faa1cc983b7eb0b74a9c,dex,curvefinance,2562,0
0xc5424b857f758e906013f3555dad202e4bdb4567,dex,curvefinance,3149,0
0x3c0ffff15ea30c35d7a85b85c0782d6c94e1d238,dex,curvefinance,1586,0
0xa5679c04fc3d9d8b0aab1f0ab83555b301ca70ea,lending,maker,25,0
0x4acdbe9dd0d00b36ec2050e805012b8fc9974f2b,lending,maker,6,0
0xcafea81b73dab8f42c5eca7d2e821a82660b6775,derivatives,nexus,40,0
0xfed77055b40d63dcf17ab250ffd6948fbff57b82,derivatives,synthetix,139,0
0x056fd409e1d7a124bd7017459dfea2f387b6d5cd,lending,maker,34068,0
0x707c1bd52c4718bf040f350f7fe6ba0adb484e8d,derivatives,barnbridge,46,0
0x7f7d4dfd9733ae12e6a5991d42af16418f227b6e,derivatives,barnbridge,75,0
0xea32e4e751d49757906e1153ef7a30fcab1b6462,derivatives,barnbridge,30,0
0x34a5ef81d18f3a305ae9c2d7df42beef4c79031c,derivatives,synthetix,2,0
0xf9bd94c6f93c1fa5f38174c5e424721e1046af07,derivatives,synthetix,2,0
0xa1652766155d4debc31d01bf3f748cb46508745b,derivatives,synthetix,2,0
0x7b6ab32ca02b31485fbf7265437c2853792cc5d9,derivatives,synthetix,2,0
0xc4e4c442653fdc78a71401684fd6cf9d67b3b643,derivatives,synthetix,2,0
0x602590f2aa35b71ccb1ca72e673a75b26ec7f4e8,derivatives,synthetix,1,0
0xd38aeb759891882e78e957c80656572503d8c1b1,derivatives,synthetix,7,0
0x13d0f5b8630520ea04f694f17a001fb95eafd30e,derivatives,synthetix,1,0
0xed1efd716c7e2e821bbd4ec1480d649df7fb2279,derivatives,synthetix,1,0
0xcd39b5434a0a92cf47d1f567a7df84be356814f0,derivatives,synthetix,6,0
0x0e8fa2339314ab7e164818f26207897bbe29c3af,derivatives,synthetix,1,0
0x860c5f944b098ce28cf9f2da099913f01c9364d8,derivatives,synthetix,1,0
0x0352557b007a4aae1511c114409b932f06f9e2f4,derivatives,synthetix,6,0
0xe615df79ac987193561f37e77465bec2aefe9adb,derivatives,synthetix,1,0
0x8e082925e78538955bc0e2f363fc5d1ab3be739b,derivatives,synthetix,1,0
0x67a0213310202dbc2cbe788f4349b72fba90f9fa,dex,curvefinance,2,0
0x40907540d8a6c65c637785e8f8b742ae6b0b9968,dex,curvefinance,1,0
0xd533a949740bb3306d119cc777fa900ba034cd52,dex,curvefinance,127003,0
0x5f3b5dfeb7b28cdbd7faba78963ee202a494e2a2,dex,curvefinance,7958,0
0x2f50d538606fa9edd2b11e2446beb18c9d5846bb,dex,curvefinance,2113,0
0xd061d61a4d941c39e5453435b6345dc261c2fce0,dex,curvefinance,14680,0
0x7ca5b0a2910b33e9759dc7ddb0413949071d7575,dex,curvefinance,2397,0
0xbc89cd85491d81c6ad2954e6d0362ee29fca8f53,dex,curvefinance,399,0
0xfa712ee4788c042e2b7bb55e6cb8ec569c4530c1,dex,curvefinance,5054,0
0x69fb7c45726cfe2badee8317005d3f94be838840,dex,curvefinance,1207,0
0x64e3c23bfc40722d3b649844055f1d51c1ac041d,dex,curvefinance,551,0
0xb1f2cdec61db658f091671f5f199635aef202cac,dex,curvefinance,1833,0
0xa90996896660decc6e997655e065b23788857849,dex,curvefinance,4766,0
0x705350c4bcd35c9441419ddd5d2f097d7a55410f,dex,curvefinance,2185,0
0xface851a4921ce59e912d19329929ce6da6eb0c7,lending,compound,1342,0
0x7eb40e450b9655f4b3cc4259bcc731c63ff55ae6,dex,curvefinance,1631,0
0x42d7025938bec20b69cbae5a77421082407f053a,dex,curvefinance,808,0
0x055be5ddb7a925bfef3417fc157f53ca77ca7222,dex,curvefinance,799,0
0x3c8caee4e09296800f8d29a68fa3837e2dae4940,dex,curvefinance,1531,0
0xf553e1f826f42716cdfe02bde5ee76b2a52fc7eb,assets,harvestfinance,124,0
0x7133aff303539b0a4f60ab9bd9656598bf49e272,derivatives,synthetix,67,0
0xe41d2489571d322189246dafa5ebde1f4699f498,dex,0x,584986,0
0x823be81bbf96bec0e25ca13170f5aacb5b79ba83,derivatives,synthetix,2,0
0xd69b189020ef614796578afe4d10378c5e7e1138,derivatives,synthetix,5,0
0xad95c918af576c82df740878c3e983cbd175dab6,derivatives,synthetix,7,0
0x62922670313bf6b41c580143d1f6c173c5c20019,derivatives,synthetix,1,0
0xc61b352fcc311ae6b0301459a970150005e74b3e,derivatives,synthetix,1,0
0x388fd1a8a7d36e03efa1ab100a1c5159a3a3d427,derivatives,synthetix,1,0
0x37b648a07476f4941d3d647f81118afd55fa8a04,derivatives,synthetix,1,0
0xef285d339c91adf1dd7de0aeaa6250805fd68258,derivatives,synthetix,1,0
0xcf9bb94b5d65589039607ba66e3dac686d3eff01,derivatives,synthetix,1,0
0x5edf7dd83fe2889d264fa9d3b93d0a6e6a45d6c6,derivatives,synthetix,1,0
0x9745606da6e162866dad7bf80f2abf145edd7571,derivatives,synthetix,1,0
0x2962ea4e749e54b10cfa557770d597027ba67cb3,derivatives,synthetix,1,0
0xdb91e4b3b6e19bf22e810c43273eae48c9037e74,derivatives,synthetix,3,0
0xda3c83750b1fa31fda838136ef3f853b41cb7a5a,derivatives,synthetix,1,0
0x47bd14817d7684082e04934878ee2dd3576ae19d,derivatives,synthetix,1,0
0x6f927644d55e32318629198081923894fbfe5c07,derivatives,synthetix,1,0
0xe3d5e1c1ba874c0ff3ba31b999967f24d5ca04e5,derivatives,synthetix,1,0
0xa962208cdc8588f9238fae169d0f63306c353f4f,derivatives,synthetix,1,0
0xcd980fc5ccdae62b18a52b83ec64200121a929db,derivatives,synthetix,1,0
0xaf090d6e583c082f2011908cf95c2518be7a53ac,derivatives,synthetix,1,0
0x21ee4afbd6c151fd9a69c1389598170b1d45e0e3,derivatives,synthetix,1,0
0xcb6cb218d558ae7ff6415f95bda6616fcff669cb,derivatives,synthetix,1,0
0x7b29c9e188de18563b19d162374ce6836f31415a,derivatives,synthetix,1,0
0xc22e51fa362654ea453b4018b616ef6f6ab3b779,derivatives,synthetix,1,0
0x3e2da260b4a85782a629320eb027a3b7c28ea9f1,derivatives,synthetix,1,0
0xc02dd182ce029e6d7f78f37492dfd39e4feb1f8b,derivatives,synthetix,1,0
0x2acfe6265d358d982cb1c3b521199973cd443c71,derivatives,synthetix,1,0
0x46a7af405093b27da6def193c508bd9240a255fa,derivatives,synthetix,1,0
0x8350d1b2d6ef5289179fe49e5b0f208165b4e32e,derivatives,synthetix,1,0
0x29dd4a59f4d339226867e77af211724eabb45c02,derivatives,synthetix,1,0
0xf7b8df8b16da302d85603b8e7f95111a768458cc,derivatives,synthetix,1,0
0x0517a56da8a517e3b2d484cc5f1da4bdcfe68ec3,derivatives,synthetix,1,0
0x099cfad1640fc7ea686ab1d83f0a285ba0470882,derivatives,synthetix,1,0
0x19cc1f63e344d74a87d955e3f3e95b28dddc61d8,derivatives,synthetix,1,0
0x4d50a0e5f068acdc80a1da2dd1f0ad48845df2f8,derivatives,synthetix,1,0
0xb73c665825daa926d6ef09417fbe5654473c1b49,derivatives,synthetix,1,0
0x806a599d60b2fdbda379d5890287d2fba1026cc0,derivatives,synthetix,1,0
0xcea42504874586a718954746a564b72bc7eba3e3,derivatives,synthetix,1,0
0x947d5656725fb9a8f9c826a91b6082b07e2745b7,derivatives,synthetix,1,0
0x186e56a62e7cace1308f1a1b0dbb27f33f80f16f,derivatives,synthetix,1,0
0x931c5516ee121a177bd2b60e0122da5b27630abc,derivatives,synthetix,1,0
0x6dc6a64724399524184c2c44a526a2cff1baa507,derivatives,synthetix,1,0
0x87eb6e935e3c7e3e3a0e31a5658498bc87de646e,derivatives,synthetix,1,0
0x53869bda4b8d85aedcc9c6cacf015af9447cade7,derivatives,synthetix,1,0
0x211ba925b35b82246a3ccfa3a991a39a840f025c,derivatives,synthetix,1,0
0x915d1c9df12142b535f6a7437f0196d80bccc1bd,derivatives,synthetix,12,0
0x573e5105c4b92416d1544a188f1bf77d442bb52d,derivatives,synthetix,1,0
0x373238337bfe1146fb49989fc222523f83081ddb,lending,maker,2,0
0xc6f348dd3b91a56d117ec0071c1e9b83c0996de4,lending,compound,275,0
0xf49c43ae0faf37217bdcb00df478cf793edd6687,lending,compound,353,0
0xe29a14bcdea40d83675aa43b72df07f649738c8b,lending,maker,1,0
0x61bdfb070eaa448917317d7849e325e715b6389f,assets,vesper,1,0
0x2a1739d7f07d40e76852ca8f0d82275aa087992f,lending,instadapp,1,0
0xa81598667ac561986b70ae11bbe2dd5348ed4327,lending,maker,1,0
0x4aad139a88d2dd5e7410b408593208523a3a891d,lending,maker,2,0
0x5d9d25c7c457dd82fc8668ffc6b9746b674d4ecb,assets,harvestfinance,805,0
0x917d6480ec60cbddd6cbd0c8ea317bcc709ea77b,assets,harvestfinance,747,0
0xd8553552f8868c1ef160eedf031cf0bcf9686945,assets,fei,238,0
0xfd3300a9a74b3250f1b2abc12b47611171910b07,assets,fei,2272,0
0xbb025d470162cc5ea24daf7d4566064ee7f5f111,assets,fei,101,0
0x7e9ce3caa9910cc048590801e64174957ed41d43,assets,fei,111,0
0x631e93a0fb06b5ec6d52c0a2d89a3f9672d6ba64,derivatives,synthetix,2,0
0xa50ba011c48153de246e5192c8f9258a2ba79ca9,lending,aave,1,0
0xf36b79bd4c0904a5f350f1e4f776b81208c13069,lending,maker,1,0
0x7382c066801e7acb2299ac8562847b9883f5cd3c,lending,maker,1,0
0x02d341ccb60faaf662bc0554d13778015d1b285c,dex,curvefinance,866,0
0xeb16ae0052ed37f479f7fe63849198df1765a733,dex,curvefinance,980,0
0x475f1a89c1ed844a08e8f6c50a00228b5e59e4a9,lending,maker,6,0
0xc7e8cd72bdee38865b4f5615956ef47ce1a7e5d0,lending,maker,12,0
0x97e2768e8e73511ca874545dc5ff8067eb19b787,dex,curvefinance,242,0
0x3e01dd8a5e1fb3481f0f589056b428fc308af0fb,dex,curvefinance,99,0
0xc2b1df84112619d190193e48148000e3990bf627,dex,curvefinance,186,0
0x4f3e8f405cf5afc05d68142f3783bdfe13811522,dex,curvefinance,3447,0
0x0f9cb53ebe405d49a0bbdbd291a65ff571bc83e1,dex,curvefinance,1315,0
0xf98450b5602fa59cc66e1379dffb6fddc724cfc4,dex,curvefinance,1846,0
0x64448b78561690b70e17cbe8029a3e5c1bb7136e,dex,curvefinance,1370,0
0x09672362833d8f703d5395ef3252d4bfa51c15ca,dex,curvefinance,144,0
0xbe175115bf33e12348ff77ccfee4726866a0fbd5,dex,curvefinance,283,0
0x094d12e5b541784701fd8d65f11fc0598fbc6332,dex,curvefinance,3205,0
0x1de7f0866e2c4adac7b457c58cc25c8688cda1f2,dex,curvefinance,139,0
0xf1f85a74ad6c64315f85af52d3d46bf715236adc,dex,curvefinance,204,0
0x803a2b40c5a9bb2b86dd630b274fa2a9202874c2,dex,curvefinance,544,0
0xaa82ca713d94bba7a89ceab55314f9effeddc78c,dex,curvefinance,1333,0
0xc17078fdd324cc473f8175dc5290fae5f2e84714,assets,badger,1614,0
0xadc8d7322f2e284c1d9254170dbe311e9d3356cf,assets,badger,1,0
0x88128580acdd9c04ce47afce196875747bf2a9f6,assets,badger,1662,0
0xaa8dddfe7dfa3c3269f1910d89e4413dd006d08a,assets,badger,1,0
0x872213e29c85d7e30f1c8202fc47ed1ec124bb1d,assets,badger,7,45
0x29f7f8896fb913cf7f9949c623f896a154727919,assets,badger,3,17
0xec568fffba86c094cf06b22134b23074dfe2252c,lending,aave,1006,0
0xfd2a8fa60abd58efe3eee34dd494cd491dc14900,dex,curvefinance,1410,0
0xdebf20617708857ebe4f679508e7b7863a8a8eee,dex,curvefinance,1624,0
0xd662908ada2ea1916b3318327a97eb18ad588b5d,dex,curvefinance,1078,0
0x7fc66500c84a76ad7e9c93437bfc5ac33e2ddae9,lending,aave,248338,0
0x25f2226b597e8f9514b3f68f00f494cf4f286491,lending,aave,3,0
0x4da27a545c0c5b758a6ba100e3a049001de870f5,lending,aave,19279,0
0xfe09e53a81fe2808bc493ea64319109b5baa573e,assets,harvestfinance,1170,0
0xab7fa2b2985bccfc13c6d86b1d5a17486ab1e04c,assets,harvestfinance,1174,0
0xf0358e8c3cd5fa238a29301d0bea3d63a17bedbe,assets,harvestfinance,2491,0
0x053c80ea73dc6941f518a68e2fc52ac45bde7c9c,assets,harvestfinance,1336,0
0xc391d1b08c1403313b0c28d47202dfda015633c4,assets,harvestfinance,390,0
0x9aa8f427a17d6b0d91b6262989edc7d45d6aedf8,assets,harvestfinance,286,0
0xfbaedde70732540ce2b11a8ac58eb2dc0d69de10,derivatives,synthetix,227,0
0xa79a083fdd87f73c2f983c5551ec974685d6bb36,assets,harvestfinance,398,0
0x307e2752e8b8a9c29005001be66b1c012ca9cdb7,assets,harvestfinance,567,0
0x01112a60f427205dca6e229425306923c3cc2073,assets,harvestfinance,611,0
0x008671ca953ec3baa8c1b9af4623d38789ee2236,assets,harvestfinance,2,14
0x2a32dcbb121d48c106f6d94cf2b4714c0b4dfe48,assets,harvestfinance,310,0
0xad91695b4bec2798829ac7a4797e226c78f22abd,assets,harvestfinance,305,0
0x2502f65d77ca13f183850b5f9272270454094a08,lending,maker,3,0
0x08c82f7513c7952a95029fe3b1587b1fa52daced,dex,sushiswap,1,0
0x93b6e9fbbd2c32a0dc3c2b943b7c3cbc2fe23730,derivatives,synthetix,1,0
0x7674622c63bee7f46e86a4a5a18976693d54441b,assets,harvestfinance,266,0
0x269895a3df4d73b077fc823dd6da1b95f72aaf9b,derivatives,synthetix,92,0
0xcec4e038371d32212c6dcdf36fdbcb6f8a34c6d8,derivatives,synthetix,1,0
0xec56a21cf0d7feb93c25587c12bffe094aa0ecda,assets,harvestfinance,257,0
0x8cb38a75ecd8572af23a8d086e9bda96ca521889,assets,convex,3443,0
0x1a9f22b4c385f78650e7874d64e442839dc32327,assets,harvestfinance,220,0
0xb1feb6ab4ef7d0f41363da33868e85eb0f3a57ee,assets,harvestfinance,169,0
0xd2967f45c4f384deea880f807be904762a3dea07,dex,curvefinance,1477,0
0x4f062658eaaf2c1ccf8c8e36d6824cdf41167956,dex,curvefinance,1490,0
0x05a9cbe762b36632b3594da4f082340e0e5343e8,derivatives,synthetix,3,0
0xb19ebfb37a936cce783142955d39ca70aa29d43c,assets,harvestfinance,154,0
0x63671425ef4d25ec2b12c7d05de855c143f16e3b,assets,harvestfinance,167,0
0x673f9488619821ab4f4155fdffe06f6139de518f,derivatives,barnbridge,50,0
0x7e88d19a79b291cfe5696d496055f7e57f537a75,derivatives,synthetix,2,0
0x52496fe8a4feaefe14d9433e00d48e6929c13dec,derivatives,synthetix,2,0
0x6828bcf74279ee32f2723ec536c22c51eed383c6,dex,curvefinance,526,0
0x4b9ca5607f1ff8019c1c6a3c2f0cc8de622d5b82,derivatives,synthetix,2,0
0xc07eb91961662d275e2d285bdc21885a4db136b0,assets,harvestfinance,606,0
0xfbe122d0ba3c75e1f7c80bd27613c9f35b81feec,assets,harvestfinance,400,0
0x8798249c2e607446efb7ad49ec89dd1865ff4272,dex,sushiswap,37539,0
0x0716f25fbaaae9b63803917b6125c10c313df663,lending,maker,3,0
0x135954d155898d42c90d2a57824c690e0c7bef1b,lending,maker,32,0
0x832dd5f17b30078a5e46fdb8130a68cbc4a74dc0,lending,maker,17,0
0x7b1696677107e48b152e9bf400293e98b7d86eb1,lending,maker,1,0
0x79fbdf16b366dfb14f66ce4ac2815ca7296405a0,lending,maker,1,0
0x4b92d19c11435614cd49af1b589001b7c08cd4d5,assets,badger,1994,0
0x6955a55416a06839309018a8b0cb72c4ddc11f15,dex,curvefinance,890,0
0x35a18000230da775cac24873d00ff85bccded550,lending,compound,6127,0
0x845838df265dcd2c412a1dc9e959c7d08537f8a2,dex,curvefinance,3175,0
0xa2b47e3d5c44877cca798226b7b8118f9bfb7a56,dex,curvefinance,1599,0
0x3b3ac5386837dc563660fb6a0937dfaa5924333b,dex,curvefinance,2293,0
0x79a8c46dea5ada233abaffd40f3a0a2b1e5a4f27,dex,curvefinance,1884,0
0x49849c98ae39fff122806c06791fa73784fb3675,dex,curvefinance,3949,0
0x8925d9d9b4569d737a48499def3f67baa5a144b9,dex,curvefinance,30,0
0x464c71f6c2f760dda6093dcb91c24c39e5d6e18c,lending,aave,1,0
0x8101e6760130be2c8ace79643ab73500571b7162,dex,curvefinance,19,0
0xa4f1671d3aee73c05b552d57f2d16d3cfcbd0217,assets,vesper,1,0
0x64eda51d3ad40d56b9dfc5554e06f94e1dd786fd,dex,curvefinance,1437,0
0x94c7c51a3ff556b46fc697da0be0dc811e334e7e,assets,vesper,3,0
0xae461ca67b15dc8dc81ce7615e0320da1a9ab8d5,lending,maker,625,0
0x0f7c200c4d3b5570c777764884ce6de67f31d3ba,derivatives,synthetix,1,0
0x27e6d3ce99fa5ec4019ce598af54bcb3a2fb2e5f,derivatives,nexus,460,0
0x4b8d90d68f26def303dcb6cfc9b63a1aaec15840,derivatives,barnbridge,633,0
0x72e158d38dbd50a483501c24f792bdaaa3e7d55c,dex,curvefinance,273,0
0x4ec3570cadaaee08ae384779b0f3a45ef85289de,derivatives,dydx,1,0
0xf9e5f9024c2f3f2908a1d0e7272861a767c9484b,assets,harvestfinance,1219,0
0xe1f9a3ee001a2ecc906e8de637dbf20bb2d44633,assets,harvestfinance,1982,0
0x5bd997039fff16f653ef15d1428f2c791519f58d,assets,harvestfinance,1683,0
0x824f13f1a2f29cfeea81154b46c0fc820677a637,dex,curvefinance,186,0
0x9582c4adacb3bce56fea3e590f05c3ca2fb9c477,dex,curvefinance,701,0
0x8ceba69a8e96a4ce71aa65859dbdb180b489a719,derivatives,nexus,3,0
0xf00dd244228f51547f0563e60bca65a30fbf5f7f,assets,harvestfinance,15,535
0xa0246c9032bc3a600820415ae600c6388619a14d,assets,harvestfinance,30401,0
0xe85c8581e60d7cd32bbfd86303d2a4fa6a951dac,assets,harvestfinance,1280,0
0xc3f7ffb5d5869b3ade9448d094d81b0521e8326f,assets,harvestfinance,2197,0
0xc7ee21406bb581e741fbb8b21f213188433d9f2f,assets,harvestfinance,1877,0
0x284d7200a0dabb05ee6de698da10d00df164f61d,assets,harvestfinance,1,0
0x9eb923339c24c40bef2f4af4961742aa7c23ef3a,lending,maker,1,0
0x4e3b31eb0e5cb73641ee1e65e7dcefe520ba3ef2,derivatives,synthetix,1,0
0x84edffa16bb0b9ab1163abb0a13ff0744c11272f,derivatives,nexus,1553,0
0x4ea5424c393869505cbd7f8d802595328aab89fe,derivatives,futureswap,173,0
0x7d3455421bbc5ed534a83c88fd80387dc8271392,dex,0x,7,0
0xc011a73ee8576fb46f5e1c5751ca3b9fe0af2a6f,derivatives,synthetix,256671,0
0x5b1b5fea1b99d83ad479df0c222f0492385381dd,derivatives,synthetix,5,0
0xc2ee6b0334c261ed60c72f6054450b61b8f18e35,dex,curvefinance,304,0
0xc18cc39da8b11da8c3541c598ee022258f9744da,dex,curvefinance,90,0
0x3c6809319201b978d821190ba03fa19a3523bd96,lending,compound,13,3
0x0391d2021f89dc339f60fff84546ea23e337750f,derivatives,barnbridge,21068,0
0x192e9d29d43db385063799bc239e772c3b6888f3,assets,harvestfinance,235,0
0x6291ece696cb6682a9bb1d42fca4160771b1d7cc,assets,harvestfinance,584,0
0xcfe1103863f9e7cf3452ca8932eef44d314bf9c5,assets,harvestfinance,389,0
0x5365a2c47b90ee8c9317fac20edc3ce7037384fb,assets,harvestfinance,229,0
0x44356324864a30216e89193bc8b0f6309227d690,assets,harvestfinance,124,0
0xf465573288d9d89c6e89b1bc3bc9ce2b997e77df,assets,harvestfinance,64,0
0x7af4458d3abd61c3fd187bb9f1bbf917cd4be9b8,assets,harvestfinance,80,0
0x462253b8f74b72304c145db0e4eebd326b22ca39,dex,curvefinance,407,0
0xabe234e0d2d518bdb1d5a655014de18b1cfffbea,derivatives,dydx,1,0
0x6d19b2bf3a36a61530909ae65445a906d98a2fa8,dex,balancer,8843,0
0xcd81398895bea7ad9eff273aeffc41a9d83b4dad,derivatives,dydx,1,0
0x167009dcda2e49930a71712d956f02cc980dcc1b,derivatives,synthetix,166,0
0x2775b1c75658be0f640272ccb8c72ac986009e38,lending,compound,92,0
0x998ceb152a42a3eac1f555b1e911642bebf00fad,assets,harvestfinance,162,0
0x683e683fbe6cf9b635539712c999f3b3edcb8664,assets,harvestfinance,408,0
0x4b1cbd6f6d8676ace5e412c78b7a59b4a1bbb68a,assets,harvestfinance,161,0
0xc0f51a979e762202e9bef0f62b07f600d0697de1,assets,harvestfinance,160,0
0xef4da1ce3f487da2ed0be23173f76274e0d47579,assets,harvestfinance,407,0
0x093c2ae5e6f3d2a897459aa24551289d462449ad,assets,harvestfinance,160,0
0xf256cc7847e919fac9b808cc216cac87ccf2f47a,lending,aave,442,0
0xfafedf95e21184e3d880bd56d4806c4b8d31c69a,lending,aave,6,0
0xcafea2a26f12901f0f4249144f53da60186c0722,derivatives,nexus,162,0
0xcafea28488fdb84588a27d31ff42c4206c702a4c,derivatives,nexus,93,0
0xcafea332b66ee4b2c3a2d9c9a2f9618c9c94a1e9,derivatives,nexus,6,0
0xcafea35ce5a2fc4ced4464da4349f81a122fd12b,derivatives,nexus,960,0
0x06325440d014e39736583c165c2963ba99faf14e,dex,curvefinance,8449,0
0xa26e15c895efc0616177b7c1e7270a4c7d51c997,lending,maker,23,0
0x4678f0a6958e4d2bc4f1baf7bc52e8f3564f3fe4,lending,maker,72134,0
0x7b5e3521a049c8ff88e6349f33044c6cc33c113c,lending,compound,3,0
0x6c3f90f043a72fa612cbac8115ee7e52bde6e490,dex,curvefinance,10417,0
0xbebc44782c7db0a1a60cb6fe97d0b483032ff1c7,dex,curvefinance,21525,0
0xbfcf63294ad7105dea65aa58f8ae5be2d9d0952a,dex,curvefinance,3351,0
0x2474f297214e5d96ba4c81986a9f0e5c260f445d,lending,maker,1,0
0xc0aee478e3658e2610c5f7a4a2e1777ce9e4f2ac,dex,sushiswap,47,0
0xaaa760c2027817169d7c8db0dc61a2fb4c19ac23,lending,maker,1,0
0xd9e1ce17f2641f24ae83637ab66a2cca9c378b9f,dex,sushiswap,434555,0
0xe72c7e90bc26c11d45dbee736f0acf57fc5b7152,lending,maker,1,0
0x225b3da5be762ee52b182157e67bea0b31968163,lending,maker,1,0
0x53a901d48795c58f485cbb38df08fa96a24669d5,dex,curvefinance,520,0
0xf9440930043eb3997fc70e1339dbb11f341de7a8,dex,curvefinance,632,0
0xd4690a51044db77d91d7aa8f7a3a5ad5da331af0,dex,0x,357,0
0x6752c6fbddc24ac88f3749d8921e00c77bffef8c,derivatives,nexus,4,0
0x067e398605e84f2d0aeec1806e62768c5110dcc6,derivatives,synthetix,1,0
0x2010741f855d3cf16fd60e9cce14af6de9b526ff,assets,vesper,4,0
0x8dae6cb04688c62d939ed9b68d32bc62e49970b1,lending,aave,781,0
0x00ad8ebf64f141f1c81e9f8f792d3d1631c6c684,lending,aave,10,0
0x3b05a5295aa749d78858e33ece3b97bb3ef4f029,lending,instadapp,2,0
0x331af2e331bd619defaa5dac6c038f53fcf9f785,dex,curvefinance,2050,0
0x6d65b498cb23deaba52db31c93da9bffb340fb8f,dex,curvefinance,199,0
0xe7a24ef0c5e95ffb0f6684b813a78f2a3ad7d171,dex,curvefinance,129,0
0x1aef73d49dedc4b1778d0706583995958dc862e6,dex,curvefinance,635,0
0x8474ddbe98f5aa3179b3b3f5942d724afcdec9f6,dex,curvefinance,514,0
0x7ddc3fff0612e75ea5ddc0d6bd4e268f70362cff,assets,harvestfinance,373,0
0xc25099792e9349c7dd09759744ea681c7de2cb66,dex,curvefinance,497,0
0xf363c7e351c96b910b92b45d34190650df4ae8e7,lending,maker,1,0
0xdc26c9b7a8fe4f5df648e314ec3e6dc3694e6dd2,lending,maker,1,0
0x03ae53b33feeac1222c3f372f32d37ba95f0f099,lending,maker,2,0
0xc53b68ba1c717df9a077d2a67cc87563d95b181c,derivatives,dydx,1,0
0x1e0447b19bb6ecfdae1e4ae1694b0c3659614e4e,derivatives,dydx,36623,0
0x787f552bdc17332c98aa360748884513e3cb401a,derivatives,dydx,3,0
0x0ece224fbc24d40b446c6a94a142dc41fae76f2d,derivatives,dydx,1,0
0xa8b39829ce2246f89b31c013b8cde15506fb9a76,derivatives,dydx,35124,0
0x95e6f48254609a6ee006f7d493c8e5fb97094cef,dex,0x,25,0
0xefc70a1b18c432bdc64b596838b4d138f6bc6cad,dex,0x,1,0
0xb33839e05ce9fc53236ae325324a27612f4d110d,dex,1inch,327,0
0x6ee01435d5590992f037335a053b4b617947db42,derivatives,dydx,1,0
0x9424b1412450d0f8fc2255faf6046b98213b76bd,dex,balancer,126,0
0x971e78e0c92392a4e39099835cf7e6ab535b2227,derivatives,synthetix,505,0
0x20dce41acca85e8222d6861aa6d23b6c941777bf,assets,badger,1,0
0x111111111117dc0aa78b770fa6a738034120c302,dex,1inch,190997,0
0x79564a41508da86721edadac07a590b5a51b2c01,lending,maker,1,0
0xea7fe6610e6708e2affa202948ca19ace3f580ae,lending,maker,1,0
0xcc89f368aad8d424d3e759c1525065e56019a0f4,lending,maker,1,0
0x76024a8effcfe270e089964a562ece6ea5f3a14c,lending,maker,1,0
0xf738c272d648cc4565eafb43c0c5b35bba3bf29d,lending,maker,1,0
0xc94ee71e909dbe08d63aa9e6efbc9976751601b4,lending,maker,1,0
0x022ff40643e8b94c43f0a1e54f51ef6d070acbc4,lending,maker,1,0
0xa475582e3d6ec35091eae81da3b423c1b27fa029,lending,maker,1,0
0x8acec2d937a4a4caf42565afbbb05ac242134f14,lending,maker,1,0
0xad609ed16157014ef955c94553e40e94a09049f0,lending,maker,1,0
0x863aea7d2c4bf2b5aa191b057240b6dc29f532eb,lending,maker,1,0
0x5396e541e1f648ec03faf338389045f1d7691960,lending,maker,1,0
0x4e88ce740f6bea31c2b14134f6c5eb2a63104fcf,lending,maker,1,0
0x0fca4ba0b80123b5d22dd3c8bf595f3e561d594d,lending,maker,1,0
0xd6fe411284b92d309f79e502dd905d7a3b02f561,lending,maker,1,0
0x059acdf311e38aaf77139638228d393ff27639bf,lending,maker,1,0
0x1cf3de6d570291cdb88229e70037d1705d5be748,lending,maker,1,0
0xab98de83840b8367046383d2adef9959e130923e,lending,maker,1,0
0xf7e80359cb9c4e6d178e6689ed8a6a6f91060747,lending,maker,1,0
0xbef2ab2aa5cc780a03bccf22ad3320c8cf35af6a,lending,maker,1,0
0xc0da02939e1441f497fd74f78ce7decb17b66529,lending,compound,233,0
0xc25a3a3b969415c80451098fa907ec722572917f,dex,curvefinance,12903,0
0xa5407eae9ba41422680e2e00537571bcc53efbfd,dex,curvefinance,21931,0
0xfcba3e75865d2d561be8d220616520c171f12851,dex,curvefinance,7739,0
0xb90aaffb61dfc042e7a7abce069ddb4bae9ab192,derivatives,synthetix,2,0
0xa2b0fde6d710e201d0d608e924a484d1a5fed57c,derivatives,synthetix,47,0
0xe1a2c7957a4771031301f2e25b0f52039ad97270,derivatives,synthetix,2,0
0xc14103c2141e842e228fbac594579e798616ce7a,derivatives,synthetix,15,0
0x577d4a7395c6a5f46d9981a5f83fa7294926abb0,derivatives,synthetix,2,0
0xbbc455cb4f1b9e4bfc4b73970d360c8f032efee6,derivatives,synthetix,442,0
0x7ac2d37098a65b0f711cffa3be635f1e6acacfab,derivatives,synthetix,2,0
0xe1afe1fd76fd88f78cbf599ea1846231b8ba3b6b,derivatives,synthetix,399,0
0xa9d6ae0f9e9da6ffc357cd155cce18e3491e135d,derivatives,synthetix,2,0
0x27269b3e45a4d3e79a3d6bfee0c8fb13d0d711a6,derivatives,synthetix,19,0
0x3fdf819c3665d6866b5bb0f56e1eda0d7f69b714,derivatives,synthetix,2,0
0x2d7ac061fc3db53c39fe1607fb8cec1b2c162b01,derivatives,synthetix,12,0
0x7b1010586f923cbf61e7c314146853675705751f,derivatives,synthetix,2,0
0x79da1431150c9b82d2e5dfc1c68b33216846851e,derivatives,synthetix,6,0
0x6e9bac2827dbba78d11b270115086cc357988928,derivatives,synthetix,2,0
0x14d10003807ac60d07bb0ba82caeac8d2087c157,derivatives,synthetix,12,0
0x0b5b9210d5015fd0c97fb19b32675b19703b0453,dex,curvefinance,1,0
0x739a1df6725657f6a16dc2d5519dc36fd7911a12,derivatives,dydx,1,0
0x0fe4283e0216f94f5f9750a7a11ac54d3c9c38f3,assets,harvestfinance,330,0
0xe11fc0b43ab98eb91e9836129d1ee7c3bc95df50,dex,sushiswap,53,0
0xdfc7adfa664b08767b735de28f9e84cd30492aee,dex,curvefinance,373,0
0xc011a72400e58ecd99ee497cf89e3775d4bd732f,derivatives,synthetix,30191,0
0x1c1d97f6338759ab814a5a717ae359573ab5d5d4,derivatives,synthetix,23,0
0x9d003cc298e7ea141a809c241c0a703176da3ba3,derivatives,synthetix,23,0
0x786b374b5eef874279f4b7b4de16940e57301a58,dex,curvefinance,4,0
0x3e66b66fd1d0b02fda6c811da9e0547970db2f21,dex,balancer,71766,0
0x01bfd82675dbcc7762c84019ca518e701c0cd07e,derivatives,nexus,10,0
0x6d2299c48a8dd07a872fdd0f8233924872ad1071,lending,compound,1,0
0xef701d5389ae74503d633396c4d654eabedc9d78,dex,0x,1,0
0x080bf510fcbf18b91105470639e9561022937712,dex,0x,10941,0
0xdffe798c7172dd6deb32baee68af322e8f495ce0,dex,0x,4,0
0x158edb94d0bfc093952fb3009deeed613042907c,assets,harvestfinance,160,0
0x26582bea67b30af166b7fcd3424ba1e0638ab136,assets,harvestfinance,167,0
0xb4d1d6150dac0d1a994afb2a196adadbe639ff95,assets,harvestfinance,65,0
0x0bc529c00c6401aef6d220be8c6ea1667f6ad93e,assets,yearn,143597,0
0xdef136d9884528e1eb302f39457af0e4d3ad24eb,derivatives,dydx,1,0
0xe94b5eec1fa96ceecbd33ef5baa8d00e4493f4f3,dex,sushiswap,10,0
0x9520b477aa81180e6ddc006fc09fb6d3eb4e807a,assets,vesper,6,0
0xda25ee226e534d868f0dd8a459536b03fee9079b,assets,badger,10,218
0x42afd448df7d96291551f1efe1a590101afb1dff,lending,maker,2,0
0x223809e09ec28c28219769c3ff05c790c213152c,assets,vesper,4,0
0xd40798267795cbf3aeea8e9f8dcbdba9b5281fcc,lending,maker,3,0
0x7ec5697c724895da7f2320bde063bef6215a72e2,derivatives,synthetix,2,0
0x959894a82fbf99d35b12ed1ea81e783296229862,derivatives,synthetix,2,0
0x2971adfa57b20e5a416ae5a708a8655a9c74f723,lending,instadapp,29298,0
0x4c8a1beb8a87765788946d6b19c6c6355194abeb,lending,instadapp,1,0
0x939daad09fc4a9b8f8a9352a485dab2df4f4b3f8,lending,instadapp,2,0
0xd6a602c01a023b98ecfb29df02fba380d3b21e0c,lending,instadapp,1,0
0xb9062896ec3a615a4e4444df183f0531a77218ae,lending,aave,6,0
0x48d7f315fedcad332f68aafa017c7c158bc54760,derivatives,synthetix,884,0
0x76416a4d5190d071bfed309861527431304aa14f,lending,maker,1,0
0x913d3924c2e52b500d5acc6f6080120045dc507b,derivatives,barnbridge,1,0
0xd45ee2f2b70df3b7fb5e9f1053a38205cffca058,derivatives,barnbridge,1,0
0xde5331ac4b3630f94853ff322b66407e0d6331e8,dex,curvefinance,457,0
0x7f55dde206dbad629c080068923b36fe9d6bdbef,dex,curvefinance,185,0
0x11f419adabbff8d595e7d5b223eee3863bb3902c,dex,curvefinance,424,0
0x6589fe1271a0f29346796c6baf0cdf619e25e58e,assets,harvestfinance,633,0
0xc1db00a8e5ef7bfa476395cdbcc98235477cde4e,dex,curvefinance,1,0
0xfed941d39905b23d6faf02c8301d40bd4834e27f,lending,compound,1,0
0xc4269cc7acdedc3794b221aa4d9205f564e27f0d,lending,maker,83,0
0xa41b6ef151e06da0e34b009b86e828308986736d,lending,maker,2,0
0xa6ea3b9c04b8a38ff5e224e7c3d6937ca44c0ef9,lending,maker,8,0
0xef0881ec094552b2e128cf945ef17a6752b4ec5d,dex,sushiswap,13743,0
0x77b68899b99b686f415d074278a9a16b336085a0,lending,maker,1,0
0xee13831ca96d191b688a670d47173694ba98f1e5,lending,maker,1,0
0x68af34129755091e22f91899ceac48657e5a5062,derivatives,barnbridge,395,0
0x2600004fd1585f7270756ddc88ad9cfa10dd0428,lending,maker,1,0
0x4454af7c8bb9463203b66c816220d41ed7837f44,lending,maker,1,0
0xba4cfe5741b357fa371b506e5db0774abfecf8fc,assets,vesper,8321,0
0xa08a721dfb595753fff335636674d76c455b275c,assets,fei,491,0
0xda079a280fc3e33eb11a78708b369d5ca2da54fe,assets,fei,6,0
0xe58f0d2956628921cded2ea6b195fc821c3a2b16,assets,harvestfinance,137,0
0x6555c79a8829b793f332f1535b0efb1fe4c11958,assets,harvestfinance,463,0
0xc11b1268c1a384e55c48c2391d8d480264a3a7f4,lending,compound,5767,0
0xa05e45396703babaa9c276b5e5a9b6e2c175b521,derivatives,synthetix,2,0
0xf185d0682d50819263941e5f4eacc763cc5c6c42,lending,maker,1,0
0x3da9d911301f8144bdf5c3c67886e5373dcdff8e,assets,harvestfinance,1051,0
0x15d3a64b2d5ab9e152f16593cdebc4bb165b5b4a,assets,harvestfinance,1109,0
0x4f7c28ccb0f1dbd1388209c67eec234273c878bd,assets,harvestfinance,2373,0
0x6ac4a7ab91e6fd098e13b7d347c6d4d1494994a2,assets,harvestfinance,1268,0
0x7b8ff8884590f44e10ea8105730fe637ce0cb4f6,assets,harvestfinance,364,0
0xa3cf8d1cee996253fad1f8e3d68bdcba7b3a3db5,assets,harvestfinance,181,0
0x6eeb68b2c7a918f36b78e2db80dcf279236ddfb8,lending,maker,2,0
0xf650c3d88d12db855b8bf7d11be6c55a4e07dcc9,lending,compound,19284,0
0xddc46a3b076aec7ab3fc37420a8edd2959764ec4,lending,compound,1,0
0x02557a5e05defeffd4cae6d83ea3d173b272c904,lending,compound,6,0
0x5a464c28d19848f44199d003bef5ecc87d090f87,lending,maker,2,0
0x8067259ea630601f319fcce477977e55c6078c13,lending,maker,1,0
0xf45ae69cca1b9b043dae2c83a5b65bc605bec5f5,lending,maker,1,0
0x98d7ccf403b8bd2f6dc3f3ca4161f1e8db3dd080,derivatives,synthetix,1,0
0x6d16cf3ec5f763d4d99cb0b0b110eefd93b11b56,derivatives,synthetix,13,0
0xf92be89bf1aeba61ac48d90cf7c9ac2b3616c4da,derivatives,synthetix,1,0
0xa5a5df41883cdc00c4ccc6e8097130535399d9a3,derivatives,synthetix,3,0
0x571ff5b7b346f706aa48d696a9a4a288e9bb4091,dex,curvefinance,21,0
0xc5680d24c3086e10f618b5176a59e90d6284be9f,derivatives,synthetix,2,0
0x3fb1f228168432688b4e851fe909907248cf9ecd,derivatives,synthetix,2,0
0x1b40183efb4dd766f11bda7a7c3ad8982e998421,assets,vesper,18645,0
0xb6909b960dbbe7392d405429eb2b3649752b4838,lending,compound,425,0
0xa3c5a1e09150b75ff251c1a7815a07182c3de2fb,assets,convex,4,0
0x7f0d2c2838c6ac24443d13e23d99490017bde370,assets,fei,1,0
0x43ae8037179a5746d618da077a38ddeea9640cba,derivatives,synthetix,5,0
0x613c773c7a1d85d2f1dcc051b0573d33470762eb,derivatives,synthetix,18,0
0xd81da8d904b52208541bade1bd6595d8a251f8dd,dex,curvefinance,246,0
0x2fe94ea3d5d4a175184081439753de15aef9d614,dex,curvefinance,546,0
0x11137b10c210b579405c21a07489e28f3c040ab1,dex,curvefinance,166,0
0xd5bcf53e2c81e1991570f33fa881c49eea570c8d,dex,curvefinance,499,0
0x798d1be841a82a273720ce31c822c61a67a601c3,assets,badger,10620,0
0xfd4d8a17df4c27c1dd245d153ccf4499e806c87d,dex,curvefinance,587,0
0x3472a5a71965499acd81997a54bba8d852c6e53d,assets,badger,47056,0
0xcffdded873554f362ac02f8fb1f02e5ada10516f,lending,compound,2617,0
0xcee60cfa923170e4f8204ae08b4fa6a3f5656f3a,dex,curvefinance,1856,0
0xf178c0b5bb7e7abf4e12a4838c7b7c5ba2c623c0,dex,curvefinance,1858,0
0xaea6c312f4b3e04d752946d329693f7293bc2e6d,dex,curvefinance,384,0
0xbea7cdfb4b49ec154ae1c0d731e4dc773a3265aa,lending,maker,2,0
0x6c186404a7a238d3d6027c0299d1822c1cf5d8f1,lending,maker,7,0
0xdfccaf8fdbd2f4805c174f856a317765b49e4a50,lending,maker,12,0
0x1985365e9f78359a9b6ad760e32412f4a445e862,lending,compound,85900,0
0x075b1bb99792c9e1041ba13afef80c91a1e70fb3,dex,curvefinance,6269,0
0x7fc77b5c7614e1533320ea6ddc2eb61fa00a9714,dex,curvefinance,6002,0
0x7a250d5630b4cf539739df2c5dacb4c659f2488d,dex,uniswap,3078913,0
0x5282a4ef67d9c33135340fb3289cc1711c13638c,dex,curvefinance,945,0
0x2dded6da1bf5dbdf597c45fcfaa3194e53ecfeaf,dex,curvefinance,1250,0
0xf5194c3325202f456c95c1cf0ca36f8475c1949f,dex,curvefinance,501,0
0xd4b6cd147ad8a0d5376b6fdba85fe8128c6f0686,derivatives,dydx,115,0
0x1ef61e3e5676ec182eed6f052f8920fd49c7f69a,derivatives,hegic,116,0
0x878f15ffc8b894a1ba7647c7176e4c01f74e140b,derivatives,hegic,1175,0
0x840a1ae46b7364855206eb5b7286ab7e207e515b,derivatives,hegic,82,0
0x3961245db602ed7c03eeccda33ea3846bd8723bd,derivatives,hegic,633,0
0x20dd9e22d22dd0a6ef74a520cb08303b5fad5de7,derivatives,hegic,425,0
0x57ab1e02fee23774580c119740129eac7081e9d3,derivatives,synthetix,7603,0
0x54a06047087927d9b0fb21c1cf0ebd792764ddb8,lending,compound,4,0
0xb53c1a33016b2dc2ff3653530bff1848a515c8c5,lending,aave,1,0
0x7d2768de32b0b80b7a3454c06bdac94a69ddc7a9,lending,aave,46930,0
0x311bb771e4f8952e6da169b425e7e92d6ac45756,lending,aave,1,0
0x057835ad21a177dbdd3090bb1cae03eacf78fc6d,lending,aave,1,0
0x0a3f6849f78076aefadf113f5bed87720274ddc0,lending,maker,262,0
0x6fcd258af181b3221073a96dd90d1f7ae7eec408,lending,maker,80,0
0x640704d106e79e105fda424f05467f005418f1b5,assets,harvestfinance,240,0
0xdfc14d2af169b0d36c4eff567ada9b2e0cae044f,lending,maker,694,0
0x017ec1772a45d2cf68c429a820ef374f0662c57c,assets,harvestfinance,237,0
0x8d5ed43dca8c2f7dfb20cf7b53cc7e593635d7b9,assets,fei,3,0
0xc7283b66eb1eb5fb86327f08e1b5816b0720212b,assets,fei,30254,0
0x956f47f50a910163d8bf957cf5846d573e7f87ca,assets,fei,16811,0
0x94b0a3d511b6ecdb17ebf877278ab030acb0a878,assets,fei,42,0
0x9928e4046d7c6513326ccea028cd3e7a91c7590a,assets,fei,5993,0
0x087f35bd241e41fc28e43f0e8c58d283dd55bd65,assets,fei,15,0
0xe1578b4a32eaefcd563a9e6d0dc02a4213f673b7,assets,fei,35,0
0xe087f94c3081e1832dc7a22b48c6f2b5faae579b,assets,fei,618,0
0xbffb152b9392e38cddc275d818a3db7fe364596b,assets,fei,17615,0
0xc67963a226eddd77b91ad8c421630a1b0adff270,lending,maker,70,0
0x71eb894330e8a4b96b8d6056962e7f116f50e06f,lending,maker,8,0
0xc2b12567523e3f3cbd9931492b91fe65b240bc47,lending,maker,19,0
0x0227b54adbfaeec5f1ed1dfa11f54dcff9076e2c,lending,maker,29,0
0x7d9f92daa9254bbd1f479dbe5058f74c2381a898,lending,maker,1,0
0x19e26067c4a69b9534adf97ed8f986c49179de18,lending,maker,1,0
0x1c4fc274d12b2e1bbdf97795193d3148fcda6108,lending,maker,1,0
0x5f4cea97ca1030c6bd38429c8a0de7cd4981c70a,lending,maker,1,0
0x59543a595b69897b295f12964d3c7c37b3ad29c0,assets,vesper,3,0
0xaf034d882169328caf43b823a4083dabc7eee0f4,lending,maker,1,0
0x3a664ab939fd8482048609f652f9a0b0677337b9,dex,curvefinance,690,0
0x8038c01a0390a8c547446a0b2c18fc9aefecc10c,dex,curvefinance,367,0
0x61e10659fe3aa93d036d099405224e4ac24996d0,dex,curvefinance,629,0
0x13c1542a468319688b89e323fe9a3be3a90ebb27,derivatives,synthetix,2649,0
0x08638ef1a205be6762a8b935f5da9b700cf7322c,lending,maker,11,0
0x259f2584e8a672da3773f91d66567a3229dee93d,derivatives,synthetix,1,0
0x918da91ccbc32b7a6a0cc4ecd5987bbab6e31e6d,derivatives,synthetix,93,0
0x53d244fb46357568dbef082225ccc87cbd94aae8,derivatives,synthetix,2,0
0x4f6296455f8d754c19821cf1ec8febf2cd456e67,derivatives,synthetix,2,0
0x0d1c4e5c07b071aa4e6a14a604d4f6478caac7b4,derivatives,synthetix,1,0
0xd3c8d372bfcd36c2b452639a7ed6ef7dbfdc56f8,derivatives,synthetix,1,0
0xcf9e60005c9aca983caf65d3669a24fdd0775fc0,derivatives,synthetix,6,0
0x9bb05ef2ca7dbaaffc3da1939d1492e6b00f39b8,derivatives,synthetix,2,0
0xb774711f0bc1306ce892ef8c02d0476dcccb46b7,derivatives,synthetix,1,0
0x4d8dbd193d89b7b506be5dc9db75b91da00d6a1d,derivatives,synthetix,4,0
0xab4e760feee20c5c2509061b995e06b542d3112b,derivatives,synthetix,2,0
0xc1aae9d18bbe386b102435a8632c8063d31e747c,derivatives,synthetix,7,0
0x7a3d898b717e50a96fd8b232e9d15f0a547a7eeb,derivatives,synthetix,10,0
0xd905e2eaebe188fc92179b6350807d8bd91db0d8,dex,curvefinance,649,0
0x06364f10b501e868329afbc005b3492902d6c763,dex,curvefinance,662,0
0xa50ccc70b6a011cffddf45057e39679379187287,dex,curvefinance,671,0
0x2f97d9f870a773186cb01742ff298777bbf6f244,assets,harvestfinance,139,0
0x316de40f36da4c54aff11c1d83081555cca41270,assets,harvestfinance,157,0
0x43286f57cf5981a5db56828df91a46cfab983e58,assets,harvestfinance,102,0
0xb492faeda6c9ffb9b9854a58f28d5333ff7a11bc,assets,harvestfinance,65,0
0x0959158b6040d32d04c301a72cbfd6b39e21c9ae,dex,curvefinance,34,0
0x8cf8af108b3b46ddc6ad596aebb917e053f0d72b,dex,curvefinance,1,0
0x64035b583c8c694627a199243e863bb33be60745,assets,harvestfinance,85,0
0x01bd09a1124960d9be04b638b142df9df942b04a,assets,harvestfinance,105,0
0x203e97aa6eb65a1a02d9e80083414058303f241e,assets,harvestfinance,135,0
0x5c0a3f55aac52aa320ff5f280e77517cbaf85524,assets,harvestfinance,155,0
0x76aef359a33c02338902aca543f37de4b01ba1fa,assets,harvestfinance,130,0
0xe2d9fae95f1e68afca7907dfb36143781f917194,assets,harvestfinance,147,0
0x6b4e1e0656dd38f36c318b077134487b9b0cf7a6,assets,harvestfinance,104,0
0xa56522bca0a09f57b85c52c0cc8ba1b5edbc64ef,assets,harvestfinance,84,0
0x1f98431c8ad98523631ae4a59f267346ea31f984,dex,uniswap,19,0
0xb753548f6e010e7e680ba186f9ca1bdab2e90cf2,dex,uniswap,1,0
0xbfd8137f7d1516d3ea5ca83523914859ec47f573,dex,uniswap,1,0
0xb27308f9f90d607463bb33ea1bebb41c27ce5ab6,dex,uniswap,25,0
0xe592427a0aece92de3edee1f18e0157c05861564,dex,uniswap,1169592,0
0x42b24a95702b9986e82d421cc3568932790a48ec,dex,uniswap,1,0
0x91ae842a5ffd8d12023116943e72a606179294f3,dex,uniswap,1,0
0xee6a57ec80ea46401049e92587e52f5ec1c24785,dex,uniswap,1,0
0xc36442b4a4522e871399cd717abdd847ab11fe88,dex,uniswap,55384,0
0xa5644e29708357803b5a882d272c41cc0df92b34,dex,uniswap,7522,0
0x486c85e2bb9801d14f6a8fdb78f5108a0fd932f2,lending,maker,2,0
0x1f9840a85d5af5bf1d1762f925bdaddc4201f984,dex,uniswap,790790,0
0x8e298734681adbfc41ee5d17ff8b0d6d803e7098,assets,harvestfinance,841,0
0xf04a5cc80b1e94c69b48f5ee68a08cd2f09a7c3e,lending,maker,9,0
0x9d0a0443ff4bb04391655b8cd205683d9fa75550,lending,compound,6,0
0x10e138877df69ca44fdc68655f86c88cde142d7f,derivatives,barnbridge,2193,0
0x9d0cf50547d848cc4b6a12bedcf7696e9b334a22,derivatives,barnbridge,1402,0
0x5e74c9036fb86bd7ecdcb084a0673efc32ea31cb,derivatives,synthetix,5325,0
0xaa17a236f2badc98ddc0cf999abb47d47fc0a6cf,dex,curvefinance,691,0
0xa96a65c051bf88b4095ee1f2451c2a9d43f53ae2,dex,curvefinance,857,0
0xd7c49cee7e9188cca6ad8ff264c1da2e69d4cf3b,derivatives,nexus,5290,0
0x5407381b6c251cfd498ccd4a1d877739cb7960b8,derivatives,nexus,322,0
0x4a5c681ddc32acc6cca51ac17e9d461e6be87900,derivatives,nexus,468,0
0x888ea6ab349c854936b98586ce6a17e98bf254b2,derivatives,nexus,2,0
0x055cc48f7968fd8640ef140610dd4038e1b03926,derivatives,nexus,11561,0
0x89d82fdf095083ded96b48fc6462ed5dbd14151f,derivatives,barnbridge,64,0
0x52305c065579a8a620690cc39394514af905ff42,derivatives,dydx,2,0
0xe604fd5b1317babd0cf2c72f7f5f2ad8c00adbe1,assets,harvestfinance,545,0
0xa112c2354d27c2fb3370cc5d027b28987117a268,assets,harvestfinance,294,0
0x84646f736795a8bc22ab34e05c8982cd058328c7,assets,harvestfinance,324,0
0x4938960c507a4d7094c53a8cddcf925835393b8f,assets,harvestfinance,728,0
0xc97ddaa8091abaf79a4910b094830cce5cdd78f4,assets,harvestfinance,175,0
0x3631a32c959c5c52bc90ab5b7d212a8d00321918,assets,harvestfinance,682,0
0xf71042c88458ff1702c3870f62f4c764712cc9f0,assets,harvestfinance,268,0
0xb3b56c7bdc87f9deb7972cd8b5c09329ce421f89,assets,harvestfinance,158,0
0xc6f39cff6797bac5e29275177b6e8e315cf87d95,assets,harvestfinance,147,0
0x843002b1d545ef7abb71c716e6179570582faa40,assets,harvestfinance,3,21
0x0395e4a17ff11d36dac9959f2d7c8eca10fe89c9,assets,harvestfinance,405,0
0x6d10ed2cf043e6fcf51a0e7b4c2af3fa06695707,dex,curvefinance,383,0
0x12392f67bdf24fae0af363c24ac620a2f67dad86,lending,compound,287,0
0xc7bdd1f2b16447dcf3de045c4a039a60ec2f0ba3,lending,maker,49,0
0x0f5d2fb29fb7d3cfee444a200298f468908cc942,lending,maker,402089,0
0x22f9dcf4647084d6c31b2765f6910cd85c178c18,dex,0x,3,0
0xdcb6a51ea3ca5d3fd898fd6564757c7aaec3ca92,derivatives,synthetix,4645,0
0x618f9c67ce7bf1a50afa1e7e0238422601b0ff6e,dex,0x,11,0
0xdef1c0ded9bec7f1a1670819833240f027b25eff,dex,0x,259986,0
0xccf4429db6322d5c611ee964527d42e5d685dd6a,lending,compound,2523,0
0x82c41e2ade28c066a5d3a1e3f5b444a4075c1584,lending,maker,1,0
0xabbcd14fedbb2d39038327055d9e615e178fd64d,lending,maker,1,0
0x1f546560eaa70985d962f1562b65d4b182341a63,lending,maker,1,0
0x6856cca4c881caf29b6563ba046c7bb73121fb9d,lending,maker,1,0
0x29cfbd381043d00a98fd9904a431015fef07af2f,lending,maker,1,0
0x5ba1e12693dc8f9c48aad8770482f4739beed696,dex,uniswap,26,0
0x3d22e6f643e2f4c563fd9db22b229cbb0cd570fb,lending,maker,8,0
0xdc90d461e148552387f3ab3ebee0bdc58aa16375,lending,maker,13,0
0x006aa3eb5e666d8e006aa647d4afab212555ddea,lending,maker,1,0
0xf5c8176e1eb0915359e46ded16e52c071bb435c0,lending,maker,6,0
0x2bb690931407dca7ece84753ea931ffd304f0f38,lending,maker,4,0
0x6aac067bb903e633a422de7be9355e62b3ce0378,lending,maker,7,0
0x81c5cdf4817dbf75c7f08b8a1cdab05c9b3f70f7,lending,maker,7,0
0x3713f83ee6d138ce191294c131148176015bc29a,lending,maker,11,0
0x834719bea8da68c46484e001143bdde29370a6a3,lending,maker,3,0
0x8723b74f598de2ea49747de5896f9034cc09349e,lending,maker,7,0
0x93ae03815baf1f19d7f18d9116e4b637cc32a131,lending,maker,4,0
0x9f6981ba5c77211a34b76c6385c0f6fa10414035,lending,maker,1,0
0xb15afab996904170f87a64fe42db0b64a6f75d24,lending,maker,2,0
0x2ac4c9b49051275acb4c43ec973082388d015d48,lending,maker,1,0
0x4fc53a57262b87abda61d6d0db2be7e9be68f6b8,lending,maker,3,0
0x6aa0520354d1b84e1c6abfe64a708939529b619e,lending,maker,2,0
0x854b252ba15eafa4d1609d3b98e00cc10084ec55,lending,maker,1,0
0x2e118153d304a0d9c5838d5fcb70cefcbec81dc2,lending,maker,1,0
0xebe5e9d77b9dbba8907a197f4c2ab00a81fb0c4e,lending,maker,1,0
0x3cf46da7d65e9aa2168a31b73dd4beea5ca1a1f1,derivatives,barnbridge,261,0
0x61935cbdd02287b511119ddb11aeb42f1593b7ef,dex,0x,17839,0
0x38a795580d0f687e399913a00ddef6a17612c722,dex,0x,3093,0
0x660daf6643191cf0ed045b861d820f283ca078fc,derivatives,barnbridge,133,0
0xba7f8b5fb1b19c1211c5d49550fcd149177a5eaf,dex,0x,8,0
0xa26e80e7dea86279c6d778d702cc413e6cffa777,dex,0x,8484,0
0x6958f5e95332d93d21af0d7b9ca85b8212fee0a5,dex,0x,2271,0
0xd7d147c6bb90a718c3de8c0568f9b560c79fa416,dex,curvefinance,235,0
0x0000000000000000000000000000000000000000,lending,maker,7181,0
0xbf72da2bd84c5170618fbe5914b0eca9638d5eb5,lending,maker,21,0
0x43b4fdfd4ff969587185cdb6f0bd875c5fc83f8c,dex,curvefinance,4995,0
0x93567318aabd27e21c52f766d2844fc6de9dc738,assets,vesper,1339,0
0x479a8666ad530af3054209db74f3c74ecd295f8d,assets,vesper,651,0
0xd59996055b5e0d154f2851a030e207e0df0343b0,assets,vesper,1722,0
0x830b48539d82a4d34dd670bfe163f9ef84b6c2f1,derivatives,synthetix,1,0
0x7537aae01f3b218dae75e10d952473823f961b87,derivatives,synthetix,35,0
0x815cef3b7773f35428b4353073b086ecb658f73c,derivatives,synthetix,1,0
0xbf416bdf37b1590a3a37a1504865354bf5d90b34,derivatives,synthetix,1,0
0xf50b5e535f62a56a9bd2d8e2434204e726c027fa,derivatives,synthetix,22,0
0xb0e0ba880775b7f2ba813b3800b3979d719f0379,derivatives,synthetix,1,0
0x272bbf5eef131a3eb4a3078a58cfcd0978585f98,derivatives,synthetix,1,0
0xc63b8ecce56ab9c46184ec6ab85e4771fea4c8ad,derivatives,synthetix,20,0
0x438d8701892ab7578ea34f8cdcdcadc93e48d443,derivatives,synthetix,1,0
0x5a7e3c07604eb515c16b36cd51906a65f021f609,derivatives,synthetix,19,0
0x399ba516a6d68d6ad4d5f3999902d0deacaacddd,derivatives,synthetix,1,0
0xc341bd8d6bb064fdd94b5142513027a01c1716c9,derivatives,synthetix,1,0
0x9cf7e61853ea30a41b02169391b393b901eac457,derivatives,synthetix,34,0
0x9530fa32a3059114ac20a5812870da12d97d1174,derivatives,synthetix,1,0
0x346523a81f16030110e6c858ee0e11f156840bd1,assets,harvestfinance,190,0
0xdf5e0e81dff6faf3a7e52ba697820c5e32d806a8,dex,curvefinance,20385,0
0x45f783cce6b7ff23b2ab2d70e416cdb7d6055f51,dex,curvefinance,4648,0
0x7226daaf09b3972320db05f5ab81ff38417dd687,dex,balancer,15,0
0x4dc4a289a8e33600d8bd4cf5f6313e43a37adec7,dex,curvefinance,160,0
0x989aeb4d175e16225e39e87d0d97a3360524ad80,assets,convex,1,0
0x57ab1ec28d129707052df4df418d58a2d46d5f51,derivatives,synthetix,31139,0
0xd71ecff9342a5ced620049e616c5035f1db98620,derivatives,synthetix,1619,0
0xf6b1c627e95bfc3c1b4c9b825a032ff0fbf3e07d,derivatives,synthetix,79,0
0xf48e200eaf9906362bb1442fca31e0835773b8b4,derivatives,synthetix,117,0
0x97fe22e7341a0cd8db6f6c021a24dc8f4dad855f,derivatives,synthetix,124,0
0x0f83287ff768d1c1e17a42f44d644d7f22e8ee1d,derivatives,synthetix,126,0
0x261efcdd24cea98652b9700800a13dfbca4103ff,derivatives,synthetix,857,0
0x6a22e5e94388464181578aa7a6b869e00fe27846,derivatives,synthetix,156,0
0xfe18be6b3bd88a2d2a7f928d00292e7a9963cfc6,derivatives,synthetix,2653,0
0x617aecb6137b5108d1e7d4918e3725c8cebdb848,derivatives,synthetix,144,0
0xf2e08356588ec5cd9e437552da87c0076b4970b0,derivatives,synthetix,15,0
0x2e59005c5c0f0a4d77cca82653d48b46322ee5cd,derivatives,synthetix,12,0
0xeabacd844a196d7faf3ce596edebf9900341b420,derivatives,synthetix,8,0
0xd6014ea05bde904448b743833ddf07c3c7837481,derivatives,synthetix,787,0
0xa9859874e1743a32409f75bb11549892138bba1e,derivatives,synthetix,1978,0
0xafd870f32ce54efdbf677466b612bf8ad164454b,derivatives,synthetix,38,0
0xc5807183a9661a533cb08cbc297594a0b864dc12,derivatives,synthetix,11,0
0x8deef89058090ac5655a99eeb451a4f9183d1678,derivatives,synthetix,9,0
0x336213e1ddfc69f4701fc3f86f4ef4a160c1159d,derivatives,synthetix,5,0
0x25550cccbd68533fa04bfd3e3ac4d09f9e00fc50,assets,harvestfinance,7996,0
0x8f586f063ffbb89b186c8e604fc6614766f9c9d1,derivatives,synthetix,1,0
0x15fd6e554874b9e70f832ed37f231ac5e142362f,derivatives,synthetix,1195,0
0xbed0879953e633135a48a157718aa791ac0108e4,lending,maker,1,0
0x9b0c694c6939b5ea9584e9b61c7815e8d97d9cc7,lending,maker,1,0
0x49d71131396f23f0bce31de80526d7c025981c4d,assets,harvestfinance,2,3
0xc9dfff5fa5605fd94f8b7927b892f2b57391e8bb,derivatives,synthetix,2,0
0xbed04c43e74150794f2ff5b62b4f73820edaf661,assets,harvestfinance,7,7
0x410e3e86ef427e30b9235497143881f717d93c2a,dex,curvefinance,768,0
0x071c661b4deefb59e2a3ddb20db036821eee8f4b,dex,curvefinance,562,0
0xc45b2eee6e09ca176ca3bb5f7eee7c47bf93c756,dex,curvefinance,745,0
0x2b005af087bb14e3887a8572807095404796105a,derivatives,dydx,3,0
0x992058b7db08f9734d84485bfbc243c4ee6954a7,derivatives,synthetix,14,0
0x0f393ce493d8fb0b83915248a21a3104932ed97c,derivatives,synthetix,1,0
0x73b1a2643507cd30f11dfcf2d974f4373e5bc077,derivatives,synthetix,1,0
0x1715ac0743102bf5cd58efbb6cf2dc2685d967b6,derivatives,synthetix,21,0
0xfd0435a588bf5c5a6974ba19fa627b772833d4eb,derivatives,synthetix,1,0
0x6e6d86d88d2ce382918eb4f062f0fff82b8c9b99,derivatives,synthetix,1,0
0xd31533e8d0f3df62060e94b3f1318137bb6e3525,derivatives,synthetix,2,0
0x4287dac1cc7434991119eba7413189a66ffe65cf,derivatives,synthetix,1,0
0x5f298bd4391d32af25368fa78dc210a56c7ccc9c,derivatives,synthetix,1,0
0xeb029507d3e043dd6c87f2917c4e82b902c35618,derivatives,synthetix,5,0
0x34c76bc146b759e58886e821d62548ac1e0ba7bc,derivatives,synthetix,1,0
0xc43c0d8b2a3509d193974695568164c190af2aaf,derivatives,synthetix,1,0
0x176c674ee533c6139b0dc8b458d72a93dcb3e705,derivatives,synthetix,2,0
0x1cb27ac646afae192df9928a2808c0f7f586af7d,derivatives,synthetix,1,0
0x13cab49e4484c2e0624d2bdf3dadfad43e5611f9,derivatives,synthetix,1,0
0x36a00ff9072570ef4b9292117850b8fe08d96cce,derivatives,synthetix,2,0
0x3dd7b893c25025cabfbd290a5e06baff3de335b8,derivatives,synthetix,1,0
0x643088ad7a6ceb1ec95be0e7b382438399ca8e7c,derivatives,synthetix,1,0
0x592244301cea952d6dab2fdc1fe6bd9e53917306,derivatives,synthetix,2,0
0x1a4505543c92084be57ed80113eab7241171e7a8,derivatives,synthetix,1,0
0x41d85df6513a86eb2ea186e2cf4ec0fe5dd16754,derivatives,synthetix,1,0
0x46a97629c9c1f58de6ec18c7f536e7e6d6a6ecde,derivatives,synthetix,3,0
0xf6ce55e09de0f9f97210aaf6db88ed6b6792ca1f,derivatives,synthetix,1,0
0x348c3c80c4f23574bc8cdf669a0dc106a4e32bff,derivatives,synthetix,1,0
0x0fed38108bdb8e62ef7b5680e8e0726e2f29e0de,derivatives,synthetix,2,0
0xacaab69c2ba65a2db415605f309007e18d4f5e8c,derivatives,synthetix,1,0
0x673be1f8b8e1f2ab64c475b44060ee39163423f0,derivatives,synthetix,1,0
0x6345728b1cce16e6f8c509950b5c84fff88530d9,derivatives,synthetix,2,0
0x9a5ea0d8786b8d17a70410a905aed1443fae5a38,derivatives,synthetix,1,0
0x6d1b6ea108aa03c6993d8010690264ba96d349a8,assets,harvestfinance,325,0
0x0000000022d53366457f9d5e68ec105046fc4383,dex,curvefinance,2,0
0x16e58463eb9792bc236d8860f5bc69a81e26e32b,dex,sushiswap,2451,0
0xe20c31e3d08027f5aface84a3a46b7b3b165053c,assets,harvestfinance,2,0
0x89d24a6b4ccb1b6faa2625fe562bdd9a23260359,lending,compound,250110,0
0x3ef51736315f52d568d6d2cf289419b9cfffe782,dex,1inch,5502,0
0xc80573c8d53ea1bba1ed505bbb537dcd4adb9067,assets,vesper,4,0
0x6b3595068778dd592e39a122f4f5a5cf09c90fe2,dex,sushiswap,206959,0
0xc2edad668740f1aa35e4d8f227fb8e17dca888cd,dex,sushiswap,38387,0
0x3ed3b47dd13ec9a98b44e6204a523e766b225811,lending,aave,1955,0
0xe91d55ab2240594855abd11b3faae801fd4c4687,lending,aave,16,0
0x531842cebbdd378f8ee36d171d6cc9c4fcf475ec,lending,aave,108,0
0x9ff58f4ffb29fa2266ab25e75e2a8b3503311656,lending,aave,2165,0
0x51b039b9afe64b78758f8ef091211b5387ea717c,lending,aave,3,0
0x9c39809dec7f95f5e0713634a4d0701329b3b4d2,lending,aave,29,0
0x030ba81f1c18d280636f32af80b9aad02cf0854e,lending,aave,14892,0
0x4e977830ba4bd783c0bb7f15d3e243f73ff57121,lending,aave,530,0
0xf63b34710400cad3e044cffdcab00a0f32e33ecf,lending,aave,4735,0
0x5165d24277cd063f5ac44efd447b27025e888f37,lending,aave,663,0
0x7ebd09022be45ad993baa1cec61166fcc8644d97,lending,aave,6,0
0xdf7ff54aacacbff42dfe29dd6144a69b629f8c9e,lending,aave,135,0
0x85791d117a392097590bded3bd5abb8d5a20491a,lending,aave,1,0
0xb9d7cb55f463405cdfbe4e90a6d2df01c2b92bf1,lending,aave,1021,0
0x5bdb050a92cadccfcdcccbfc17204a1c9cc0ab73,lending,aave,10,0
0xdcd33426ba191383f1c9b431a342498fdac73488,lending,aave,5921,0
0x545973f28950f50fc6c7f52aab4ad214a27c0564,derivatives,synthetix,2,0
0xe1f64079ada6ef07b03982ca34f1dd7152aa3b86,derivatives,synthetix,364,0
0x9a8541ddf3a932a9a922b607e9cf7301f1d47bd1,dex,sushiswap,3,0
0x29c295b046a73cde593f21f63091b072d407e3f2,derivatives,synthetix,2,0
0x33c8d6f8271675eda1a0e72558d4904c96c7a888,derivatives,barnbridge,7,0
0x9625885db4e75e9dccf856e640886853bc6d6584,derivatives,barnbridge,11,0
0x894b65cfae8a48f2098411a9e0ff3b138722ed12,derivatives,barnbridge,9,0
0xa3991e7fe9e51e7b6fd116c36f8aafdf7e431758,derivatives,barnbridge,1,0
0xe59b4c22ba42e93029ded3bd1a1de1e3ce175d48,derivatives,barnbridge,1,0
0x1ff76b7cc4252f8281f49f005ccf2ea477344830,derivatives,barnbridge,8,0
0xc2227743d7462f710bced7f35145fd3cea67bb43,derivatives,barnbridge,4,0
0x57977c37f1be0406cf0960f3d1ed1328341149f7,derivatives,barnbridge,1,0
0x09c1723110382bba314c1fb69081582ba2265eac,derivatives,barnbridge,4,0
0xac38ee05c0204a1e119c625d0a560d6731478880,assets,fei,1,0
0x272f97b7a56a387ae942350bbc7df5700f8a4576,lending,aave,259,0
0x13210d4fe0d5402bd7ecbc4b5bc5cfca3b71adb0,lending,aave,2,0
0xefc0eeadc1132a12c9487d800112693bf49ecfa2,derivatives,hegic,1404,0
0x74cc5bc20b0c396df5680ee4aeb6169a6288a8af,assets,vesper,10,0
0xef1a94af192a88859eaf3f3d8c1b9705542174c5,assets,fei,11,0
0x18305daae09ea2f4d51faa33318be5978d251abd,assets,fei,4686,0
0x70e36f6bf80a52b3b46b3af8e106cc0ed743e8e4,lending,compound,10433,0
0xb65cef03b9b89f99517643226d76e286ee999e77,assets,badger,11,0
0x152d13e62952a7c74c536bb3c8b7bd91853f076a,assets,fei,4,0
0x519afb566c05e00cfb9af73496d00217a630e4d5,dex,curvefinance,1,0
0x1115c9b3168563354137cdc60efb66552dd50678,dex,curvefinance,8,0
0xca9aeeb14ff396f8661f7df3128f88c31d2fdec5,assets,vesper,169,0
0x7e7e112a68d8d2e221e11047a72ffc1065c38e1a,assets,badger,6214,0
0x4a8651f2edd68850b944ad93f2c67af817f39f62,assets,badger,1,0
0x4b0181102a0112a2ef11abee5563bb4a3176c9d7,lending,compound,306,0
0x80a2ae356fc9ef4305676f7a3e2ed04e12c33946,lending,compound,94,0
0xe65cdb6479bac1e22340e4e755fae7e509ecd06c,lending,compound,183,0
0xcd9d4988c0ae61887b075ba77f08cbfad2b65068,derivatives,synthetix,3636,0
0x5fd79d46eba7f351fe49bff9e87cdea6c821ef9f,derivatives,synthetix,3,0
0x71cd6666064c3a1354a3b4dca5fa1e2d3ee7d303,dex,1inch,460,0
0x5d3a536e4d6dbd6114cc1ead35777bab948e3643,lending,compound,42638,0
0x6324538cc222b43490dd95cebf72cf09d98d9dae,derivatives,barnbridge,89,0
0x0ac6a1d74e84c2df9063bddc31699ff2a2bb22a2,lending,maker,3,0
0xd69eabdf940174ca571a6d71dde9b9a4dbcdbb0f,derivatives,synthetix,2,0
0xca0d3004f5e771a129fb94619f8867a23e8a23de,derivatives,synthetix,2,0
0xf11a98339fe1cde648e8d1463310ce3ccc3d7cc1,lending,maker,3,0
0xdae88bde1fb38cf39b6a02b595930a3449e593a6,lending,maker,2,0
0x81fe72b5a8d1a857d176c3e7d5bd2679a9b85763,lending,maker,7,0
0xb4eb54af9cc7882df0121d26c5b97e802915abe6,lending,maker,1,0
0xf0de877f2f9e7a60767f9ba662f10751566ad01c,derivatives,synthetix,105,0
0x3bc3a58b4fc1cbe7e98bb4ab7c99535e8ba9b8f1,lending,maker,8,0
0xfd5608515a47c37afba68960c1916b79af9491d0,lending,maker,2,0
0x19f8ce19c9730a1d0db5149e65e48c2f0daa9919,assets,harvestfinance,58,0
0x45a760b3e83ff8c107c4df955b1483de0982f393,assets,harvestfinance,133,0
0xf164fc0ec4e93095b804a4795bbe1e041497b92a,dex,uniswap,12611,0
0xbbbbca6a901c926f240b89eacb641d8aec7aeafd,lending,maker,128494,0
0x7a5918670b0c390ad25f7bee908c1acc2d314a3c,lending,maker,2,0
0x043b963e1b2214ec90046167ea29c2c8bdd7c0ec,lending,maker,1,0
0xeb4c2781e4eba804ce9a9803c67d0893436bb27d,assets,renvm,16895,0
0xe4b679400f0f267212d5d812b95f58c83243ee71,assets,renvm,4580,0
0x1c5db575e2ff833e46a2e9864c22f4b22e0b37c2,assets,renvm,538,0
0xc3bbd5adb611dd74eca6123f05b18acc886e122d,assets,renvm,213,0
0x459086f2376525bdceba5bdda135e4e9d3fef5bf,assets,renvm,206,0
0xcc4ff5b8a4a7adb35f00ff0cbf53784e07c3c52f,assets,renvm,76,0
0xe33417797d6b8aec9171d0d6516e88002fbe23e7,assets,renvm,1,0
0x098e1708b920efbdd7afe33adb6a4cba30c370b9,assets,renvm,3073,0
0x32666b64e9fd0f44916e1378efb2cfa3b3b96e80,assets,renvm,7998,0
0x9523fdc055f503f73ff40d7f66850f409d80ef34,assets,harvestfinance,123,0
0x11111112542d85b3ef69ae05771c2dccff4faa26,dex,1inch,297033,0
0x1c86b3cdf2a60ae3a574f7f71d44e2c50bddb87e,derivatives,synthetix,8,0
0x9bced8a8e3ad81c9b146ffc880358f734a06f7c0,derivatives,synthetix,1,0
0xd2df355c19471c8bd7d8a3aa27ff4e26a21b4076,derivatives,synthetix,20,0
0xab38249f4f56ef868f6b5e01d9cfa26b952c1270,derivatives,synthetix,1,0
0x9234733bd0f3e227e431bbe7b09ceb0e3e9755e3,derivatives,synthetix,1,0
0x30635297e450b930f8693297eba160d9e6c8ebcf,derivatives,synthetix,14,0
0xaa1b12e3e5f70abccd1714f4260a74ca21e7b17b,derivatives,synthetix,1,0
0xf61f4a57c63340ac1fd75578ae878c8a263aec06,derivatives,synthetix,1,0
0xc25167ffa19b4d9d03c7d5aa4682c7063f345b66,assets,renvm,2,0
0x60ab11fe605d2a2c3cf351824816772a131f8782,assets,renvm,3,0
0x2d7b6c95afeffa50c068d50f89c5c0014e054f0a,assets,renvm,1261,0
0x64512ff05a27756694e306e483cbb725f1754c0e,assets,renvm,2,0
0xe80d347df1209a76dd9d2319d62912ba98c54ddd,assets,renvm,2,0
0xda4ef8520b1a57d7d63f1e249606d1a459698876,derivatives,synthetix,4694,0
0xbe5b5a7c198bc156474ed5c33cbf2f3f604f8ff8,derivatives,synthetix,1,0
0x5c8344bcdc38f1ab5eb5c1d4a35ddeea522b5dfa,derivatives,synthetix,77,0
0x8a1a00df7aa0102497c7591912ba8301e8db8cdb,derivatives,synthetix,1,0
0xaa03ab31b55dceeef845c8d17890cc61cd98ed04,derivatives,synthetix,29,0
0x13a114a3fa8a6ce03a0c5488be9e614d78eddb0c,derivatives,synthetix,1,0
0x1f2c3a1046c32729862fcb038369696e3273a516,derivatives,synthetix,167,0
0x12dc1273915a16ab8bd47ba7866b240c253e4c12,derivatives,synthetix,2,0
0xced4055b47cfd0421f3727a35f69ce659c8baf7a,derivatives,synthetix,2,0
0xab0b2f1cf979cdbf4676251f35353ec5af2732dd,derivatives,synthetix,1,0
0xc25c37c387c5c909a94055f4f16184ca325d3a76,derivatives,barnbridge,1366,0
0xa79828df1850e8a3a3064576f380d90aecdd3359,dex,curvefinance,9939,0
0x7abdbaf29929e7f8621b757d2a7c04d78d633834,dex,curvefinance,690,0
0x95b4ef2869ebd94beb4eee400a99824bf5dc325b,lending,compound,109,0
0x8a32f49ffba88aba6eff96f45d8bd1d4b3f35c7d,lending,aave,1,0
0x8fa7490cedb7207281a5ceabee12773046de664e,derivatives,futureswap,3,0
0x52d306e36e3b6b02c153d0266ff0f85d18bcd413,lending,aave,1,0
0x84a24deca415acc0c395872a9e6a63e27d6225c8,assets,fei,1,0
0xd547bd7ebcda779f611192b2aae25c5cb6c7e497,derivatives,futureswap,1,0
0x0e192d382a36de7011f795acc4391cd302003606,derivatives,futureswap,3789,0
0xeb21209ae4c2c9ff2a86aca31e123764a3b6bc06,dex,curvefinance,3052,0
0x3659ae5f9b009603a4900891aabef828c8350df1,derivatives,futureswap,1,0
0xd1ed35a3ee043683a1833509de8f2c1a0d8777b7,derivatives,futureswap,577,0
0xef9d095cd04e4e8240771b5fdcb8f2f74d0815ff,derivatives,futureswap,39,0
0xac795d2c97e60df6a99ff1c814727302fd747a80,dex,curvefinance,577,0
0xbbc81d23ea2c3ec7e56d39296f0cbb648873a5d3,dex,curvefinance,12708,0
0x45797531b873fd5e519477a070a955764c1a5b07,dex,0x,2,0
0xb6c057591e073249f2d9d88ba59a46cfc9b59edb,dex,curvefinance,2091,0
0xc4be7f74ee3743bded8e0fa218ee5cf06397f472,lending,maker,1,0
0x5c69bee701ef814a2b6a3edd4b1652cb9cc5aa6f,dex,uniswap,408,0
0x69951b60b6253697f29c8311bfcea6da09bbac0d,derivatives,barnbridge,95,0
0xeadfc8b994bf3ee23dc0033e6f11dee4b166672e,derivatives,barnbridge,77,0
0x51d924bf2ff813a68bd5f86cdcc98918f2ae5868,derivatives,barnbridge,106,0
0xf4bde50cdf4ee4cf3fb8702fceb6fd499a92792d,derivatives,barnbridge,217,0
0x251fe6e78d0da0470ab2060e14cdb8216fdf5425,assets,vesper,2,0
0x0d4a11d5eeaac28ec3f61d100daf4d40471f1852,lending,maker,14051,0
0xec2d2240d02a8cf63c3fa0b7d2c5a3169a319496,lending,compound,84,0
0x231b7589426ffe1b75405526fc32ac09d44364c4,lending,maker,43,0
0xed52d8e202401645edad1c0aa21e872498ce47d0,dex,balancer,13,0
0xa3f6ea08d4083095ec4c363d9cbc629b85029490,assets,vesper,1,0
0x93054188d876f558f4a66b2ef1d97d16edf0895b,dex,curvefinance,5516,0
0xb19059ebb43466c323583928285a49f558e572fd,dex,curvefinance,1062,0
0x4ca9b3063ec5866a4b82e437059d2c43d1be596f,dex,curvefinance,1382,0
0x4c18e409dc8619bfb6a1cb56d114c3f592e0ae79,dex,curvefinance,695,0
0xca0c34a3f35520b9490c1d58b35a19ab64014d80,assets,vesper,96,0
0xc0d8994cd78ee1980885df1a0c5470fc977b5cfe,derivatives,synthetix,2,0
0xd6930b7f661257da36f93160149b031735237594,dex,curvefinance,51,0
0xda0ab1e0017debcd72be8599041a2aa3ba7e740f,lending,maker,3,0
0xa0446d8804611944f1b527ecd37d7dcbe442caba,dex,1inch,12017,0
0x0f85a912448279111694f4ba4f85dc641c54b594,dex,1inch,5729,0
0xd0660cd418a64a1d44e9214ad8e459324d8157f1,assets,yearn,4702,0
0x3a494d79aa78118795daad8aeff5825c6c8df7f1,assets,badger,1,0
0x612f681bcd12a0b284518d42d2dbcc73b146eb65,assets,badger,731,0
0x24e459f61ceaa7b1ce70dbaea938940a7c5ad46e,lending,maker,4,0
0x8df8f06dc2de0434db40dcbb32a82a104218754c,lending,maker,1,0
0x408e41876cccdc0f92210600ef50372656052a38,assets,renvm,156934,0
0xec163986cc9a6593d6addcbff5509430d348030f,lending,compound,9,0
0xbb8be4772faa655c255309afc3c5207aa7b896fd,lending,compound,1,0
0x90e00ace148ca3b23ac1bc8c240c2a7dd9c2d7f5,dex,curvefinance,1,0
0x8e870d67f660d95d5be530380d0ec0bd388289e1,lending,maker,302074,0
0x4e3fbd56cd56c3e72c1403e103b45db9da5b9d2b,assets,convex,28970,0
0xf403c135812408bfbe8713b5a23a04b3d48aae31,assets,convex,12126,0
0x62b9c7356a2dc64a1969e19c23e4f579f9810aa7,assets,convex,10166,0
0x8014595f2ab54cd7c604b00e9fb932176fdc86ae,assets,convex,9562,0
0x3fe65692bfcd0e6cf84cb1e7d24108e434a7587e,assets,convex,8664,0
0xcf50b810e57ac33b91dcf525c6ddd9881b139332,assets,convex,6412,0
0x3b2d30734491ad77880d31e8afe2a4d8ac135a9c,assets,convex,1,0
0x25e12482a25cf36ec70fda2a09c1ed077fc21616,assets,convex,1,0
0x5f465e9fcffc217c5849906216581a657cd60605,assets,convex,1017,0
0xe98984ad858075813ada4261af47e68a64e28fcc,assets,convex,26,0
0xa1bc2cf69d474b39b91665e24e7f2606ed142991,assets,convex,1,0
0x2e088a0a19dda628b4304301d1ea70b114e4accd,assets,convex,2626,0
0x05767d9ef41dc40689678ffca0608878fb3de906,assets,convex,1830,0
0x33f6ddaea2a8a54062e021873bcaee006cdf4007,assets,convex,1201,0
0xd37ee7e4f452c6638c96536e68090de8cbcdb583,lending,aave,320,0
0x279af5b99540c1a3a7e3cdd326e19659401ef99e,lending,aave,12,0
0x7a56d65254705b4def63c68488c0182968c452ce,assets,badger,1,0
0x0760dfe09bd6d04d0df9a60c51f01ecedceb5132,assets,fei,15,0
0xc5cfada84e902ad92dd40194f0883ad49639b023,dex,curvefinance,1004,0
0x5b5cfe992adac0c9d48e05854b2d91c73a003858,dex,curvefinance,189,0
0x3ef6a01a0f81d6046290f3e2a8c5b843e738e604,dex,curvefinance,165,0
0x2db0e83599a91b508ac268a6197b8b14f5e72840,dex,curvefinance,64,0
0x19b3eb3af5d93b77a5619b047de0eed7115a19e7,dex,sushiswap,15,0
0x76481caa104b5f6bccb540dae4cefaf1c398ebea,dex,0x,2591,0
0xa14857e8930acd9a882d33ec20559beb5479c8a6,dex,0x,612,0
0xecb456ea5365865ebab8a2661b0c503410e9b347,dex,curvefinance,40,0
0x6c9dae2c40b1e5883847bf5129764e76cb69fc57,derivatives,barnbridge,134,0
0x25d03c2c928ade19ff9f4ffecc07d991d0df054b,lending,maker,2,0
0xffc97d72e13e01096502cb8eb52dee56f74dad7b,lending,aave,1780,0
0x05ec93c0365baaeabf7aeffb0972ea7ecdd39cf1,lending,aave,200,0
0x277f8676facf4daa5a6ea38ba511b7f65aa02f9f,lending,aave,1,0
0xfc218a6dfe6901cb34b1a5281fc6f1b8e7e56877,lending,aave,14,0
0xa361718326c15715591c299427c62086f69923d9,lending,aave,248,0
0x4a7a63909a72d268b1d8a93a9395d098688e0e5c,lending,aave,2,0
0xba429f7011c9fa04cdd46a2da24dc0ff0ac6099c,lending,aave,21,0
0x028171bca77440897b824ca71d1c56cac55b68a3,lending,aave,3157,0
0x778a13d3eeb110a4f7bb6529f99c000119a08e92,lending,aave,30,0
0x6c3c78838c761c6ac7be9f59fe808ea2a6e4379d,lending,aave,255,0
0xac6df26a590f08dcc95d5a4705ae8abbc88509ef,lending,aave,368,0
0x38995f292a6e31b78203254fe1cdd5ca1010a446,lending,aave,1,0
0x39c6b3e42d6a679d7d776778fe880bc9487c2eda,lending,aave,181,0
0xa06bc25b5805d5f8d82847d191cb4af5a3e873e0,lending,aave,2167,0
0x0b8f12b1788bfde65aa1ca52e3e9f3ba401be16d,lending,aave,14,0
0xa685a61171bb30d4072b338c80cb7b2c865c873e,lending,aave,316,0
0x0a68976301e46ca6ce7410db28883e309ea0d352,lending,aave,4,0
0xc713e5e149d5d0715dcd1c156a020976e7e56b88,lending,aave,378,0
0xc01c8e4b12a89456a9fd4e4e75b72546bf53f0b5,lending,aave,1,0
0xba728ead5e496be00dcf66f650b6d7758ecb50f8,lending,aave,3,0
0xcc12abe4ff81c9378d670de1b57f8e0dd228d77a,lending,aave,376,0
0x3356ec1efa75d9d150da1ec7d944d9edf73703b7,lending,aave,1,0
0xcd9d82d33bd737de215cdac57fe2f7f04df77fe0,lending,aave,2,0
0x35f6b052c598d933d69a4eec4d04c73a191fe6c2,lending,aave,757,0
0x267eb8cf715455517f9bd5834aeae3cea1ebdbd8,lending,aave,2,0
0x6c5024cd4f8a59110119c56f8933403a539555eb,lending,aave,274,0
0xdc6a3ab17299d9c2a412b0e0a4c1f55446ae0817,lending,aave,13,0
0x101cc05f4a51c0319f570d5e146a8c625198e636,lending,aave,260,0
0x7f38d60d94652072b2c44a18c0e14a481ec3c0dd,lending,aave,1,0
0x01c0eb1f8c6f1c1bf74ae028697ce7aa2a8b0e92,lending,aave,8,0
0xbcca60bb61934080951369a648fb03df4f96263c,lending,aave,4669,0
0xe4922afab0bbadd8ab2a88e0c79d884ad337fca6,lending,aave,26,0
0x619beb58998ed2278e08620f97007e1116d5d25b,lending,aave,168,0
0xa191e578a6736167326d05c119ce0c90849e84b7,lending,maker,6,0
0x19d099670a21bc0a8211a89b84cedf59abb4377f,assets,badger,1,0
0x72c50e6fd8cc5506e166c273b6e814342aa0a3c1,assets,harvestfinance,51,0
0x63cf44b2548e4493fd099222a1ec79f3344d9682,assets,badger,1,0
0x30392694c25fbbe5c026cf846e9b6525a2ac3ec8,assets,badger,1,0
0x19d97d8fa813ee2f51ad4b4e04ea08baf4dffc28,assets,badger,15317,0
0x6def55d2e18486b9ddfaa075bc4e4ee0b28c1545,assets,badger,1098,0
0xd04c48a53c111300ad41190d63681ed3dad998ec,assets,badger,1227,0
0xb9d076fde463dbc9f915e5392f807315bf940334,assets,badger,782,0
0x235c9e24d3fb2fafd58a2e49d454fdcd2dbf7ff1,assets,badger,3104,0
0xbd9c69654b8f3e5978dfd138b00cb0be29f28ccf,assets,badger,2,0
0x0c79406977314847a9545b11783635432d7fe019,assets,badger,1,0
0x75b8e21bd623012efb3b69e1b562465a68944ee6,assets,badger,2,0
0x444b860128b7bf8c0e864bdc3b7a36a940db7d88,assets,badger,2,0
0x3efc97a8e23f463e71bf28eb19690d097797eb17,assets,badger,2,0
0xe2fa197eaa5c726426003074147a08beaa59403b,assets,badger,2,0
0x95826c65eb1f2d2f0edbb7ecb176563b61c60bbf,assets,badger,2,0
0xaf5a1decfa95baf63e0084a35c62592b774a2a87,assets,badger,630,0
0xaae82e3c89e15e6f26f60724f115d5012363e030,assets,badger,3,0
0xa9429271a28f8543efffa136994c0839e7d7bf77,assets,badger,11387,0
0x2296f174374508278dc12b806a7f27c87d53ca15,assets,badger,765,0
0x10fc82867013fce1bd624fafc719bb92df3172fc,assets,badger,1058,0
0x085a9340ff7692ab6703f17ab5ffc917b580a6fd,assets,badger,692,0
0xa207d69ea6fb967e54baa8639c408c31767ba62d,assets,badger,2784,0
0xa464e6dcda8ac41e03616f95f4bc98a13b8922dc,dex,curvefinance,3250,0
0xaa42c0cd9645a58dfeb699ccaefbd30f19b1ff81,dex,curvefinance,1,0
0xc00e94cb662c3520282e6f5717214004a7f26888,lending,compound,405374,0
0xc0da01a04c3f3e0be433606045bb7017a7323e38,lending,compound,896,0
0xcd7989894bc033581532d2cd88da5db0a4b12859,assets,badger,3120,0
0x660802fc641b154aba66a62137e71f331b6d787a,assets,badger,11211,0
0x394dcfbcf25c5400fcc147ebd9970ed34a474543,assets,badger,7798,0
0xcc775989e76ab386e9253df5b0c0b473e22102e2,assets,harvestfinance,83,0
0x29780c39164ebbd62e9ddde50c151810070140f2,assets,harvestfinance,51,0
0x01f9caad0f9255b0c0aa2fbd1c1aa06ad8af7254,assets,harvestfinance,83,0
0xbfb635e8c6689ac3874ad9a60fab1c29270f1710,derivatives,dydx,1,0
0x102e541a34aa7e7205c32ddf58308395d733ce1f,derivatives,synthetix,1,0
0x9eef4ca7ab9fa8bc0650127341c2d3f707a40f8a,derivatives,synthetix,29,0
0x249612f641111022f2f48769f3df5d85cb3e26a2,derivatives,synthetix,1,0
0x7ebeea83591c048a40502985254a3df19ea90067,derivatives,synthetix,1,0
0x745a824d6abbd236aa794b5530062778a6ad7523,derivatives,synthetix,23,0
0x04720dbbd4599ad26811545595d97fb813e84964,derivatives,synthetix,1,0
0x71b9ec42bb3cb40f017d8ad8011be8e384a95fa5,assets,harvestfinance,373,0
0x27f12d1a08454402175b9f0b53769783578be7d9,assets,harvestfinance,363,0
0x2c361913e2da663e1898162ec01497c46eb87abf,assets,vesper,8,0
0x25174c74222a62a9a5aa30e5975da0230f6856b2,assets,vesper,1,0
0x10b2aa5d77aa6484886d8e244f0686ab319a270d,lending,maker,2,0
0xb3efb912e1cbc0b26fc17388dd433cecd2206c3d,lending,maker,3,0
0x476b81c12dc71edfad1f64b9e07caa60f4b156e2,lending,maker,1,0
0xa3342059bcdcfa57a13b12a35ed4bbe59b873005,lending,maker,3,0
0x88f88bb9e66241b73b84f3a6e197fbba487b1e30,lending,maker,1,0
0x8302fe9f0c509a996573d3cc5b0d5d51e4fdd5ec,derivatives,synthetix,114,0
0xb440dd674e1243644791a4adfe3a2abb0a92d309,derivatives,synthetix,8232,0
0x6568d9e750fc44af00f857885dfb8281c00529c4,derivatives,synthetix,2,0
0x4dfacfb15514c21c991ff75bc7bf6fb1f98361ed,derivatives,synthetix,2,0
0xcb29d2cf2c65d3be1d00f07f3441390432d55203,derivatives,synthetix,2,0
0x20569b49d74c1ede765382574f7f3fdc2a078a4f,derivatives,synthetix,2,0
0x0a27e910aee974d05000e05eab8a4b8ebd93d40c,assets,vesper,374,0
0xaf601cbff871d0be62d18f79c31e387c76fa0374,lending,compound,2,0
0x1f206d7916fd3b1b5b0ce53d5cab11fcebc124da,lending,maker,1,0
0x5f626c30ec1215f4edcc9982265e8b1f411d1352,dex,curvefinance,332,0
0x1eb4cf3a948e7d72a198fe073ccb8c7a948cd853,lending,maker,1,0
0x9fc689ccada600b6df723d9e47d84d76664a1f23,dex,curvefinance,592,0
0x52ea46506b9cc5ef470c5bf89f17dc28bb35d85c,dex,curvefinance,995,0
0x7e1e3334130355799f833ffec2d731bca3e68af6,dex,1inch,4,3
0x0000000000004946c0e9f43f4dee607b0ef1fa1c,dex,1inch,31291,0
0xb20bd5d04be54f870d5c0d3ca85d82b34b836405,lending,maker,268,0
0x514cd6756ccbe28772d4cb81bc3156ba9d1744aa,lending,aave,8,0
0x94e131324b6054c0d789b190b2dac504e4361b53,dex,curvefinance,686,0
0x890f4e345b1daed0367a877a1612f86a1f86985f,dex,curvefinance,4418,0
0xb0a0716841f2fc03fba72a891b8bb13584f52f2d,dex,curvefinance,654,0
0x3b7020743bc2a4ca9eaf9d0722d42e20d6935855,dex,curvefinance,301,0
0x194ebd173f6cdace046c53eacce9b953f28411d1,dex,curvefinance,2692,0
0x0ce6a5ff5217e38315f87032cf90686c96627caa,dex,curvefinance,2709,0
0x90bb609649e0451e5ad952683d64bd2d1f245840,dex,curvefinance,1094,0
0xe478de485ad2fe566d49342cbd03e49ed7db3356,dex,curvefinance,1419,0
0xbcff8b0b9419b9a88c44546519b1e909cf330399,dex,curvefinance,231,0
0x99b0d6641a63ce173e6eb063b3d3aed9a35cf9bf,assets,harvestfinance,2409,0
0x7454df5d0758d4e7a538c3acf4841fa9137f0f74,derivatives,dydx,1,0
0x089ab1536d032f54dfbc194ba47529a4351af1b5,derivatives,nexus,1,0
0x1e86044468b92c310800d4b350e0f83387a7097f,assets,vesper,20,0
0xbaf9a5d4b0052359326a6cdab54babaa3a3a9643,dex,1inch,1300,0
0x2eea44e40930b1984f42078e836c659a12301e40,dex,1inch,47,0
0x3ff33d9162ad47660083d7dc4bc02fb231c81677,lending,maker,7,0
0x4a03aa7fb3973d8f0221b466eefb53d0ac195f55,lending,maker,3,0
0x79be75ffc64dd58e66787e4eae470c8a1fd08ba4,lending,aave,4,0
0xf9fb4ad91812b704ba883b11d2b576e890a6730a,lending,aave,442,0
0xd24946147829deaa935be2ad85a3291dbf109c80,lending,aave,3,0
0x17a79792fe6fe5c95dfe95fe3fcee3caf4fe4cb7,lending,aave,5,0
0xdcfe9bfc246b02da384de757464a35efca402797,lending,aave,1,0
0xa4c273d9a0c1fe2674f0e845160d6232768a3064,lending,aave,120,0
0xe340b25fe32b1011616bb8ec495a4d503e322177,lending,aave,1,0
0xb8db81b84d30e2387de0ff330420a4aaa6688134,lending,aave,1,0
0xd109b2a304587569c84308c55465cd9ff0317bfb,lending,aave,1,0
0xfeb4acf3df3cdea7399794d0869ef76a6efaff52,assets,yearn,25,0
0x9f8f72aa9304c8b593d555f12ef6589cc3a579a2,lending,maker,200744,0