,transaction_index,from_address,to_address,value,input,output,trace_type,call_type,reward_type,gas,gas_used,subtraces,trace_address,error,status,trace_id,transaction_hash,block_number,block_id_group
0,8,0xfcb356b88765502b05ac135d3530c65113d99f4b,0x71c7656ec7ab88b098defb751b7401b5f6d8976f,471013000000000,0x,0x,call,call,,189000,0,0,,,1,call_0x03caa6ea28e0fa8bca349b89e2de5d2f1443fe4490ed270ef896cd7cf4c0f120_,0x03caa6ea28e0fa8bca349b89e2de5d2f1443fe4490ed270ef896cd7cf4c0f120,7663871,7663
1,75,0x66a6892477f9b48ed47f407b30dde754405e1910,0x8b353021189375591723e7384262f45709a3c3dc,0,0xa9059cbb0000000000000000000000001ab12128b040d2773d61047386e8eb1b8d0e3ecc00000000000000000000000000000000000000000000000b2451f10e0a860957,,call,call,,26616,,0,,Reverted,0,call_0xd43ecc2970707567262d6175693fcf50768d1532fcfdbaa10822ab85ee3c2bfa_,0xd43ecc2970707567262d6175693fcf50768d1532fcfdbaa10822ab85ee3c2bfa,7627470,7627
2,96,0x22b1ba892638cd21d14e1259ae5dc047195b9f09,0x71c7656ec7ab88b098defb751b7401b5f6d8976f,135891000000000,0x,0x,call,call,,189000,0,0,,,1,call_0x7bf569cc3f6ab7a0ea7190df29887f13057f3b8002c39c761ca9db95fd6d0788_,0x7bf569cc3f6ab7a0ea7190df29887f13057f3b8002c39c761ca9db95fd6d0788,7625334,7625
3,97,0x97cb9e6b564dbfa7e74ede23ce95ce3f55bcdea6,0x71c7656ec7ab88b098defb751b7401b5f6d8976f,261515000000000,0x,0x,call,call,,189000,0,0,,,1,call_0xf5652dc315fb962d0f0d025021a00b3388d5a55daa2841db3061716a7ef3c9dc_,0xf5652dc315fb962d0f0d025021a00b3388d5a55daa2841db3061716a7ef3c9dc,7625334,7625
4,125,0x66a6892477f9b48ed47f407b30dde754405e1910,0xf83301c5cd1ccbb86f466a6b3c53316ed2f8465a,0,0xa9059cbb000000000000000000000000d7b2fd3bba7cbde8f40625d8aff1ddc155463a8e0000000000000000000000000000000000000000000000000000000014163640,0x0000000000000000000000000000000000000000000000000000000000000001,call,call,,29241,29241,0,,,1,call_0x78b5c5d8c20e78f6ef36f2c17d6f19c4cb80052c5c20d4e3e2856b2e27548773_,0x78b5c5d8c20e78f6ef36f2c17d6f19c4cb80052c5c20d4e3e2856b2e27548773,7624116,7624
5,70,0x66a6892477f9b48ed47f407b30dde754405e1910,0xd7b2fd3bba7cbde8f40625d8aff1ddc155463a8e,10000000000000000,0x,0x,call,call,,0,0,0,,,1,call_0xf762698152418bc6f90d1682aa0120366bd769c89dea3bbfa93cf07dced0d94a_,0xf762698152418bc6f90d1682aa0120366bd769c89dea3bbfa93cf07dced0d94a,7624208,7624
6,55,0x66a6892477f9b48ed47f407b30dde754405e1910,0x16f812be7fff02caf662b85d5d58a5da6572d4df,0,0xa9059cbb0000000000000000000000002b0151e35efc1754d055c6156dcd3aed2fd4a09c000000000000000000000000000000000000000000000000000000028f976bc0,0x0000000000000000000000000000000000000000000000000000000000000001,call,call,,28464,28464,0,,,1,call_0x1d68c01e9f3d4d06745a8a7ccc7a53cfa2bc2ae25d32acbf96f2d78f6877030d_,0x1d68c01e9f3d4d06745a8a7ccc7a53cfa2bc2ae25d32acbf96f2d78f6877030d,7623297,7623
7,86,0x66a6892477f9b48ed47f407b30dde754405e1910,0x55296f69f40ea6d20e478533c15a6b08b654e758,0,0xa9059cbb0000000000000000000000001ab12128b040d2773d61047386e8eb1b8d0e3ecc000000000000000000000000000000000000000000000ac16acb6d4347610400,0x,call,call,,30099,30099,0,,,1,call_0xce1a77a843bfd5e1d7ab93d3ed6a7237e64fa0e3fb8db4bd110c01f60bb845b8_,0xce1a77a843bfd5e1d7ab93d3ed6a7237e64fa0e3fb8db4bd110c01f60bb845b8,7623544,7623
8,138,0xe79eef9b9388a4ff70ed7ec5bccd5b928ebb8bd1,0xa888868100e2a027ed97425a2307958b99a9495f,402000000000000000,0x,0x,call,call,,19000,0,0,,,1,call_0x45cc323b559cbe18ad78f2534180ebcabae87749f7bf7b8a46e91f78894594d4_,0x45cc323b559cbe18ad78f2534180ebcabae87749f7bf7b8a46e91f78894594d4,7602493,7602
9,159,0xa888868100e2a027ed97425a2307958b99a9495f,0x8d12a197cb00d4747a1fe03395095ce2a5cc6819,800000000000000000,0xd0e30db0,0x,call,call,,228728,23221,0,,,1,call_0xc13883930fabdf1c689d858de75433f8f59a4137190f80a876c3bb6a39dfd73c_,0xc13883930fabdf1c689d858de75433f8f59a4137190f80a876c3bb6a39dfd73c,7602530,7602
