0xeb7cf9ea7b0c172e4f3a12df3d565a373ccd3583,893178332,927154569,10,23,4,7,True,False,Phish / Hack,etherscan.io labelcloud,None,None,input/labelcloud.csv,None,None,None
0xcfb92a9d628faf3ea43aba0ef087bffefc31c2ed,839195532,840619305,6,4,6,3,True,False,Phish / Hack,etherscan.io labelcloud,None,None,input/labelcloud.csv,None,None,None
0x1722137749338af245e09b1f58973b4ce1deb331,839456260,1020611019,3,3,2,3,True,False,Phish / Hack,etherscan.io labelcloud,None,None,input/labelcloud.csv,None,None,None
0x0344d3fecda48b181d99a0b7d875d957aa12369c,839212569,1113057337,19,64,13,40,True,False,Phish / Hack,etherscan.io labelcloud,None,None,input/labelcloud.csv,None,None,None
0xce0a62249ed1fc7d027cc6d62a55d72030ae0832,802439220,903961089,13,13,7,2,True,False,Phish / Hack,etherscan.io labelcloud,None,None,input/labelcloud.csv,None,None,None
0xf4a27922bd432d683e704daf6f8563f0d03ac13b,1135004966,1135090120,1,2,1,2,True,False,Phish / Hack,etherscan.io labelcloud,None,None,input/labelcloud.csv,None,None,None
0x062082fe1e7c5dfa7729fbf0d330b9bf65cde510,1007186179,1008261592,60,64,60,62,True,False,Phish / Hack,etherscan.io labelcloud,None,None,input/labelcloud.csv,None,None,None
0x029c42a07652d436533e3cb9b9c69fa188e91981,849542014,857420571,52,15,47,9,True,False,Phish / Hack,etherscan.io labelcloud,None,None,input/labelcloud.csv,None,None,None
0x84bdd3398669dc5cbca9c75c700fbafc53627140,866361760,882876842,12,47,11,14,True,False,Phish / Hack,etherscan.io labelcloud,None,None,input/labelcloud.csv,None,None,None
0x42960c7f91e7aca98f374296df900cb4d6b09601,1417052717,1418339270,3,33,3,10,True,False,Heist,etherscan.io labelcloud,None,None,input/labelcloud.csv,None,None,None
0xa51b93c4b24b1b60eb921d7794d9f1187b47406e,1063937470,1439318110,125,7,99,7,True,False,Phish / Hack,etherscan.io labelcloud,None,None,input/labelcloud.csv,None,None,None
0xd7d19e87685ef99ff05f30fb6eeddcd5850e9280,1030765295,1132237708,20,41,17,28,True,False,Phish / Hack,etherscan.io labelcloud,None,None,input/labelcloud.csv,None,None,None
0xbb7ef8418e9a74c0c731aaaab688aabc9b7af857,903392820,908597823,13,119,4,16,True,False,Phish / Hack,etherscan.io labelcloud,None,None,input/labelcloud.csv,None,None,None
0xa0d34572fb3be1bca9f36b5d41e86c135e580553,390882890,1464331258,33,197,29,139,True,False,Exploit,etherscan.io labelcloud,None,None,input/labelcloud.csv,None,None,None
0x8006f98f33f8cf4156c36256cd0866250c753d26,961524462,1466768543,120,335,71,126,True,False,Phish / Hack,etherscan.io labelcloud,None,None,input/labelcloud.csv,None,None,None
0x9e469c7ec3f6cb140d5b40eee0529f91643147d2,968143249,987602115,3,14,2,5,True,False,Scamming,CryptoScamDB,http://airdrop-loopring.io,Trust trading scam site,input/addresses.json,None,None,None
0xa888868100e2a027ed97425a2307958b99a9495f,172502413,1277988670,12,112,10,48,True,False,Phish / Hack,etherscan.io labelcloud,None,None,input/labelcloud.csv,None,None,None
0x992aa27cb917d4e8c8a65093f0a7b8cd3fcbf7d3,847056561,852966296,3,6,2,4,True,False,Phish / Hack,etherscan.io labelcloud,None,None,input/labelcloud.csv,None,None,None
0x80e313e41301312cbcda2fd38aa6142af637f8cb,854812251,861206576,3,9,3,5,True,False,Phish / Hack,etherscan.io labelcloud,None,None,input/labelcloud.csv,None,None,None
0x1f1686649a3b84d6250fc52f275c9055cca28518,828844008,1287953394,4,109,4,51,True,False,Phish / Hack,etherscan.io labelcloud,None,None,input/labelcloud.csv,None,None,None
0xed59726967cae93e8acb8e50eef61fd8ed2e10aa,1015061500,1265863613,71,315,59,143,True,False,Phish / Hack,etherscan.io labelcloud,None,None,input/labelcloud.csv,None,None,None
0x8bc817dccdf0fb4e2b742bc997637e0dced83bb4,782074913,1067954906,49,18,47,13,True,False,Phish / Hack,etherscan.io labelcloud,None,None,input/labelcloud.csv,None,None,None
0xbbfd8041ebde22a7f3e19600b4bab4925cc97f7d,348583489,1464328820,2,1096,2,7,True,False,Exploit,etherscan.io labelcloud,None,None,input/labelcloud.csv,None,None,None
0x48ea99de657ff9cb7dd9b9ac777b3ecd18c038d5,876568890,973893566,3,71,3,16,True,False,Phish / Hack,etherscan.io labelcloud,None,None,input/labelcloud.csv,None,None,None
0x4f043b470eef891527f81481fc2d348b8affc7d7,993834374,1050238965,1,2,1,2,True,False,Phish / Hack,etherscan.io labelcloud,None,None,input/labelcloud.csv,None,None,None
0x0a4d484dc1bbfbd6e7e395bd48750979d465ce77,1353050651,1485956898,93,33,77,21,True,False,Phishing,CryptoScamDB,http://uniswop-uni.com,Fake Uniswap site phishing for funds,input/addresses.json,None,None,None
0x746fa43ad6e2fcfd7fc5cb6ca348b5caa6a6081a,848277225,1004460263,2,10,2,7,True,False,Phish / Hack,etherscan.io labelcloud,None,None,input/labelcloud.csv,None,None,None
0xa2b3357c4849ef9aa0b5624151af581eacaa200e,1398408037,1451480600,67,98,57,59,True,False,Phish / Hack,etherscan.io labelcloud,None,None,input/labelcloud.csv,None,None,None
0x86da32e89924170cdfc8b11a6191b22ccb65a658,886279278,1040987262,62,191,54,62,True,False,Phish / Hack,etherscan.io labelcloud,None,None,input/labelcloud.csv,None,None,None
0xa5376c3d561369636b3da5a45f10534afe41e10b,813129651,926861825,4,24,4,15,True,False,Phish / Hack,etherscan.io labelcloud,None,None,input/labelcloud.csv,None,None,None
0x5b5d45172f7354f1aee3dd2187f0127924b22dd4,1086595929,1086610006,2,5,2,4,True,False,Phish / Hack,etherscan.io labelcloud,None,None,input/labelcloud.csv,None,None,None
0x3580b10e7b6401f1f6d86f782a5409fb5198ff68,875082642,876499242,0,10,0,5,True,False,Phish / Hack,etherscan.io labelcloud,None,None,input/labelcloud.csv,None,None,None
0x3c39c2fd79b55827793b0fa3023980297f796d80,871828768,970156632,18,22,11,7,True,False,Scamming,CryptoScamDB,http://crypto-gives.s3.us-east-2.amazonaws.com,Trust trading scam site,input/addresses.json,None,None,None
0x3a27699588f7ab17ee25948d8c9e2fec3bfa9e7f,878411844,948643649,68,73,57,11,True,False,Phish / Hack,etherscan.io labelcloud,None,None,input/labelcloud.csv,None,None,None
0x75c2516e5c897b28cca3a878350eb5d1befd0c5f,985656763,1037755269,4,12,4,7,True,False,Phish / Hack,etherscan.io labelcloud,None,None,input/labelcloud.csv,None,None,None
0xcf45624eb75be6252402312d030a7d3e04c557ef,835953309,837780928,3,17,2,8,True,False,Phish / Hack,etherscan.io labelcloud,None,None,input/labelcloud.csv,None,None,None
0xb31d2090633ddcfe4ef676cd2eb38d5d36163ac7,992134736,1427888236,70,337,39,90,True,False,Phish / Hack,etherscan.io labelcloud,None,None,input/labelcloud.csv,None,None,None
0xfc1d377f24fafbdf9bf7ec24fd8712c1c13bda48,879492316,902834155,3,51,3,9,True,False,Phish / Hack,etherscan.io labelcloud,None,None,input/labelcloud.csv,None,None,None
0x54a508ff8da468cbdbe9a68550ec5ef745c08126,44883832,1010735711,17,50,15,45,True,False,Phish / Hack,etherscan.io labelcloud,None,None,input/labelcloud.csv,None,None,None
0xc6e9b072af6b1222be1b581c6f3e1a00a18e0f42,899629226,912091025,2,9,2,6,True,False,Phish / Hack,etherscan.io labelcloud,None,None,input/labelcloud.csv,None,None,None
0xac674b8d0e05d8d34a627cb20338a7c192231575,884927665,1208037275,12,21,12,9,True,False,Phish / Hack,etherscan.io labelcloud,None,None,input/labelcloud.csv,None,None,None
0xbadf21a0e927df9abf773f01aee54b53a21a1787,873259223,875641713,1,12,1,4,True,False,Phish / Hack,etherscan.io labelcloud,None,None,input/labelcloud.csv,None,None,None
0xe6d18c06b4dfac77a54891063800170031ff39a6,999742486,1460474298,14,229,9,76,True,False,Phish / Hack,etherscan.io labelcloud,None,None,input/labelcloud.csv,None,None,None
0x2c97fc2afaac350b42baf0223e0a42459ebe21d6,855119732,949085592,954,378,720,11,True,False,Phish / Hack,etherscan.io labelcloud,None,None,input/labelcloud.csv,None,None,None
0x606fe6240c16a7dcb60d0dcc06f2f78b60199e46,829189668,890954495,4,94,3,44,True,False,Phish / Hack,etherscan.io labelcloud,None,None,input/labelcloud.csv,None,None,None
0x1f5b1aee0775fb44a3c2b8185d91afb8f0f613ad,879897470,879951903,1,4,1,4,True,False,Scamming,CryptoScamDB,http://freeuniswap.com,Trust trading scam site (promoted by twitter id: 2508885097),input/addresses.json,None,None,None
0x5bb6aa761ee435480859124b3db6ecb03550f075,879897018,879949700,1,5,1,4,True,False,Phish / Hack,etherscan.io labelcloud,None,None,input/labelcloud.csv,None,None,None
0x12ccf4b7010f5b201c8fda0f880f0ba63b1a88f3,1127830927,1351777579,4,1022,3,13,True,False,Phish / Hack,etherscan.io labelcloud,None,None,input/labelcloud.csv,None,None,None
0x137b9d36cc9725a36c13aa2e25779df1278de7cf,972781584,1117195876,14,98,5,30,True,False,Scamming,CryptoScamDB,http://stbzmerits.com,Trust trading scam site,input/addresses.json,None,None,None
0x903ac91a1a0da1c96830b4ea4ad60bbe42994678,863516397,889086974,2,161,1,30,True,False,Phish / Hack,etherscan.io labelcloud,None,None,input/labelcloud.csv,None,None,None
0xa05dc9a7cb0c222bfa329646eacaf5061962f057,849208916,862790318,14,321,6,18,True,False,Phish / Hack,etherscan.io labelcloud,None,None,input/labelcloud.csv,None,None,None
0xaaf710a008c60ca60454fda7384a5b11313f8cdc,896229101,1065223243,19,90,16,41,True,False,Phish / Hack,etherscan.io labelcloud,None,None,input/labelcloud.csv,None,None,None
0x262441a1a31b44b469eef4380ec7de275c17e890,897566822,1029819984,25,188,22,78,True,False,Phish / Hack,etherscan.io labelcloud,None,None,input/labelcloud.csv,None,None,None
0x9c4c63a896f815acf14f73891a443fb84d0b54ef,1411106665,1469424036,5,185,5,6,True,False,Heist,etherscan.io labelcloud,None,None,input/labelcloud.csv,None,None,None
0x818f1199269d72871171424ce3210e1852651098,898434879,907562812,12,26,8,16,True,False,Phish / Hack,etherscan.io labelcloud,None,None,input/labelcloud.csv,None,None,None
0x7ef39e737e0698acd2b361510682abba93c10671,870609415,876134518,2,17,2,10,True,False,Phish / Hack,etherscan.io labelcloud,None,None,input/labelcloud.csv,None,None,None
0x647c809489c3384ade0d26bd938bd5400cd5a4a9,793596769,842070977,6,158,6,37,True,False,Phish / Hack,etherscan.io labelcloud,None,None,input/labelcloud.csv,None,None,None
0x94c4534f834b3da9e8c677d92ee173d99de2baf2,841501457,842254611,4,25,3,9,True,False,Phish / Hack,etherscan.io labelcloud,None,None,input/labelcloud.csv,None,None,None
0x2aa8af4a79575458d5d0bcbff6d7f045f877e3c4,841378367,856050263,11,17,9,9,True,False,Phish / Hack,etherscan.io labelcloud,None,None,input/labelcloud.csv,None,None,None
0xeb8f42582cfa46563fac9d8798e3b15e1c06060d,1017338876,1024502495,1,10,1,4,True,False,Phish / Hack,etherscan.io labelcloud,None,None,input/labelcloud.csv,None,None,None
0x8b2c3bda64a7c8dd46bc0ccc5db6401d12f24b30,889509797,942039693,1,7,1,6,True,False,Phish / Hack,etherscan.io labelcloud,None,None,input/labelcloud.csv,None,None,None
0x2f4d7ecf5d7ff547e0aa20e7d98958c044cbfd8f,889482584,956879815,1,6,1,5,True,False,Phish / Hack,etherscan.io labelcloud,None,None,input/labelcloud.csv,None,None,None
0x3da35833d1968b12b17488277ce85a0ea1518813,894024930,978000049,2,17,2,5,True,False,Phish / Hack,etherscan.io labelcloud,None,None,input/labelcloud.csv,None,None,None
0xd53d7576d42c525fe2cb44fbf82afa198da3a10c,840298254,841327331,1,36,1,9,True,False,Phish / Hack,etherscan.io labelcloud,None,None,input/labelcloud.csv,None,None,None
0x13593fc117ea232073eca3ecec4451c7af929b54,840193951,1040096420,8,10,6,6,True,False,Phishing,CryptoScamDB,http://swerve-finance.com,Fake Swerve finance app phishing for funds,input/addresses.json,None,None,None
0xb66732ca0103b56fe9a8f598d6bf97b0c9536059,472808077,1162457396,210,96,196,40,True,False,Phish / Hack,etherscan.io labelcloud,None,None,input/labelcloud.csv,None,None,None
0x9637ec6d245fe5da107470399a77af867a5e88ec,909615574,961639666,1,14,1,4,True,False,Phish / Hack,etherscan.io labelcloud,None,None,input/labelcloud.csv,None,None,None
0x206e5c61cc3f7bd018f641fb79373f28cb30242d,837597718,865656474,3,97,2,44,True,False,Phish / Hack,etherscan.io labelcloud,None,None,input/labelcloud.csv,None,None,None
0xc1e97d5f2527ad5bca74dbd528dc89e34348e12b,846118727,850938187,2,8,2,6,True,False,Phish / Hack,etherscan.io labelcloud,None,None,input/labelcloud.csv,None,None,None
0xb961f2a5eed42fc1607f4fb795ef6d36d341cd56,1022574449,1366115016,5,78,5,25,True,False,Phish / Hack,etherscan.io labelcloud,None,None,input/labelcloud.csv,None,None,None
0xe5e1191f97025024685ea26567c4cbba370405a2,677052686,1104368787,19,86,16,35,True,False,Phish / Hack,etherscan.io labelcloud,None,None,input/labelcloud.csv,None,None,None
0xd1fef5633589b75b8961fcc19ee94f07bf9f34f2,842489471,874085840,2,8,2,6,True,False,Phish / Hack,etherscan.io labelcloud,None,None,input/labelcloud.csv,None,None,None
0xbd9b01257584a4240e9e7c706cf6b5ebe2bf061e,930257186,1096854043,9,38,8,17,True,False,Phish / Hack,etherscan.io labelcloud,None,None,input/labelcloud.csv,None,None,None
0x1db3dc42185aa6889b92793380c09c2f51b44f26,912329244,917238748,13,85,12,43,True,False,Phish / Hack,etherscan.io labelcloud,None,None,input/labelcloud.csv,None,None,None
0x50e8fa3e84dcad47231dd9452c3329ba01323bd2,1136307549,1136312925,1,5,1,2,True,False,Phish / Hack,etherscan.io labelcloud,None,None,input/labelcloud.csv,None,None,None
0xe52f0887a8b351a204c1a36c4278a5699b137b95,864029392,918219269,1,14,1,8,True,False,Phish / Hack,etherscan.io labelcloud,None,None,input/labelcloud.csv,None,None,None
0x933357615d1234cbe64823909962191ed730c9de,903050393,908076601,2,64,2,16,True,False,Phish / Hack,etherscan.io labelcloud,None,None,input/labelcloud.csv,None,None,None
0x1afa52442733791aa493a15087b1dc3544684d9b,858116086,861213019,4,5,3,3,True,False,Phish / Hack,etherscan.io labelcloud,None,None,input/labelcloud.csv,None,None,None
0x6fdd519438b838561ab2819b4245b82b8d44c4b9,858067081,1135162703,2,3,2,3,True,False,Phish / Hack,etherscan.io labelcloud,None,None,input/labelcloud.csv,None,None,None
0x499068f2b6958a9f570e9ec49e2ececa147f65e1,693932718,845947485,21,43,20,38,True,False,Phish / Hack,etherscan.io labelcloud,None,None,input/labelcloud.csv,None,None,None
0xda9c6c6ba4973d99071cef9d1ce1006cb3545846,897412301,1045041586,2,71,2,46,True,False,Scamming,CryptoScamDB,http://yflinkreward.com,Trust trading scam site,input/addresses.json,None,None,None
0x8bf812ec596bce575963accb13ce3e6586b6cb93,867500712,896229101,14,30,6,18,True,False,Phish / Hack,etherscan.io labelcloud,None,None,input/labelcloud.csv,None,None,None
0x7970780b07b6a8c814eaeab01a09c4f922906da4,834257644,834646366,5,13,3,6,True,False,Phish / Hack,etherscan.io labelcloud,None,None,input/labelcloud.csv,None,None,None
0x1431b5c053d5e639d9a302d48c18de5fc23a2e61,834226089,835619225,7,52,5,13,True,False,Phish / Hack,etherscan.io labelcloud,None,None,input/labelcloud.csv,None,None,None
0x9bce48508cdef1d054e9577fde58afb3bf6c73c6,1003668345,1425332471,11,177,9,53,True,False,Phish / Hack,etherscan.io labelcloud,None,None,input/labelcloud.csv,None,None,None
0x7c5d28b238758a11f5bf92c2cb4381fc8588f027,1003523236,1046167039,10,55,8,32,True,False,Phish / Hack,etherscan.io labelcloud,None,None,input/labelcloud.csv,None,None,None
0x6d7e7ba61de1d09940a60a2f4f154e9927ad4562,1046683868,1075134536,8,8,8,7,True,False,Scamming,CryptoScamDB,http://freeunigiveaway.com,Trust trading scam site (promoted by twitter id: 2984108125),input/addresses.json,None,None,None
0x68c9f9842685259b918faf0b7e88225d0308eccd,826709710,874121411,2,27,2,8,True,False,Phish / Hack,etherscan.io labelcloud,None,None,input/labelcloud.csv,None,None,None
0x1f13117d63e7fedc3cde6775f9a0eefce328ccc9,757665794,759724372,3,17,2,9,True,False,Phish / Hack,etherscan.io labelcloud,None,None,input/labelcloud.csv,None,None,None
0x926ee893b7a9d9edce57cbb7195f4aa431144db0,232464571,1020418651,25,187,16,37,True,False,Phish / Hack,etherscan.io labelcloud,None,None,input/labelcloud.csv,None,None,None
0x5f37e2788e419568ade357e483dc8cbe3a96e2a1,818001411,838244755,3,157,3,53,True,False,Phish / Hack,etherscan.io labelcloud,None,None,input/labelcloud.csv,None,None,None
0x10b895676f843a674c5c188299a884d09f44b69d,905624084,943672133,31,56,26,13,True,False,Phish / Hack,etherscan.io labelcloud,None,None,input/labelcloud.csv,None,None,None
0xce322d2506cd7ced3f1754d1ffb483225e29bb2b,882700226,894785567,8,222,4,29,True,False,Phish / Hack,etherscan.io labelcloud,None,None,input/labelcloud.csv,None,None,None
0xd0e929ea70a916e53b4606d7ea5280cb0ddaf7d1,753436411,1421221313,4,23,4,12,True,False,Phish / Hack,etherscan.io labelcloud,None,None,input/labelcloud.csv,None,None,None
0x7450d268e6e230a7caa90df2941dd85822de125d,890315563,891100448,32,46,32,42,True,False,Phish / Hack,etherscan.io labelcloud,None,None,input/labelcloud.csv,None,None,None
0x12ee527b57f5c862ad129934d2852b62aa14fd2e,851588494,879946655,1,4,1,4,True,False,Phish / Hack,etherscan.io labelcloud,None,None,input/labelcloud.csv,None,None,None
0xa4635bdea7d99deb8a944e085d03a55d4b9d65f6,870774779,930702104,1,5,1,3,True,False,Phish / Hack,etherscan.io labelcloud,None,None,input/labelcloud.csv,None,None,None
0xd808259ca07fdf4d8fa825c4704f624352e2dc14,273548137,1154260139,49,69,25,25,True,False,Phish / Hack,etherscan.io labelcloud,None,None,input/labelcloud.csv,None,None,None
0x2210e0e8e7402860baa46bbfb592d0a5fece3f75,844380752,900509511,6,99,5,25,True,False,Phish / Hack,etherscan.io labelcloud,None,None,input/labelcloud.csv,None,None,None
0x7848aa63e9beec2405dc3e5e58edb568a8dd0231,844226221,1162282439,790,11,651,8,True,False,Phish / Hack,etherscan.io labelcloud,None,None,input/labelcloud.csv,None,None,None
0x62ade167ca4632255498550ee748ea24013695b3,685862860,1023810616,1,8,1,7,True,False,Phish / Hack,etherscan.io labelcloud,None,None,input/labelcloud.csv,None,None,None
0xda28b1eb9450978b9e3fd6a98f76a293920ce708,1130612462,1379053765,13,277,7,19,True,False,Phish / Hack,etherscan.io labelcloud,None,None,input/labelcloud.csv,None,None,None
0xfcab85e826d61c5ea61941fc6435d0c67e366765,1024736408,1096854044,19,65,11,25,True,False,Phish / Hack,etherscan.io labelcloud,None,None,input/labelcloud.csv,None,None,None
0x78694c0a6990dc9179d692c373140b7e14657fd7,874085840,1088720798,3,5,3,5,True,False,Phish / Hack,etherscan.io labelcloud,None,None,input/labelcloud.csv,None,None,None
0x3845db4613a45c0aa1bee21e38600f135290845e,1377497655,1378372498,0,12,0,3,True,False,Phish / Hack,etherscan.io labelcloud,None,None,input/labelcloud.csv,None,None,None
0x7c522f5b9159d2fbca302a98501073635fbcbb7d,1377008600,1478685651,20,55,18,30,True,False,Phish / Hack,etherscan.io labelcloud,None,None,input/labelcloud.csv,None,None,None
0xd1dc670608c00e8e6378062b48ef5911b068ae3d,232992077,1363248827,15,36,13,30,True,False,Phish / Hack,etherscan.io labelcloud,None,None,input/labelcloud.csv,None,None,None
0x0945198dd98c78d88568004d775e33800cfe4bfa,1208652347,1262059254,279,220,226,48,True,False,Phish / Hack,etherscan.io labelcloud,None,None,input/labelcloud.csv,None,None,None
0xf80f6fa4ccb6550c9dc58d58d51fb0928f9b323c,1357058216,1370891307,6,77,3,12,True,False,Heist,etherscan.io labelcloud,None,None,input/labelcloud.csv,None,None,None
0x59448ed44a0f106d972775067ac61d950d3b4223,1320556212,1373537275,9,225,8,69,True,False,Phishing,CryptoScamDB,http://key7.org,Malicious token airdrop linking to site phishing for funds - https://twitter.com/sniko_/status/1454217307568451593,input/addresses.json,None,None,None
0xd9ac9d0f84318a317db08d4978e3675dd2d2c4bf,1026285491,1472151307,26,48,23,32,True,False,Phish / Hack,etherscan.io labelcloud,None,None,input/labelcloud.csv,None,None,None
0x7863e62285a57aa8e61dccddc2f7080ba7097601,1315897342,1440289974,2,26,2,12,True,False,Phish / Hack,etherscan.io labelcloud,None,None,input/labelcloud.csv,None,None,None
0x9c166c4dfc6fc1a9322cd6cd1dfda004e9e695cd,1315847462,1345276840,72,39,68,21,True,False,Phishing,CryptoScamDB,http://univswap.org,Fake uniswap site phishing for funds,input/addresses.json,None,None,None
0xce1f4b4f17224ec6df16eeb1e3e5321c54ff6ede,1180278715,1464444684,13,122,10,48,True,False,Exploit,etherscan.io labelcloud,None,None,input/labelcloud.csv,None,None,None
0xb3958757fd6d2dfbcc934f39faa1f82210da6f50,775451625,1485928683,149,592,92,285,True,False,Phish / Hack,etherscan.io labelcloud,None,None,input/labelcloud.csv,None,None,None
0xbe5b36aff444ba3e098ed201d39b855c12432192,716307069,1461296216,14,133,14,20,True,False,Scamming,CryptoScamDB,http://trustswap-airdrop.com,Trust trading scam site,input/addresses.json,None,None,None
0x254ccde325aaeed21ae5f98b5c301fdfe42adb9a,878500364,937353397,5,28,4,15,True,False,Phishing,CryptoScamDB,http://curve.si,Fake Curve website phishing for funds,input/addresses.json,None,None,None
0x4c8535c942a18c15d2e3837eeeb30958a16b8a48,917111166,918286730,33,32,32,20,True,False,Phish / Hack,etherscan.io labelcloud,None,None,input/labelcloud.csv,None,None,None
0xd128cf7712ec227d55a0fdf8d3673e97a614dfdd,904809986,923303174,4,122,4,12,True,False,Phish / Hack,etherscan.io labelcloud,None,None,input/labelcloud.csv,None,None,None
0x5821cfb6d4e8a8b04dbfd6410e9d37955afea3cd,1013689933,1082964438,4,17,4,14,True,False,Scamming,CryptoScamDB,http://dpitokendrops.com,Trust trading scam site,input/addresses.json,None,None,None
0x9d02ebb2b9151f655bfec1c8347a65d1429bc434,985153918,1251075727,28,80,19,41,True,False,Phish / Hack,etherscan.io labelcloud,None,None,input/labelcloud.csv,None,None,None
0xece5b20ec4fbcf57be400630bcb821bcf1cbe3c6,1017623809,1097293013,4,141,4,38,True,False,Phishing,CryptoScamDB,http://lotto.fashion,Fake lotto.finance site phishing to get approval() abuse signed transactions to steal erc20's,input/addresses.json,None,None,None
0x8dff910ff09f7428a41386c3e11c6bc72adb1d47,824863292,833266486,2,7,2,6,True,False,Phish / Hack,etherscan.io labelcloud,None,None,input/labelcloud.csv,None,None,None
0xd57efd4bbdf2eda99e52cba8f0baa6c10a7a1255,866622059,894024930,1,3,1,3,True,False,Phish / Hack,etherscan.io labelcloud,None,None,input/labelcloud.csv,None,None,None
0x0ffd3b6a9e628f9373f532de71c5888f3bb4e739,1058173674,1148813870,4,147,4,72,True,False,Phish / Hack,etherscan.io labelcloud,None,None,input/labelcloud.csv,None,None,None
0xd2ccc7f96b12d609159a49b819fcab3e9644d06b,795751002,798366172,49,67,41,35,True,False,Phish / Hack,etherscan.io labelcloud,None,None,input/labelcloud.csv,None,None,None
0xbc84a531195b9ee3cb67fc14da5c259a5ea9e9ff,792656177,796801326,6,9,4,4,True,False,Phish / Hack,etherscan.io labelcloud,None,None,input/labelcloud.csv,None,None,None
0xcc661ff19fbd11d28ed3d48c06e8ac7fd89152b0,781192554,795722330,92,165,76,90,True,False,Phish / Hack,etherscan.io labelcloud,None,None,input/labelcloud.csv,None,None,None
0x71c7656ec7ab88b098defb751b7401b5f6d8976f,45978209,1485671439,499,68,463,23,True,False,None,None,https://etherscan.io,Block explorer,input/addresses.json,None,None,None
0x6ca33486eed915816560630b883a047c4e2b92df,172434767,1422267045,22,128,10,119,True,False,Heist,etherscan.io labelcloud,None,None,input/labelcloud.csv,None,None,None
0x76d667bf8f1eca3020b3259d3ac062edbc0f9958,808510397,831167379,48,45,45,11,True,False,Phish / Hack,etherscan.io labelcloud,None,None,input/labelcloud.csv,None,None,None
0x8c1944fac705ef172f21f905b5523ae260f76d62,1214362253,1220128107,1,70,1,47,True,False,Heist,etherscan.io labelcloud,None,None,input/labelcloud.csv,None,None,None
0xb69149f8b9322ec0cf8020df22c237640c6791f1,1005022633,1005238951,7,9,5,6,True,False,Scamming,CryptoScamDB,http://uniswapgiveaway.com,Trust trading scam site (promoted by twitter id: 1012427454),input/addresses.json,None,None,None
0x5987bd62148392261b85f5ecfba337cdaca62dc0,902170026,909974846,11,134,5,11,True,False,Phish / Hack,etherscan.io labelcloud,None,None,input/labelcloud.csv,None,None,None
0x8bc312fe6b289e95c23c6494dbf305a46f1c2761,1333018627,1335538394,1,16,1,5,True,False,Exploit,etherscan.io labelcloud,None,None,input/labelcloud.csv,None,None,None
0xf646b725306dab4a989e26cb7615998a25492aa2,785253253,841405870,4,17,3,5,True,False,Phish / Hack,etherscan.io labelcloud,None,None,input/labelcloud.csv,None,None,None
0x23b562fef70c5b02eb9179d87af44f4b82fdef18,1000379980,1000390682,2,4,2,3,True,False,Phish / Hack,etherscan.io labelcloud,None,None,input/labelcloud.csv,None,None,None
0xa2eb8f9174d70befaa253fcd9af256e3379d8a06,1357701857,1462886108,7,31,5,14,True,False,Phish / Hack,etherscan.io labelcloud,None,None,input/labelcloud.csv,None,None,None
0xd2c3d630b77c2a1b080daf11942086ade5700e5d,813465439,1352679377,29,42,29,20,True,False,Phish / Hack,etherscan.io labelcloud,None,None,input/labelcloud.csv,None,None,None
0x4d5a7d6ecda9df9e89d4dc2410ae2776e3481c03,742661752,895483981,17,23,17,16,True,False,Phish / Hack,etherscan.io labelcloud,None,None,input/labelcloud.csv,None,None,None
0x38d1871e8594b791571693737535fd230e054286,829447623,1202466116,1,23,1,8,True,False,Phish / Hack,etherscan.io labelcloud,None,None,input/labelcloud.csv,None,None,None
0xc81548a3c601e2c41f9b4b38120860d8b0860c3a,829342096,934160656,99,138,65,14,True,False,Phish / Hack,etherscan.io labelcloud,None,None,input/labelcloud.csv,None,None,None
0x1ee6b25a0e3f855a10916766df3a056e924e5dce,228224477,1076406851,163,147,149,104,True,False,Phish / Hack,etherscan.io labelcloud,None,None,input/labelcloud.csv,None,None,None
0x91518450bd1cb56ac96d7855fb1081a8bfaddd9c,900715416,1440033866,28,125,16,65,True,False,Phish / Hack,etherscan.io labelcloud,None,None,input/labelcloud.csv,None,None,None
0xee62e9461e001843a1aa21d7c4c3c64d17e10514,866747087,874174850,12,3,12,2,True,False,Scamming,CryptoScamDB,http://elongift.s3.eu-west-2.amazonaws.com,Trust trading scam site,input/addresses.json,None,None,None
0xb5b964b89c2d4ca339eab6a03c97eee9b6eacc7c,828068262,865183073,3,12,3,9,True,False,Scamming,CryptoScamDB,http://sushi-giveaway.blogspot.com,Trust trading scam site,input/addresses.json,None,None,None
0x083cdb896fef79b2034579bf8f7bf2b2e723a736,858842340,866308145,2,62,2,8,True,False,Phish / Hack,etherscan.io labelcloud,None,None,input/labelcloud.csv,None,None,None
0x2d35ed31d43d6bf5ccc5d7a085fe1ea9829a64d1,1008563010,1029752575,1,61,1,6,True,False,Phish / Hack,etherscan.io labelcloud,None,None,input/labelcloud.csv,None,None,None
0x92cbe102eb318bdbb2781f7caee764f71630ef59,833356771,834111782,7,28,4,6,True,False,Phish / Hack,etherscan.io labelcloud,None,None,input/labelcloud.csv,None,None,None
0xc6a098044200726e7f0edb9927b2531757adb59f,1008671357,1008675151,1,4,1,4,True,False,Scamming,CryptoScamDB,http://cryptogiftsgive.neocities.org,Trust trading scam site,input/addresses.json,None,None,None
0xb52e021453e4a5fa426d840821a65e008926956f,1195514412,1196141212,1,56,1,4,True,False,Phish / Hack,etherscan.io labelcloud,None,None,input/labelcloud.csv,None,None,None
0x39d80d7de4345821b6691ee6d71347323a8178c9,871116463,1224049836,49,53,47,18,True,False,Phish / Hack,etherscan.io labelcloud,None,None,input/labelcloud.csv,None,None,None
0xd189e256bcf1ca98804a13928dd3ded37f8ca08d,660489896,1023538045,1,8,1,8,True,False,Phish / Hack,etherscan.io labelcloud,None,None,input/labelcloud.csv,None,None,None
0xfba4f48ab4a394ff38af368b7c2b37547a41e1b0,895548131,937352635,6,98,6,42,True,False,Phish / Hack,etherscan.io labelcloud,None,None,input/labelcloud.csv,None,None,None
0xce0cae825de6c6939dc05f46a40065006b849d50,804053916,903296221,5,2,5,2,True,False,Phish / Hack,etherscan.io labelcloud,None,None,input/labelcloud.csv,None,None,None
0x096dc87c708d96033ab7862b14a6f23c038a9394,1129115694,1415111821,4,440,4,24,True,False,Phish / Hack,etherscan.io labelcloud,None,None,input/labelcloud.csv,None,None,None
0x7c7ff63f2513080eeb73d2eaf3cf6e8b62b13459,578041156,1152492051,58,373,25,63,True,False,Scamming,CryptoScamDB,http://feex.exchange,Fake exchange phishing for deposits,input/addresses.json,None,None,None
0xc0ad01e6f283d5f29930e479b9e9588107230983,740092155,841109747,29,82,13,18,True,False,Phish / Hack,etherscan.io labelcloud,None,None,input/labelcloud.csv,None,None,None
0x1aa18a80822b3fbed557f279b8666bb4962ad6de,815149470,1364363682,30,1021,17,158,True,False,Phish / Hack,etherscan.io labelcloud,None,None,input/labelcloud.csv,None,None,None
0x83a2eb63b6cc296529468afa85dbde4a469d8b37,1093087642,1464479339,13,88,9,15,True,False,Heist,etherscan.io labelcloud,None,None,input/labelcloud.csv,None,None,None
0x9a092a20ef112da183e14c7ede7ed9fb292cdef0,768188611,908133284,9,21,6,14,True,False,Phish / Hack,etherscan.io labelcloud,None,None,input/labelcloud.csv,None,None,None
0x83373a2e5fc62a8598fb2ac2ebec188ff8cd4a9c,1338810908,1352446265,4,21,4,14,True,False,Phish / Hack,etherscan.io labelcloud,None,None,input/labelcloud.csv,None,None,None
0xe9a2cc79e5d707fe23aad7d731fc5ae5b38ac3e5,799285834,991666217,80,24,76,20,True,False,Phish / Hack,etherscan.io labelcloud,None,None,input/labelcloud.csv,None,None,None
0x8efab89b497b887cdaa2fb08ff71e4b3827774b2,1405225989,1465005958,2,31,2,7,True,False,Exploit,etherscan.io labelcloud,None,None,input/labelcloud.csv,None,None,None
0x55f0fbaa71f047ba271d9380f1e9e49d8a5e3f29,1074304026,1084711093,100,9,71,4,True,False,Phish / Hack,etherscan.io labelcloud,None,None,input/labelcloud.csv,None,None,None
0x4d4f0ace8233836e0cf6ae21820bd7f76871c1ec,760138483,1201942835,2,20,2,5,True,False,Phish / Hack,etherscan.io labelcloud,None,None,input/labelcloud.csv,None,None,None
0x3ddabffdba61369ffc0daa28c33ff974bf6bfd98,970931150,994880721,6,15,3,5,True,False,Phish / Hack,etherscan.io labelcloud,None,None,input/labelcloud.csv,None,None,None
0xfa2731d0bede684993ab1109db7ecf5bf33e8051,1329199674,1463687423,6,86,4,15,True,False,Exploit,etherscan.io labelcloud,None,None,input/labelcloud.csv,None,None,None
0x9df618ea881b0bca6b224f7cb86ecaff369cded7,660533628,1023609369,1,8,1,8,True,False,Phish / Hack,etherscan.io labelcloud,None,None,input/labelcloud.csv,None,None,None
0x154e7d6dcd3b18840cf094629ab4f1776d2ba89f,802636101,891210068,29,324,10,28,True,False,Phish / Hack,etherscan.io labelcloud,None,None,input/labelcloud.csv,None,None,None
0x4de76b3dfd38292ba71cf2465ca3a1d526dcb567,38996336,951459646,2,11,2,8,True,False,None,MyEtherWallet,None,MultiSigExploit-Hacker_main_2_b,input/addresses-darklist.json,None,None,None
0x1a24d08e3e8682c2cd38159ec8006fa5b20c9f1e,848171077,879944517,1,4,1,4,True,False,Scamming,CryptoScamDB,http://unigiveaway.com,Trust trading scam site (promoted by twitter id: 1521656557),input/addresses.json,None,None,None
0x969244f550a683e6e3425c7cb87aa6afe5fda253,865183073,1005428770,1,82,1,15,True,False,Scamming,CryptoScamDB,http://crypto-gives.s3.us-east-2.amazonaws.com,Trust trading scam site,input/addresses.json,None,None,None
0xa79f7e53b3490d24216f0c682581f68eaf9a0b36,865031519,1009085070,3,16,3,9,True,False,Phish / Hack,etherscan.io labelcloud,None,None,input/labelcloud.csv,None,None,None
0xf8d270220168620afd771e1bdb592e116cc8df19,905889633,911721804,1,89,1,12,True,False,Phish / Hack,etherscan.io labelcloud,None,None,input/labelcloud.csv,None,None,None
0xc70df14ab20e248427f10db6a9fcb8c5b2b46249,905862450,971884077,1,53,1,18,True,False,Phish / Hack,etherscan.io labelcloud,None,None,input/labelcloud.csv,None,None,None
0xed65d4b2530a193ba98e0ff5b0f30148cbbf9bbe,631457307,1019716703,1,7,1,6,True,False,Phish / Hack,etherscan.io labelcloud,None,None,input/labelcloud.csv,None,None,None
0x49202aa9d52c0f4352d31d731eb50822f9d8525b,905409067,969839054,4,24,4,7,True,False,Scamming,CryptoScamDB,http://eth66.blogspot.com,Trust trading scam site,input/addresses.json,None,None,None
0x1164246850f8fca79e14fd256fa6b6dac857b873,1249283815,1480395110,947,105,560,54,True,False,Phish / Hack,etherscan.io labelcloud,None,None,input/labelcloud.csv,None,None,None
0xb54b143eb9161054e5096cccf1f4477e0784ab6b,826282558,833283070,4,11,4,6,True,False,Phish / Hack,etherscan.io labelcloud,None,None,input/labelcloud.csv,None,None,None
0xfc6e44fc94f9e0f69b80dc1377e37bae858cc7e5,981214433,1136176572,4,5,3,3,True,False,Phish / Hack,etherscan.io labelcloud,None,None,input/labelcloud.csv,None,None,None
0xd264fa72cc12690e1cbca5052c803d28574bbf43,841934882,846769084,7,163,3,26,True,False,Phish / Hack,etherscan.io labelcloud,None,None,input/labelcloud.csv,None,None,None
0x578fd2367f31b62b6a32ef21d2a3193d22c34fe9,886511311,1003398853,2,19,1,9,True,False,Phish / Hack,etherscan.io labelcloud,None,None,input/labelcloud.csv,None,None,None
0x4d76d8dd2a86760520255e99c05a5080fc8d33cc,788657908,843505008,2,11,2,9,True,False,Phish / Hack,etherscan.io labelcloud,None,None,input/labelcloud.csv,None,None,None
0x6f1c30b499acd49856b3a98f02f15dbad15e6e10,804729450,1413604778,5,292,2,26,True,False,Phish / Hack,etherscan.io labelcloud,None,None,input/labelcloud.csv,None,None,None
0x26a76f4fe7a21160274d060acb209f515f35429c,1377545797,1380682611,2,28,2,9,True,False,Heist,etherscan.io labelcloud,None,None,input/labelcloud.csv,None,None,None
0x2b4ba785c91ad66ee0e1ac4a145f304a1feeca19,939721871,940547254,1,5,1,4,True,False,Phish / Hack,etherscan.io labelcloud,None,None,input/labelcloud.csv,None,None,None
0xbcc29dd4b48b39204a05824dda23ed5542cdc5e8,941818848,941860374,1,3,1,3,True,False,Phish / Hack,etherscan.io labelcloud,None,None,input/labelcloud.csv,None,None,None
0xb0473323f6d0eee8732fbc6af8f32504ce897611,755857802,1201940882,2,11,2,4,True,False,Phish / Hack,etherscan.io labelcloud,None,None,input/labelcloud.csv,None,None,None
0x050022eba4d55d242d9568794961df5596f968f2,868035695,868798351,157,40,157,5,True,False,Phish / Hack,etherscan.io labelcloud,None,None,input/labelcloud.csv,None,None,None
0x92fbf673935c28296e33170c1f70a33d95cda6dc,872963243,958658544,29,17,23,3,True,False,Phish / Hack,etherscan.io labelcloud,None,None,input/labelcloud.csv,None,None,None
0x8ed46b363e7abfc705188d5c4dbab88d0fa97597,861322809,1004481471,3,92,2,11,True,False,Phish / Hack,etherscan.io labelcloud,None,None,input/labelcloud.csv,None,None,None
0xbc8e9a20daa70d2ffc43a0133a49b0f736ca505c,885304920,905618539,2,2,2,2,True,False,Scamming,CryptoScamDB,http://eth67.blogspot.com,Trust trading scam site,input/addresses.json,None,None,None
0x77f8e65f424d6dc7c79233c11247c1232cbe6d83,1378413364,1461418962,1,23,1,7,True,False,Phish / Hack,etherscan.io labelcloud,None,None,input/labelcloud.csv,None,None,None
0xd599cf7c482f5da1b98d470e19b7391c2f161b24,1209778852,1486519235,106,300,65,148,True,False,Phish / Hack,etherscan.io labelcloud,None,None,input/labelcloud.csv,None,None,None
0xfeefcde74ea44efbdf9a16e2a524da54f5cf2221,877912521,899929489,2,16,2,11,True,False,Phish / Hack,etherscan.io labelcloud,None,None,input/labelcloud.csv,None,None,None
0xbecb814e2862412a58a7d2ddd4d7cd4ade43677d,1332058901,1342983906,28,61,19,31,True,False,Phish / Hack,etherscan.io labelcloud,None,None,input/labelcloud.csv,None,None,None
0x34052df6bb69a7ccb54af356a6e8f56a7b3485fd,1012348280,1209165143,29,102,3,13,True,False,Phish / Hack,etherscan.io labelcloud,None,None,input/labelcloud.csv,None,None,None
0xc8f38d9f5e4fe64a8ba79bda6a10c6f7da5eebcd,876254270,935084383,10,182,5,10,True,False,Phish / Hack,etherscan.io labelcloud,None,None,input/labelcloud.csv,None,None,None
0xce7cf36d9b8bcacd4c80024a10aadd8f7d1173a2,876634823,1004495647,2,26,2,17,True,False,Phish / Hack,etherscan.io labelcloud,None,None,input/labelcloud.csv,None,None,None
0x1dd4c4c639e6264bfdeeca0e9814d8a33a0c3a40,844944198,874174282,1,4,1,4,True,False,Phish / Hack,etherscan.io labelcloud,None,None,input/labelcloud.csv,None,None,None
0xd58ca904db555b67e78dbd94fbc3b81f68dcf76d,847132887,1143368481,117,128,100,7,True,False,Phish / Hack,etherscan.io labelcloud,None,None,input/labelcloud.csv,None,None,None
0x625323fe73ea0c585a9c609af441003c81f09ff7,1011504153,1031198565,5,81,2,23,True,False,Phish / Hack,etherscan.io labelcloud,None,None,input/labelcloud.csv,None,None,None
0x14ec0cd2acee4ce37260b925f74648127a889a28,998462036,1062388445,0,33,0,6,True,False,Heist,etherscan.io labelcloud,None,None,input/labelcloud.csv,None,None,None
0x96138a27e84bcb0f166a384aa42a6d1d0fafcc2c,1024498009,1114470831,2,11,2,5,True,False,Scamming,CryptoScamDB,http://liquidity-morpheus.network,Trust trading scam site,input/addresses.json,None,None,None
0x07f8428993e0d16f914040b4ac478fa82826a796,844582922,870867354,4,5,4,4,True,False,Phish / Hack,etherscan.io labelcloud,None,None,input/labelcloud.csv,None,None,None
0x9da1f846a241e4e4ad4be8b94bd9c953e76c6887,847031780,855451267,0,45,0,24,True,False,Phish / Hack,etherscan.io labelcloud,None,None,input/labelcloud.csv,None,None,None
0x529158c43b00b727905c67fbbd6510f3c230757d,846837813,846844107,1,3,1,3,True,False,Phish / Hack,etherscan.io labelcloud,None,None,input/labelcloud.csv,None,None,None
0xfbf83d7b29c5286b4745513b6a02279218dc564b,687609060,926644144,56,37,40,18,True,False,Phish / Hack,etherscan.io labelcloud,None,None,input/labelcloud.csv,None,None,None
0x4085ff340bb64ace1bcf5ecc8b93f026b01c7e9b,827802643,1325662577,5,28,4,9,True,False,Phish / Hack,etherscan.io labelcloud,None,None,input/labelcloud.csv,None,None,None
0x57269f40f4bcf93643be082be3e5082a4269d02a,861244050,1158281606,55,66,39,26,True,False,Phish / Hack,etherscan.io labelcloud,None,None,input/labelcloud.csv,None,None,None
0xe55e749770f1aa743d6ce30a14f84105090398e3,838730188,1024429969,69,247,55,10,True,False,Phish / Hack,etherscan.io labelcloud,None,None,input/labelcloud.csv,None,None,None
0xeade619ee57d4edf08234b9b635ac951a590edf6,838681589,870692471,19,39,18,8,True,False,Phish / Hack,etherscan.io labelcloud,None,None,input/labelcloud.csv,None,None,None
0xd63fc5280580242f79e9f98c4e64f032109178fb,967457783,977071032,20,41,15,14,True,False,Phish / Hack,etherscan.io labelcloud,None,None,input/labelcloud.csv,None,None,None
0xdd9dfcec6823835ed771275beaefc626a0955d7e,843411949,855012794,2,9,2,4,True,False,Phish / Hack,etherscan.io labelcloud,None,None,input/labelcloud.csv,None,None,None
0xc61429117038a1f13881dd7410b80771f28e06ec,1106221051,1464945481,13,32,2,8,True,False,Heist,etherscan.io labelcloud,None,None,input/labelcloud.csv,None,None,None
0x5d7d56d1d7e18f42c88c1192a550ef6a46f1e0b5,819965227,1071245701,3,32,2,7,True,False,Phish / Hack,etherscan.io labelcloud,None,None,input/labelcloud.csv,None,None,None
0x2e7f29ed5c73f5bad44ee7ce20afeeb67d11de23,846948855,847022972,0,31,0,17,True,False,Phish / Hack,etherscan.io labelcloud,None,None,input/labelcloud.csv,None,None,None
0xb49f533d766443e4a0cfd42be511bd987b3fcf46,846476079,846877254,2,4,2,4,True,False,Phish / Hack,etherscan.io labelcloud,None,None,input/labelcloud.csv,None,None,None
0x62ebf2c09ae1de2aa4003d340a7df2afff5d40b0,934974425,1000708111,5,197,4,38,True,False,Phish / Hack,etherscan.io labelcloud,None,None,input/labelcloud.csv,None,None,None
0xe45f1f2ac63b464fccd55845000a6300fc55027d,808780158,857177952,2,9,2,5,True,False,Phish / Hack,etherscan.io labelcloud,None,None,input/labelcloud.csv,None,None,None
0xbeedf38b5368701f9bffce8fd522f4d896b6d656,825849692,827131809,43,20,40,5,True,False,Phish / Hack,etherscan.io labelcloud,None,None,input/labelcloud.csv,None,None,None
0xfcd6a3dc5a18b12490e4aa087c324dc83d223510,1063651350,1331466327,113,82,103,48,True,False,Phish / Hack,etherscan.io labelcloud,None,None,input/labelcloud.csv,None,None,None
0x848668c8c07924d77a600df4033c6e3170fb7aed,825211599,1286835336,36,17,10,7,True,False,Phish / Hack,etherscan.io labelcloud,None,None,input/labelcloud.csv,None,None,None
0x941a9e3b91e1cc015702b897c512d265fae88a9c,1194106909,1272397571,20,175,9,33,True,False,Exploit,etherscan.io labelcloud,None,None,input/labelcloud.csv,None,None,None
0x9bb881cbe417261199273d6a06c839f2ca78e784,851154844,1034450805,9,69,6,39,True,False,Phish / Hack,etherscan.io labelcloud,None,None,input/labelcloud.csv,None,None,None
0x40e92082d13db090fc1d9059c69f2caf7c3a647b,878601615,879614646,1,33,1,12,True,False,Phish / Hack,etherscan.io labelcloud,None,None,input/labelcloud.csv,None,None,None
0xda3f8db5f3ecb711a5c6952f0b14eb0005ebf63c,916872614,1340735003,279,1315,190,505,True,False,Phish / Hack,etherscan.io labelcloud,None,None,input/labelcloud.csv,None,None,None
0xb9ba5ee81c6b58b79da3c960bee88a016a5240e9,863710719,864651208,70,77,69,53,True,False,Phish / Hack,etherscan.io labelcloud,None,None,input/labelcloud.csv,None,None,None
0x17505602047c58f8e97f5f8968a3f343f2a147ab,959704469,1006475015,13,16,7,10,True,False,Phish / Hack,etherscan.io labelcloud,None,None,input/labelcloud.csv,None,None,None
0xa14d5da3c6bf2d9304fe6d4bc6942395b4de048b,1262648983,1333252139,5,475,4,274,True,False,Phish / Hack,etherscan.io labelcloud,None,None,input/labelcloud.csv,None,None,None
0x662cc6268eb3c8d75bf0415a54b1de9fcbe55ca5,924762626,1086597088,2,7,2,5,True,False,Phish / Hack,etherscan.io labelcloud,None,None,input/labelcloud.csv,None,None,None
0x93e19334d8a02190476d6e4b680ff3c51efaf182,1378532653,1378761984,3,307,3,4,True,False,Phish / Hack,etherscan.io labelcloud,None,None,input/labelcloud.csv,None,None,None
0x327c697c7c736964be8329fcb89de911989e4cb0,665234322,1019758738,1,8,1,8,True,False,Phish / Hack,etherscan.io labelcloud,None,None,input/labelcloud.csv,None,None,None
0xaab56a192172d1d9ac18315f00c887258528ce07,863870324,873843687,24,140,8,13,True,False,Phish / Hack,etherscan.io labelcloud,None,None,input/labelcloud.csv,None,None,None
0xf499223672c6283759d7a4754891ab67a7ce09f7,723201926,1023767793,4,10,3,7,True,False,Phish / Hack,etherscan.io labelcloud,None,None,input/labelcloud.csv,None,None,None
0xc433d50dd0614c81ee314289ec82aa63710d25e8,1207985066,1464494550,486,339,292,117,True,False,Heist,etherscan.io labelcloud,None,None,input/labelcloud.csv,None,None,None
0x9457c385d12c800e3695376efae905265423243e,845070823,866914108,23,13,8,7,True,False,Phish / Hack,etherscan.io labelcloud,None,None,input/labelcloud.csv,None,None,None
0x30f22013cb880ea03402a4d71880024837336d01,903666116,909963076,26,80,23,46,True,False,Phish / Hack,etherscan.io labelcloud,None,None,input/labelcloud.csv,None,None,None
0x95a4ee08cd409ca66395fd10ad19cef80258345d,1045470631,1096856955,2,102,2,36,True,False,Phishing,CryptoScamDB,http://1ncih.exchange,Fake 1inch site - stealing funds via erc20 approve(),input/addresses.json,None,None,None
0x8eba31e9ca4a7fa7d93393fefc2ab206e7c4f0a7,898031341,1022168916,2,97,2,11,True,False,Phish / Hack,etherscan.io labelcloud,None,None,input/labelcloud.csv,None,None,None
0x8d6d3495294b6dd0dc4ff3bd93a5e1b1079c2c35,1040464777,1040482056,0,3,0,3,True,False,Phish / Hack,etherscan.io labelcloud,None,None,input/labelcloud.csv,None,None,None
0x0e7fd9cd082a6da1e383e5a0ffb8041ca14ddc94,873976763,908248126,138,47,125,10,True,False,Phish / Hack,etherscan.io labelcloud,None,None,input/labelcloud.csv,None,None,None
0xee7221adc34b88c3311b0c1054eeb74af68f4f98,839859619,862276092,14,16,14,8,True,False,Phish / Hack,etherscan.io labelcloud,None,None,input/labelcloud.csv,None,None,None
0x7f1b27fec1ad7f5f8d8aa3f2812cb0f644b61fef,837764702,839861053,2,9,2,5,True,False,Phish / Hack,etherscan.io labelcloud,None,None,input/labelcloud.csv,None,None,None
0x45be5c265cee05d129932e0e45a831fd0f02845c,837761432,837796759,2,4,2,3,True,False,Phish / Hack,etherscan.io labelcloud,None,None,input/labelcloud.csv,None,None,None
0xe90a3c163abcb8296080f06b9a9122499d6689d5,1020548081,1096917542,1,69,1,25,True,False,Phish / Hack,etherscan.io labelcloud,None,None,input/labelcloud.csv,None,None,None
0x0aeffd862a9cfa827574e2e5e50cda07685c9260,830404796,882840960,15,152,5,28,True,False,Phish / Hack,etherscan.io labelcloud,None,None,input/labelcloud.csv,None,None,None
0xe79eb5cf318c6dba47ecaf504e3a462820950c93,830229036,837356356,4,33,3,10,True,False,Scamming,CryptoScamDB,http://sushiswap.blogspot.com,Trust trading scam site,input/addresses.json,None,None,None
0x0bb49c33e8d118472176168475c0d44bcdcbcb5d,883046137,897600083,1,24,1,7,True,False,Phish / Hack,etherscan.io labelcloud,None,None,input/labelcloud.csv,None,None,None
0x0d5d6005fca3d29a3c494863fecc6b0359786e30,630634734,1023509053,1,12,1,8,True,False,Phish / Hack,etherscan.io labelcloud,None,None,input/labelcloud.csv,None,None,None
0x8b1deff8d7d0eeb1869f9e3e52169f19cabdbb5b,887136185,1063423660,0,70,0,10,True,False,Phish / Hack,etherscan.io labelcloud,None,None,input/labelcloud.csv,None,None,None
0x908bc24c7fad5b870f2936d9425383f8ea9c80db,224606234,964771817,44,90,40,53,True,False,Phish / Hack,etherscan.io labelcloud,None,None,input/labelcloud.csv,None,None,None
0x079667f4f7a0b440ad35ebd780efd216751f0758,892198194,969096357,15,668,7,72,True,False,Phish / Hack,etherscan.io labelcloud,None,None,input/labelcloud.csv,None,None,None
0x74a37eca87807e12bf3d4d088fb6b6186a630926,832309115,843608875,197,223,135,7,True,False,Phish / Hack,etherscan.io labelcloud,None,None,input/labelcloud.csv,None,None,None
0xf774aef374312bb59e8c447a2315e8a273f6f1b4,832584965,1287913973,2,51,2,23,True,False,Phish / Hack,etherscan.io labelcloud,None,None,input/labelcloud.csv,None,None,None
0x14b53c269cb3b27b142e480cc26c53b1e89cef39,880147697,1165955763,4,12,2,6,True,False,Phish / Hack,etherscan.io labelcloud,None,None,input/labelcloud.csv,None,None,None
0x27210b23018bceffdf2762359ebb337e429ec000,887447309,1033683754,28,148,24,65,True,False,Phish / Hack,etherscan.io labelcloud,None,None,input/labelcloud.csv,None,None,None
0x03e27c1917672800d5fdceb96e1ec3fe672c2859,843659631,844618913,1,21,1,17,True,False,Phish / Hack,etherscan.io labelcloud,None,None,input/labelcloud.csv,None,None,None
0x9a7054dfab2e6884ecf23f8f3ddf93eb4ad247b4,870864654,878974973,2,29,2,22,True,False,Phish / Hack,etherscan.io labelcloud,None,None,input/labelcloud.csv,None,None,None
0x3a878eddb991ebcbc7c8052055b2e5ed5d0d1ba4,223745776,1236140757,30,64,29,39,True,False,Phish / Hack,etherscan.io labelcloud,None,None,input/labelcloud.csv,None,None,None
0x3cb3cca6185bff079b69dcb1fc2256dd8932632b,662775714,1095802387,307,89,241,21,True,False,Phish / Hack,etherscan.io labelcloud,None,None,input/labelcloud.csv,None,None,None
0xba9da55bbb2ca86e13315063ceb6331da677d9e9,864362998,870921833,26,83,17,39,True,False,Phish / Hack,etherscan.io labelcloud,None,None,input/labelcloud.csv,None,None,None
0xcfc84de17cc9564ab12871d4e9f911b74b44e9b2,864294123,872252669,13,153,10,16,True,False,Phish / Hack,etherscan.io labelcloud,None,None,input/labelcloud.csv,None,None,None
0xea3a8bd1a99e16160832d6b473ce06c1058dff7e,293811830,1311090295,487,185,484,174,True,False,Phish / Hack,etherscan.io labelcloud,None,None,input/labelcloud.csv,None,None,None
0xf282f97d913404512919914e48bb0c5e35cf0483,894868485,1303595578,136,126,11,31,True,False,Phish / Hack,etherscan.io labelcloud,None,None,input/labelcloud.csv,None,None,None
0xd5edf7ef02912a7bfb540d070ddd10d0432e4c26,840700141,841705617,3,22,1,7,True,False,Phish / Hack,etherscan.io labelcloud,None,None,input/labelcloud.csv,None,None,None
0x3c96667dbfe9745c595865e7466f313a5ae8c413,851920932,931288485,9,27,8,9,True,False,Phish / Hack,etherscan.io labelcloud,None,None,input/labelcloud.csv,None,None,None
0x917a417d938b9f9e6ae7f9e5253fb6de410343e3,840578985,1004579677,2529,515,8,43,True,False,Phish / Hack,etherscan.io labelcloud,None,None,input/labelcloud.csv,None,None,None
0xa51cc593b0a55b3ee61fb8835c87d352211bfccf,840487531,912081694,6,5,6,4,True,False,Phish / Hack,etherscan.io labelcloud,None,None,input/labelcloud.csv,None,None,None
0x7b47631b7b4073526ffea5ff0dbccbc9f1f8b628,1021603767,1329946294,9,79,5,29,True,False,Scamming,CryptoScamDB,http://dsdtokendrops.com,Trust trading scam site,input/addresses.json,None,None,None
0xd523911f139f5d6d9c8c8d2a1eef42f1a1df31f9,760238211,838946655,2,14,2,5,True,False,Phish / Hack,etherscan.io labelcloud,None,None,input/labelcloud.csv,None,None,None
0xd8428836ed2a36bd67cd5b157b50813b30208f50,1242599421,1242699521,1,22,1,3,True,False,Exploit,etherscan.io labelcloud,None,None,input/labelcloud.csv,None,None,None
0xf9e3d08196f76f5078882d98941b71c0884bea52,1232796319,1233117171,1,104,1,6,True,False,Heist,etherscan.io labelcloud,None,None,input/labelcloud.csv,None,None,None
0x20c6082fcdfc4304fd203d0bf240abc3e439f885,1351951433,1413806495,237,199,188,117,True,False,Phish / Hack,etherscan.io labelcloud,None,None,input/labelcloud.csv,None,None,None
0xa0d34572fb3be1bca9f36b5d41e86c135e580553,390882890,1464331258,33,197,29,139,True,False,Exploit,etherscan.io labelcloud,None,None,input/labelcloud.csv,None,None,None
0xed59726967cae93e8acb8e50eef61fd8ed2e10aa,1015061500,1265863613,71,315,59,143,True,False,Phish / Hack,etherscan.io labelcloud,None,None,input/labelcloud.csv,None,None,None
0x0b88a083dc7b8ac2a84eba02e4acb2e5f2d3063c,348583725,1464325633,2,1113,2,19,True,False,Exploit,etherscan.io labelcloud,None,None,input/labelcloud.csv,None,None,None
0xecd91d07b1b6b81d24f2a469de8e47e3fe3050fd,348583596,1464327130,2,1103,2,14,True,False,Exploit,etherscan.io labelcloud,None,None,input/labelcloud.csv,None,None,None
0x2ef1b70f195fd0432f9c36fb2ef7c99629b0398c,348583597,1464326899,2,1100,2,9,True,False,Exploit,etherscan.io labelcloud,None,None,input/labelcloud.csv,None,None,None
0xbbfd8041ebde22a7f3e19600b4bab4925cc97f7d,348583489,1464328820,2,1096,2,7,True,False,Exploit,etherscan.io labelcloud,None,None,input/labelcloud.csv,None,None,None
0x4fbf7701b3078b5bed6f3e64df3ae09650ee7de5,348583017,1464329912,4,1114,4,16,True,False,Exploit,etherscan.io labelcloud,None,None,input/labelcloud.csv,None,None,None
0x0a4d484dc1bbfbd6e7e395bd48750979d465ce77,1353050651,1485956898,93,33,77,21,True,False,Phishing,CryptoScamDB,http://uniswop-uni.com,Fake Uniswap site phishing for funds,input/addresses.json,None,None,None
0xa2b3357c4849ef9aa0b5624151af581eacaa200e,1398408037,1451480600,67,98,57,59,True,False,Phish / Hack,etherscan.io labelcloud,None,None,input/labelcloud.csv,None,None,None
0x66a6892477f9b48ed47f407b30dde754405e1910,160448520,1280095778,542,486,337,331,True,False,Phish / Hack,etherscan.io labelcloud,None,None,input/labelcloud.csv,None,None,None
0xbad759de28618ee641a8c098ee4e79f1a229f7d8,1301964093,1326069482,19,49,17,18,True,False,Phishing,CryptoScamDB,http://sudoswap.app,Fake Sudoswap phishing for funds,input/addresses.json,None,None,None
0xe6d18c06b4dfac77a54891063800170031ff39a6,999742486,1460474298,14,229,9,76,True,False,Phish / Hack,etherscan.io labelcloud,None,None,input/labelcloud.csv,None,None,None
0x98831a269cb88b6bfcc86e45b32c158981b34b22,1353289257,1369834483,2,5,2,2,True,False,Phish / Hack,etherscan.io labelcloud,None,None,input/labelcloud.csv,None,None,None
0x189c3d322e1b09cbbb61629cf538ace8dc9e8fa4,1260053461,1260058783,1,2,1,2,True,False,Phish / Hack,etherscan.io labelcloud,None,None,input/labelcloud.csv,None,None,None
0xe37742f207b4e51763974687906d31c6cf8150a5,1173362463,1477772322,0,93,0,10,True,False,Phish / Hack,etherscan.io labelcloud,None,None,input/labelcloud.csv,None,None,None
0xd37448ad7949c4ad8eba5aad1a0afdd3199971d8,1346660349,1462766919,0,90,0,29,True,False,Exploit,etherscan.io labelcloud,None,None,input/labelcloud.csv,None,None,None
0xb961f2a5eed42fc1607f4fb795ef6d36d341cd56,1022574449,1366115016,5,78,5,25,True,False,Phish / Hack,etherscan.io labelcloud,None,None,input/labelcloud.csv,None,None,None
0x71481c3ac7853ef63c87f0e9f91b6a5e16e04438,238735249,1178898366,20,71,18,53,True,False,Phish / Hack,etherscan.io labelcloud,None,None,input/labelcloud.csv,None,None,None
0x9bce48508cdef1d054e9577fde58afb3bf6c73c6,1003668345,1425332471,11,177,9,53,True,False,Phish / Hack,etherscan.io labelcloud,None,None,input/labelcloud.csv,None,None,None
0xfac4088bba1fa090fd3f1f52fd691a45c30ac053,1268911720,1307853854,2,4,2,4,True,False,Exploit,etherscan.io labelcloud,None,None,input/labelcloud.csv,None,None,None
0xf834efe5b959e52e3b78cb28c4bc501b52ce41da,1268910049,1307850648,2,6,2,5,True,False,Exploit,etherscan.io labelcloud,None,None,input/labelcloud.csv,None,None,None
0x07ba7e8947f8fb4d33f3c7e25c2cb35b858f02eb,1268908933,1307856805,2,4,2,4,True,False,Exploit,etherscan.io labelcloud,None,None,input/labelcloud.csv,None,None,None
0x56eb4a5f64fa21e13548b95109f42fa08a644628,1200468817,1278572403,4,43,4,4,True,False,Heist,etherscan.io labelcloud,None,None,input/labelcloud.csv,None,None,None
0x1a6fe9aa7bb81bd4b2bba6782d581ea3fe58125a,1130610792,1450476433,56,112,41,55,True,False,Phish / Hack,etherscan.io labelcloud,None,None,input/labelcloud.csv,None,None,None
0x7c522f5b9159d2fbca302a98501073635fbcbb7d,1377008600,1478685651,20,55,18,30,True,False,Phish / Hack,etherscan.io labelcloud,None,None,input/labelcloud.csv,None,None,None
0xd1dc670608c00e8e6378062b48ef5911b068ae3d,232992077,1363248827,15,36,13,30,True,False,Phish / Hack,etherscan.io labelcloud,None,None,input/labelcloud.csv,None,None,None
0x8bec4d048dea07f3cc8b04151a99ca84ccb72f2e,1389521765,1483859684,422,196,306,114,True,False,Phish / Hack,etherscan.io labelcloud,None,None,input/labelcloud.csv,None,None,None
0x0945198dd98c78d88568004d775e33800cfe4bfa,1208652347,1262059254,279,220,226,48,True,False,Phish / Hack,etherscan.io labelcloud,None,None,input/labelcloud.csv,None,None,None
0x59448ed44a0f106d972775067ac61d950d3b4223,1320556212,1373537275,9,225,8,69,True,False,Phishing,CryptoScamDB,http://key7.org,Malicious token airdrop linking to site phishing for funds - https://twitter.com/sniko_/status/1454217307568451593,input/addresses.json,None,None,None
0xa9bf70a420d364e923c74448d9d817d3f2a77822,684625023,1388245751,2510,261,22,39,True,False,Heist,etherscan.io labelcloud,None,None,input/labelcloud.csv,None,None,None
0x7863e62285a57aa8e61dccddc2f7080ba7097601,1315897342,1440289974,2,26,2,12,True,False,Phish / Hack,etherscan.io labelcloud,None,None,input/labelcloud.csv,None,None,None
0x9c166c4dfc6fc1a9322cd6cd1dfda004e9e695cd,1315847462,1345276840,72,39,68,21,True,False,Phishing,CryptoScamDB,http://univswap.org,Fake uniswap site phishing for funds,input/addresses.json,None,None,None
0xce1f4b4f17224ec6df16eeb1e3e5321c54ff6ede,1180278715,1464444684,13,122,10,48,True,False,Exploit,etherscan.io labelcloud,None,None,input/labelcloud.csv,None,None,None
0xbe5b36aff444ba3e098ed201d39b855c12432192,716307069,1461296216,14,133,14,20,True,False,Scamming,CryptoScamDB,http://trustswap-airdrop.com,Trust trading scam site,input/addresses.json,None,None,None
0x0b79ecd2128ea2ec74681160da517f851b89555a,1341646965,1378679969,2248,78,1747,41,True,False,Phish / Hack,etherscan.io labelcloud,None,None,input/labelcloud.csv,None,None,None
0x71c7656ec7ab88b098defb751b7401b5f6d8976f,45978209,1485671439,499,68,463,23,True,False,None,None,https://etherscan.io,Block explorer,input/addresses.json,None,None,None
0x6ca33486eed915816560630b883a047c4e2b92df,172434767,1422267045,22,128,10,119,True,False,Heist,etherscan.io labelcloud,None,None,input/labelcloud.csv,None,None,None
0x38d1871e8594b791571693737535fd230e054286,829447623,1202466116,1,23,1,8,True,False,Phish / Hack,etherscan.io labelcloud,None,None,input/labelcloud.csv,None,None,None
0xef9427bf15783fb8e6885f9b5f5da1fba66ef931,1242699521,1374956544,3,8,3,4,True,False,Exploit,etherscan.io labelcloud,None,None,input/labelcloud.csv,None,None,None
0x096dc87c708d96033ab7862b14a6f23c038a9394,1129115694,1415111821,4,440,4,24,True,False,Phish / Hack,etherscan.io labelcloud,None,None,input/labelcloud.csv,None,None,None
0x1aa18a80822b3fbed557f279b8666bb4962ad6de,815149470,1364363682,30,1021,17,158,True,False,Phish / Hack,etherscan.io labelcloud,None,None,input/labelcloud.csv,None,None,None
0xfa2731d0bede684993ab1109db7ecf5bf33e8051,1329199674,1463687423,6,86,4,15,True,False,Exploit,etherscan.io labelcloud,None,None,input/labelcloud.csv,None,None,None
0x4598208ba910af198627d7045e105d9b740a54c4,1351223497,1351304829,1,15,1,2,True,False,Exploit,etherscan.io labelcloud,None,None,input/labelcloud.csv,None,None,None
0x1164246850f8fca79e14fd256fa6b6dac857b873,1249283815,1480395110,947,105,560,54,True,False,Phish / Hack,etherscan.io labelcloud,None,None,input/labelcloud.csv,None,None,None
0xc88b5f4aae1c8f2778def2257b6baf1ba62e4b09,1021500463,1316173179,34,13,33,11,True,False,Phish / Hack,etherscan.io labelcloud,None,None,input/labelcloud.csv,None,None,None
0xd599cf7c482f5da1b98d470e19b7391c2f161b24,1209778852,1486519235,106,300,65,148,True,False,Phish / Hack,etherscan.io labelcloud,None,None,input/labelcloud.csv,None,None,None
0xbecb814e2862412a58a7d2ddd4d7cd4ade43677d,1332058901,1342983906,28,61,19,31,True,False,Phish / Hack,etherscan.io labelcloud,None,None,input/labelcloud.csv,None,None,None
0x34052df6bb69a7ccb54af356a6e8f56a7b3485fd,1012348280,1209165143,29,102,3,13,True,False,Phish / Hack,etherscan.io labelcloud,None,None,input/labelcloud.csv,None,None,None
0x00000000072d54638c2c2a3da3f715360269eea1,1262059254,1266043342,30,23,28,17,True,False,Phish / Hack,etherscan.io labelcloud,None,None,input/labelcloud.csv,None,None,None
0x8036ebd0fc9c120ba0469ffcb27b204aa06aaf1f,1167959422,1265351929,8,102,4,28,True,False,Exploit,etherscan.io labelcloud,None,None,input/labelcloud.csv,None,None,None
0x4bf0b2f9509d0ef3d071d1debfa20cf07fe08223,1365403911,1368277052,3,2,3,2,True,False,Exploit,etherscan.io labelcloud,None,None,input/labelcloud.csv,None,None,None
0x2c6900b24221de2b4a45c8c89482fff96ffb7e55,1393507288,1475422724,8,134,4,91,True,False,Heist,etherscan.io labelcloud,None,None,input/labelcloud.csv,None,None,None
0xfcd6a3dc5a18b12490e4aa087c324dc83d223510,1063651350,1331466327,113,82,103,48,True,False,Phish / Hack,etherscan.io labelcloud,None,None,input/labelcloud.csv,None,None,None
0x85704b506e10b10d714ead28cde947baa58f0ea4,162723170,1341969212,1,1,1,1,True,False,Phish / Hack,etherscan.io labelcloud,None,None,input/labelcloud.csv,None,None,None
0x11112f684cb88d43ca0e132e585e882606063fbe,1375207426,1407446065,2,45,2,14,True,False,Heist,etherscan.io labelcloud,None,None,input/labelcloud.csv,None,None,None
0xda3f8db5f3ecb711a5c6952f0b14eb0005ebf63c,916872614,1340735003,279,1315,190,505,True,False,Phish / Hack,etherscan.io labelcloud,None,None,input/labelcloud.csv,None,None,None
0xa14d5da3c6bf2d9304fe6d4bc6942395b4de048b,1262648983,1333252139,5,475,4,274,True,False,Phish / Hack,etherscan.io labelcloud,None,None,input/labelcloud.csv,None,None,None
0xc433d50dd0614c81ee314289ec82aa63710d25e8,1207985066,1464494550,486,339,292,117,True,False,Heist,etherscan.io labelcloud,None,None,input/labelcloud.csv,None,None,None
0x1a8f8122fa84c664ac105607eab99b2e5ae7c11c,232283872,1184008399,22,11,22,9,True,False,Phish / Hack,etherscan.io labelcloud,None,None,input/labelcloud.csv,None,None,None
0xea3a8bd1a99e16160832d6b473ce06c1058dff7e,293811830,1311090295,487,185,484,174,True,False,Phish / Hack,etherscan.io labelcloud,None,None,input/labelcloud.csv,None,None,None
0xf282f97d913404512919914e48bb0c5e35cf0483,894868485,1303595578,136,126,11,31,True,False,Phish / Hack,etherscan.io labelcloud,None,None,input/labelcloud.csv,None,None,None
0x24354d31bc9d90f62fe5f2454709c32049cf866b,1334725646,1464429315,35,176,26,84,True,False,Exploit,etherscan.io labelcloud,None,None,input/labelcloud.csv,None,None,None
0xcfb92a9d628faf3ea43aba0ef087bffefc31c2ed,839195532,840619305,6,4,6,3,True,False,Phish / Hack,etherscan.io labelcloud,None,None,input/labelcloud.csv,None,None,None
0x0344d3fecda48b181d99a0b7d875d957aa12369c,839212569,1113057337,19,64,13,40,True,False,Phish / Hack,etherscan.io labelcloud,None,None,input/labelcloud.csv,None,None,None
0x290b74320705ac9a41331f6794bd1bb63dc7059b,857333824,858365702,19,6,12,4,True,False,Phish / Hack,etherscan.io labelcloud,None,None,input/labelcloud.csv,None,None,None
0x6984331f60b7f3225c106bb58ea1b31093722ae3,857220485,952618635,6,7,6,6,True,False,Scamming,CryptoScamDB,http://cryptovitalik.s3-us-west-1.amazonaws.com,Trust trading scam site,input/addresses.json,None,None,None
0xba5ed1488be60ba2facc6b66c6d6f0befba22ebe,1318063341,1435016683,9,36,6,13,True,False,Exploit,etherscan.io labelcloud,None,None,input/labelcloud.csv,None,None,None
0x2a013a5062420607038c1e162fb46a177dbb287e,705178586,1123117442,107,128,75,56,True,False,Phish / Hack,etherscan.io labelcloud,None,None,input/labelcloud.csv,None,None,None
0xe10eee4a6dc0d8193430b8dba35514beea508412,850698974,906276270,1,2,1,2,True,False,Phish / Hack,etherscan.io labelcloud,None,None,input/labelcloud.csv,None,None,None
0x8006f98f33f8cf4156c36256cd0866250c753d26,961524462,1466768543,120,335,71,126,True,False,Phish / Hack,etherscan.io labelcloud,None,None,input/labelcloud.csv,None,None,None
0xa888868100e2a027ed97425a2307958b99a9495f,172502413,1277988670,12,112,10,48,True,False,Phish / Hack,etherscan.io labelcloud,None,None,input/labelcloud.csv,None,None,None
0x80e313e41301312cbcda2fd38aa6142af637f8cb,854812251,861206576,3,9,3,5,True,False,Phish / Hack,etherscan.io labelcloud,None,None,input/labelcloud.csv,None,None,None
0xdb72d3cbe827afa4b223cd928e4f9bed7418444e,876490168,886988586,3,5,3,3,True,False,Phish / Hack,etherscan.io labelcloud,None,None,input/labelcloud.csv,None,None,None
0x86da32e89924170cdfc8b11a6191b22ccb65a658,886279278,1040987262,62,191,54,62,True,False,Phish / Hack,etherscan.io labelcloud,None,None,input/labelcloud.csv,None,None,None
0xa5376c3d561369636b3da5a45f10534afe41e10b,813129651,926861825,4,24,4,15,True,False,Phish / Hack,etherscan.io labelcloud,None,None,input/labelcloud.csv,None,None,None
0x79d31b72efae46801e822946fca13d30ef30144e,850426781,850428050,1,1,1,1,True,False,Phish / Hack,etherscan.io labelcloud,None,None,input/labelcloud.csv,None,None,None
0x8bcfeaad8a808884d837085614315f1c137621e3,850421163,850422583,1,1,1,1,True,False,Phish / Hack,etherscan.io labelcloud,None,None,input/labelcloud.csv,None,None,None
0x82d5109de6653db5fb9f277370ef9621ebe67abc,850412162,850413529,1,1,1,1,True,False,Phish / Hack,etherscan.io labelcloud,None,None,input/labelcloud.csv,None,None,None
0xde117b88db44287d6dc78d0d0b7d670bb47859de,850410164,850410842,1,1,1,1,True,False,Phish / Hack,etherscan.io labelcloud,None,None,input/labelcloud.csv,None,None,None
0x93ff1870219e7c722f61f0c09715ebeafb4de631,917451372,1004730075,2,4,1,3,True,False,Phish / Hack,etherscan.io labelcloud,None,None,input/labelcloud.csv,None,None,None
0x7cacaea4a2126818a1f2a3ebbbfce3b0e5480318,854491603,855793067,33,2,32,2,True,False,Phish / Hack,etherscan.io labelcloud,None,None,input/labelcloud.csv,None,None,None
0xa871657c39bbd4b6732f0ad6fcfb1253f4ec962e,849793585,850953549,1,2,1,2,True,False,Phish / Hack,etherscan.io labelcloud,None,None,input/labelcloud.csv,None,None,None
0xe6d18c06b4dfac77a54891063800170031ff39a6,999742486,1460474298,14,229,9,76,True,False,Phish / Hack,etherscan.io labelcloud,None,None,input/labelcloud.csv,None,None,None
0x1f5b1aee0775fb44a3c2b8185d91afb8f0f613ad,879897470,879951903,1,4,1,4,True,False,Scamming,CryptoScamDB,http://freeuniswap.com,Trust trading scam site (promoted by twitter id: 2508885097),input/addresses.json,None,None,None
0x5bb6aa761ee435480859124b3db6ecb03550f075,879897018,879949700,1,5,1,4,True,False,Phish / Hack,etherscan.io labelcloud,None,None,input/labelcloud.csv,None,None,None
0xaaf710a008c60ca60454fda7384a5b11313f8cdc,896229101,1065223243,19,90,16,41,True,False,Phish / Hack,etherscan.io labelcloud,None,None,input/labelcloud.csv,None,None,None
0x262441a1a31b44b469eef4380ec7de275c17e890,897566822,1029819984,25,188,22,78,True,False,Phish / Hack,etherscan.io labelcloud,None,None,input/labelcloud.csv,None,None,None
0x647c809489c3384ade0d26bd938bd5400cd5a4a9,793596769,842070977,6,158,6,37,True,False,Phish / Hack,etherscan.io labelcloud,None,None,input/labelcloud.csv,None,None,None
0x2aa8af4a79575458d5d0bcbff6d7f045f877e3c4,841378367,856050263,11,17,9,9,True,False,Phish / Hack,etherscan.io labelcloud,None,None,input/labelcloud.csv,None,None,None
0xa9d499f4e14d5046cbdfd01cde3e8c3ea0ac94d7,619191465,1191956675,118,14,91,3,True,False,Phish / Hack,etherscan.io labelcloud,None,None,input/labelcloud.csv,None,None,None
0x3e97891da9a6e6d4484572c25270a4a46fac52b5,852678886,852684396,1,2,1,2,True,False,Phish / Hack,etherscan.io labelcloud,None,None,input/labelcloud.csv,None,None,None
0x953a16aa90ff214a8572447293e6a06a057211ab,1004721028,1004765702,2,2,2,2,True,False,Scamming,CryptoScamDB,http://uni-promo.net,Trust trading scam site,input/addresses.json,None,None,None
0x782b00ceaa3b13ea36044596eb4b33d1eb58bfdd,1004718987,1004732817,2,2,1,2,True,False,Phish / Hack,etherscan.io labelcloud,None,None,input/labelcloud.csv,None,None,None
0x87d7da420bda88693d945475a75f2d4a849f8d93,1004713633,1004765703,2,3,2,2,True,False,Phish / Hack,etherscan.io labelcloud,None,None,input/labelcloud.csv,None,None,None
0x11ab90ab478b6c7892ae3041749cc8352962ab20,840364516,841016162,3,6,3,2,True,False,Phish / Hack,etherscan.io labelcloud,None,None,input/labelcloud.csv,None,None,None
0xc1e97d5f2527ad5bca74dbd528dc89e34348e12b,846118727,850938187,2,8,2,6,True,False,Phish / Hack,etherscan.io labelcloud,None,None,input/labelcloud.csv,None,None,None
0xb961f2a5eed42fc1607f4fb795ef6d36d341cd56,1022574449,1366115016,5,78,5,25,True,False,Phish / Hack,etherscan.io labelcloud,None,None,input/labelcloud.csv,None,None,None
0x84d785f443df8f1f4e113fca0b37b0fb59c8a0e0,842518352,842519806,1,1,1,1,True,False,Scamming,CryptoScamDB,http://fund-vechain.com,Trust trading scam site (xrp destination tag: 100992747),input/addresses.json,None,None,None
0x1db3dc42185aa6889b92793380c09c2f51b44f26,912329244,917238748,13,85,12,43,True,False,Phish / Hack,etherscan.io labelcloud,None,None,input/labelcloud.csv,None,None,None
0x499068f2b6958a9f570e9ec49e2ececa147f65e1,693932718,845947485,21,43,20,38,True,False,Phish / Hack,etherscan.io labelcloud,None,None,input/labelcloud.csv,None,None,None
0x9bce48508cdef1d054e9577fde58afb3bf6c73c6,1003668345,1425332471,11,177,9,53,True,False,Phish / Hack,etherscan.io labelcloud,None,None,input/labelcloud.csv,None,None,None
0x575162ecc95ec30d99da411ee04b35e5cd50778d,842668949,852007268,7,4,7,4,True,False,Phish / Hack,etherscan.io labelcloud,None,None,input/labelcloud.csv,None,None,None
0x961bd2e55d694e77f0816e9febf91e068cdf82a6,842667015,842668949,1,2,1,2,True,False,Phish / Hack,etherscan.io labelcloud,None,None,input/labelcloud.csv,None,None,None
0x6d7e7ba61de1d09940a60a2f4f154e9927ad4562,1046683868,1075134536,8,8,8,7,True,False,Scamming,CryptoScamDB,http://freeunigiveaway.com,Trust trading scam site (promoted by twitter id: 2984108125),input/addresses.json,None,None,None
0x70dcf33ca09bd87bb2a301280331406ebd32c8a0,1395181514,1475442811,6,148,4,33,True,False,Heist,etherscan.io labelcloud,None,None,input/labelcloud.csv,None,None,None
0x988e8749bbba431f1dcca9b01ab77f0e94fd4b2c,852689794,852692476,1,1,1,1,True,False,Phish / Hack,etherscan.io labelcloud,None,None,input/labelcloud.csv,None,None,None
0x926ee893b7a9d9edce57cbb7195f4aa431144db0,232464571,1020418651,25,187,16,37,True,False,Phish / Hack,etherscan.io labelcloud,None,None,input/labelcloud.csv,None,None,None
0x5f37e2788e419568ade357e483dc8cbe3a96e2a1,818001411,838244755,3,157,3,53,True,False,Phish / Hack,etherscan.io labelcloud,None,None,input/labelcloud.csv,None,None,None
0xd0e929ea70a916e53b4606d7ea5280cb0ddaf7d1,753436411,1421221313,4,23,4,12,True,False,Phish / Hack,etherscan.io labelcloud,None,None,input/labelcloud.csv,None,None,None
0x12ee527b57f5c862ad129934d2852b62aa14fd2e,851588494,879946655,1,4,1,4,True,False,Phish / Hack,etherscan.io labelcloud,None,None,input/labelcloud.csv,None,None,None
0x2a1fb4a63257f0bca0b48bf55eda5ac746b8a75b,841300750,841370557,2,7,1,2,True,False,Scamming,CryptoScamDB,http://link-drop.net,Trust trading scam site,input/addresses.json,None,None,None
0x90debc62a8c541c1b3bb5e5d18dbd01661125ee6,1034053651,1034055844,1,1,1,1,True,False,Scamming,CryptoScamDB,http://uniswapaddress.com,Trust trading scam site (promoted by twitter id: 2984108125),input/addresses.json,None,None,None
0xa420be3b8c17e0df418629eb9cd0c68f49a99461,844534618,844700408,1,2,1,2,True,False,Phish / Hack,etherscan.io labelcloud,None,None,input/labelcloud.csv,None,None,None
0x7848aa63e9beec2405dc3e5e58edb568a8dd0231,844226221,1162282439,790,11,651,8,True,False,Phish / Hack,etherscan.io labelcloud,None,None,input/labelcloud.csv,None,None,None
0xc9ddc35218dcf2c7d4417f9943a029e420c6cf65,842231772,844534618,2,10,2,4,True,False,Phish / Hack,etherscan.io labelcloud,None,None,input/labelcloud.csv,None,None,None
0x59448ed44a0f106d972775067ac61d950d3b4223,1320556212,1373537275,9,225,8,69,True,False,Phishing,CryptoScamDB,http://key7.org,Malicious token airdrop linking to site phishing for funds - https://twitter.com/sniko_/status/1454217307568451593,input/addresses.json,None,None,None
0xd9ac9d0f84318a317db08d4978e3675dd2d2c4bf,1026285491,1472151307,26,48,23,32,True,False,Phish / Hack,etherscan.io labelcloud,None,None,input/labelcloud.csv,None,None,None
0x91bd14a1de43f49d72503a1def8e7273328cf80a,846305206,850423614,1,1,1,1,True,False,Phish / Hack,etherscan.io labelcloud,None,None,input/labelcloud.csv,None,None,None
0x787d43a0b5739afcd807fbb90f1775c4f22ca182,748773986,1301443513,17,18,16,2,True,False,Phish / Hack,etherscan.io labelcloud,None,None,input/labelcloud.csv,None,None,None
0xcf73d835a960c9c3114b5051d9b5dfa9dcf32956,844104411,844675701,1,2,1,2,True,False,Phish / Hack,etherscan.io labelcloud,None,None,input/labelcloud.csv,None,None,None
0xb3958757fd6d2dfbcc934f39faa1f82210da6f50,775451625,1485928683,149,592,92,285,True,False,Phish / Hack,etherscan.io labelcloud,None,None,input/labelcloud.csv,None,None,None
0x9d02ebb2b9151f655bfec1c8347a65d1429bc434,985153918,1251075727,28,80,19,41,True,False,Phish / Hack,etherscan.io labelcloud,None,None,input/labelcloud.csv,None,None,None
0xece5b20ec4fbcf57be400630bcb821bcf1cbe3c6,1017623809,1097293013,4,141,4,38,True,False,Phishing,CryptoScamDB,http://lotto.fashion,Fake lotto.finance site phishing to get approval() abuse signed transactions to steal erc20's,input/addresses.json,None,None,None
0xed1eab18667ad15c161a227c462f5196bf071580,866562999,867656885,2,2,2,1,True,False,Phish / Hack,etherscan.io labelcloud,None,None,input/labelcloud.csv,None,None,None
0xc60f19452c7e656bb0b85d52e4fb01cde4d3e8c8,902869220,909552524,5,4,5,3,True,False,Scamming,CryptoScamDB,http://unigive.net,Trust trading scam site,input/addresses.json,None,None,None
0xb69149f8b9322ec0cf8020df22c237640c6791f1,1005022633,1005238951,7,9,5,6,True,False,Scamming,CryptoScamDB,http://uniswapgiveaway.com,Trust trading scam site (promoted by twitter id: 1012427454),input/addresses.json,None,None,None
0x995aa6897e5139f17ca556cd4465716fdf8d2e4b,1326894546,1373802323,6,86,4,48,True,False,Phishing,CryptoScamDB,http://key7.org,Malicious token airdrop linking to site phishing for funds - https://twitter.com/sniko_/status/1454217307568451593,input/addresses.json,None,None,None
0xf646b725306dab4a989e26cb7615998a25492aa2,785253253,841405870,4,17,3,5,True,False,Phish / Hack,etherscan.io labelcloud,None,None,input/labelcloud.csv,None,None,None
0xa83060a89300c76b26aa1af767b8af23faef4c29,1004705190,1004765704,0,5,0,4,True,False,Phish / Hack,etherscan.io labelcloud,None,None,input/labelcloud.csv,None,None,None
0xd2c3d630b77c2a1b080daf11942086ade5700e5d,813465439,1352679377,29,42,29,20,True,False,Phish / Hack,etherscan.io labelcloud,None,None,input/labelcloud.csv,None,None,None
0x5b8c17f135f651e929aa4d7f41ba73a1630ca506,858748245,993617327,6,9,6,4,True,False,Phish / Hack,etherscan.io labelcloud,None,None,input/labelcloud.csv,None,None,None
0xb899c815c6b179e4ff6608bafabb5ff4f156d3c7,1008549417,1008626003,4,4,3,2,True,False,Phish / Hack,etherscan.io labelcloud,None,None,input/labelcloud.csv,None,None,None
0xc8a65fadf0e0ddaf421f28feab69bf6e2e589963,1239411243,1468572729,1584,97,1172,29,True,False,Exploit,etherscan.io labelcloud,None,None,input/labelcloud.csv,None,None,None
0xc6a098044200726e7f0edb9927b2531757adb59f,1008671357,1008675151,1,4,1,4,True,False,Scamming,CryptoScamDB,http://cryptogiftsgive.neocities.org,Trust trading scam site,input/addresses.json,None,None,None
0xd189e256bcf1ca98804a13928dd3ded37f8ca08d,660489896,1023538045,1,8,1,8,True,False,Phish / Hack,etherscan.io labelcloud,None,None,input/labelcloud.csv,None,None,None
0xfba4f48ab4a394ff38af368b7c2b37547a41e1b0,895548131,937352635,6,98,6,42,True,False,Phish / Hack,etherscan.io labelcloud,None,None,input/labelcloud.csv,None,None,None
0x46a9ced2e87b3a78fef88237a1a4ceaa22307968,909551272,914414386,4,5,4,3,True,False,Scamming,CryptoScamDB,http://yfiget.org,Trust trading scam site,input/addresses.json,None,None,None
0x7c7ff63f2513080eeb73d2eaf3cf6e8b62b13459,578041156,1152492051,58,373,25,63,True,False,Scamming,CryptoScamDB,http://feex.exchange,Fake exchange phishing for deposits,input/addresses.json,None,None,None
0xc0ad01e6f283d5f29930e479b9e9588107230983,740092155,841109747,29,82,13,18,True,False,Phish / Hack,etherscan.io labelcloud,None,None,input/labelcloud.csv,None,None,None
0x1aa18a80822b3fbed557f279b8666bb4962ad6de,815149470,1364363682,30,1021,17,158,True,False,Phish / Hack,etherscan.io labelcloud,None,None,input/labelcloud.csv,None,None,None
0x4207388910870b2afdf9df2ccfd06830830004ee,848038090,1020163137,4,3,4,3,True,False,Phish / Hack,etherscan.io labelcloud,None,None,input/labelcloud.csv,None,None,None
0xe9a2cc79e5d707fe23aad7d731fc5ae5b38ac3e5,799285834,991666217,80,24,76,20,True,False,Phish / Hack,etherscan.io labelcloud,None,None,input/labelcloud.csv,None,None,None
0x4d4f0ace8233836e0cf6ae21820bd7f76871c1ec,760138483,1201942835,2,20,2,5,True,False,Phish / Hack,etherscan.io labelcloud,None,None,input/labelcloud.csv,None,None,None
0x3ddabffdba61369ffc0daa28c33ff974bf6bfd98,970931150,994880721,6,15,3,5,True,False,Phish / Hack,etherscan.io labelcloud,None,None,input/labelcloud.csv,None,None,None
0x9df618ea881b0bca6b224f7cb86ecaff369cded7,660533628,1023609369,1,8,1,8,True,False,Phish / Hack,etherscan.io labelcloud,None,None,input/labelcloud.csv,None,None,None
0x154e7d6dcd3b18840cf094629ab4f1776d2ba89f,802636101,891210068,29,324,10,28,True,False,Phish / Hack,etherscan.io labelcloud,None,None,input/labelcloud.csv,None,None,None
0x1a24d08e3e8682c2cd38159ec8006fa5b20c9f1e,848171077,879944517,1,4,1,4,True,False,Scamming,CryptoScamDB,http://unigiveaway.com,Trust trading scam site (promoted by twitter id: 1521656557),input/addresses.json,None,None,None
0x969244f550a683e6e3425c7cb87aa6afe5fda253,865183073,1005428770,1,82,1,15,True,False,Scamming,CryptoScamDB,http://crypto-gives.s3.us-east-2.amazonaws.com,Trust trading scam site,input/addresses.json,None,None,None
0xed65d4b2530a193ba98e0ff5b0f30148cbbf9bbe,631457307,1019716703,1,7,1,6,True,False,Phish / Hack,etherscan.io labelcloud,None,None,input/labelcloud.csv,None,None,None
0x300e5cc5847db2ca0190465089b8e568caa76fb9,856938208,993614277,6,6,5,4,True,False,Phish / Hack,etherscan.io labelcloud,None,None,input/labelcloud.csv,None,None,None
0xd264fa72cc12690e1cbca5052c803d28574bbf43,841934882,846769084,7,163,3,26,True,False,Phish / Hack,etherscan.io labelcloud,None,None,input/labelcloud.csv,None,None,None
0x578fd2367f31b62b6a32ef21d2a3193d22c34fe9,886511311,1003398853,2,19,1,9,True,False,Phish / Hack,etherscan.io labelcloud,None,None,input/labelcloud.csv,None,None,None
0x4d76d8dd2a86760520255e99c05a5080fc8d33cc,788657908,843505008,2,11,2,9,True,False,Phish / Hack,etherscan.io labelcloud,None,None,input/labelcloud.csv,None,None,None
0x6f1c30b499acd49856b3a98f02f15dbad15e6e10,804729450,1413604778,5,292,2,26,True,False,Phish / Hack,etherscan.io labelcloud,None,None,input/labelcloud.csv,None,None,None
0xb0473323f6d0eee8732fbc6af8f32504ce897611,755857802,1201940882,2,11,2,4,True,False,Phish / Hack,etherscan.io labelcloud,None,None,input/labelcloud.csv,None,None,None
0x4fa5f575c3c11d3d3ed2f776bc906d3a1ae31a53,862382006,864430262,0,3,0,3,True,False,Phish / Hack,etherscan.io labelcloud,None,None,input/labelcloud.csv,None,None,None
0x17528e3baee18484f775874cca27fac025bb5715,844893357,1117479180,8,4,8,3,True,False,Phish / Hack,etherscan.io labelcloud,None,None,input/labelcloud.csv,None,None,None
0x1dd4c4c639e6264bfdeeca0e9814d8a33a0c3a40,844944198,874174282,1,4,1,4,True,False,Phish / Hack,etherscan.io labelcloud,None,None,input/labelcloud.csv,None,None,None
0xed40dfae2215b96762949204687274ed21043b75,847725556,850940823,1,2,1,2,True,False,Phish / Hack,etherscan.io labelcloud,None,None,input/labelcloud.csv,None,None,None
0x18f39ead861d9edd999900a1ea8f4193a481e78f,847686201,851923778,3,1,3,1,True,False,Phish / Hack,etherscan.io labelcloud,None,None,input/labelcloud.csv,None,None,None
0x07f8428993e0d16f914040b4ac478fa82826a796,844582922,870867354,4,5,4,4,True,False,Phish / Hack,etherscan.io labelcloud,None,None,input/labelcloud.csv,None,None,None
0x9da1f846a241e4e4ad4be8b94bd9c953e76c6887,847031780,855451267,0,45,0,24,True,False,Phish / Hack,etherscan.io labelcloud,None,None,input/labelcloud.csv,None,None,None
0x529158c43b00b727905c67fbbd6510f3c230757d,846837813,846844107,1,3,1,3,True,False,Phish / Hack,etherscan.io labelcloud,None,None,input/labelcloud.csv,None,None,None
0xeade619ee57d4edf08234b9b635ac951a590edf6,838681589,870692471,19,39,18,8,True,False,Phish / Hack,etherscan.io labelcloud,None,None,input/labelcloud.csv,None,None,None
0xa8189407a37001260975b9da61a81c3bd9f55908,1416113355,1416244864,0,35,0,14,True,False,Exploit,etherscan.io labelcloud,None,None,input/labelcloud.csv,None,None,None
0xc0857a36bdf02f027d573e19f4f1719f32610ad7,987517679,988364682,1,2,1,2,True,False,Scamming,CryptoScamDB,http://uniaward.net,Trust trading scam site,input/addresses.json,None,None,None
0xdd9dfcec6823835ed771275beaefc626a0955d7e,843411949,855012794,2,9,2,4,True,False,Phish / Hack,etherscan.io labelcloud,None,None,input/labelcloud.csv,None,None,None
0x5d7d56d1d7e18f42c88c1192a550ef6a46f1e0b5,819965227,1071245701,3,32,2,7,True,False,Phish / Hack,etherscan.io labelcloud,None,None,input/labelcloud.csv,None,None,None
0xb49f533d766443e4a0cfd42be511bd987b3fcf46,846476079,846877254,2,4,2,4,True,False,Phish / Hack,etherscan.io labelcloud,None,None,input/labelcloud.csv,None,None,None
0xab16b77486413086730b200232ee9dc0699179fa,859678251,860334037,2,3,2,3,True,False,Phish / Hack,etherscan.io labelcloud,None,None,input/labelcloud.csv,None,None,None
0xe45f1f2ac63b464fccd55845000a6300fc55027d,808780158,857177952,2,9,2,5,True,False,Phish / Hack,etherscan.io labelcloud,None,None,input/labelcloud.csv,None,None,None
0x2c6900b24221de2b4a45c8c89482fff96ffb7e55,1393507288,1475422724,8,134,4,91,True,False,Heist,etherscan.io labelcloud,None,None,input/labelcloud.csv,None,None,None
0x09ac4b425ef1ebeadfe4999d9f99e89c99b5937b,848694422,851021911,1,4,1,2,True,False,Phish / Hack,etherscan.io labelcloud,None,None,input/labelcloud.csv,None,None,None
0x2d675e9df1b5f36fdc5480718161cc1f041140cd,862967538,864431490,1,2,1,2,True,False,Phish / Hack,etherscan.io labelcloud,None,None,input/labelcloud.csv,None,None,None
0x1cbdb2fa7861f1b3d01e0249c1cd3532829fb08a,862967179,864438655,1,2,1,2,True,False,Phish / Hack,etherscan.io labelcloud,None,None,input/labelcloud.csv,None,None,None
0x694afabc190e2041a334986129a722474efe0643,862966777,864386160,1,2,1,2,True,False,Phish / Hack,etherscan.io labelcloud,None,None,input/labelcloud.csv,None,None,None
0xc77815170a7b8743c2e1996850cbb91bdfcf185c,862966521,864453591,1,2,1,2,True,False,Phish / Hack,etherscan.io labelcloud,None,None,input/labelcloud.csv,None,None,None
0x848668c8c07924d77a600df4033c6e3170fb7aed,825211599,1286835336,36,17,10,7,True,False,Phish / Hack,etherscan.io labelcloud,None,None,input/labelcloud.csv,None,None,None
0x09710c915edbce7ef5382214094b562314c5c626,857762921,927719814,7,13,7,5,True,False,Phish / Hack,etherscan.io labelcloud,None,None,input/labelcloud.csv,None,None,None
0xda3f8db5f3ecb711a5c6952f0b14eb0005ebf63c,916872614,1340735003,279,1315,190,505,True,False,Phish / Hack,etherscan.io labelcloud,None,None,input/labelcloud.csv,None,None,None
0x6f38419a097299a5ea8596314bedaa0aa8f8d8c6,863755034,894235864,2,2,2,2,True,False,Scamming,CryptoScamDB,http://unireward.org,Trust trading scam site,input/addresses.json,None,None,None
0xa14d5da3c6bf2d9304fe6d4bc6942395b4de048b,1262648983,1333252139,5,475,4,274,True,False,Phish / Hack,etherscan.io labelcloud,None,None,input/labelcloud.csv,None,None,None
0x327c697c7c736964be8329fcb89de911989e4cb0,665234322,1019758738,1,8,1,8,True,False,Phish / Hack,etherscan.io labelcloud,None,None,input/labelcloud.csv,None,None,None
0xc433d50dd0614c81ee314289ec82aa63710d25e8,1207985066,1464494550,486,339,292,117,True,False,Heist,etherscan.io labelcloud,None,None,input/labelcloud.csv,None,None,None
0x9457c385d12c800e3695376efae905265423243e,845070823,866914108,23,13,8,7,True,False,Phish / Hack,etherscan.io labelcloud,None,None,input/labelcloud.csv,None,None,None
0x30f22013cb880ea03402a4d71880024837336d01,903666116,909963076,26,80,23,46,True,False,Phish / Hack,etherscan.io labelcloud,None,None,input/labelcloud.csv,None,None,None
0x95a4ee08cd409ca66395fd10ad19cef80258345d,1045470631,1096856955,2,102,2,36,True,False,Phishing,CryptoScamDB,http://1ncih.exchange,Fake 1inch site - stealing funds via erc20 approve(),input/addresses.json,None,None,None
0xee7221adc34b88c3311b0c1054eeb74af68f4f98,839859619,862276092,14,16,14,8,True,False,Phish / Hack,etherscan.io labelcloud,None,None,input/labelcloud.csv,None,None,None
0x3483fe6152626b4d3a1d2d3217ba8d1bec6efcb2,1122566454,1155160647,3,2,3,2,True,False,Scamming,CryptoScamDB,http://uniholders.com,Trust trading scam site (promoted by twitter id: 446364639),input/addresses.json,None,None,None
0x0d5d6005fca3d29a3c494863fecc6b0359786e30,630634734,1023509053,1,12,1,8,True,False,Phish / Hack,etherscan.io labelcloud,None,None,input/labelcloud.csv,None,None,None
0x079667f4f7a0b440ad35ebd780efd216751f0758,892198194,969096357,15,668,7,72,True,False,Phish / Hack,etherscan.io labelcloud,None,None,input/labelcloud.csv,None,None,None
0xa08f203211627035050fee967401907206c92bec,853125913,855184534,2,1,2,1,True,False,Phish / Hack,etherscan.io labelcloud,None,None,input/labelcloud.csv,None,None,None
0x5cbe85b821b14df08fba73b1c37e69ed621f9b52,988356049,1018921300,1,2,1,2,True,False,Scamming,CryptoScamDB,http://uni2021.com,Trust trading scam site,input/addresses.json,None,None,None
0x27ea854adde0006c3194e32747a332aef7783acd,988354289,988367191,1,2,1,2,True,False,Scamming,CryptoScamDB,http://unipromo.app,Trust trading scam site,input/addresses.json,None,None,None
0x24354d31bc9d90f62fe5f2454709c32049cf866b,1334725646,1464429315,35,176,26,84,True,False,Exploit,etherscan.io labelcloud,None,None,input/labelcloud.csv,None,None,None
0x27210b23018bceffdf2762359ebb337e429ec000,887447309,1033683754,28,148,24,65,True,False,Phish / Hack,etherscan.io labelcloud,None,None,input/labelcloud.csv,None,None,None
0x5578840aae68682a9779623fa9e8714802b59946,1250726467,1464464790,39,68,25,51,True,False,Exploit,etherscan.io labelcloud,None,None,input/labelcloud.csv,None,None,None
0xa79bab8d82baa14884f4be6244d11eed6ac6fd3f,893399653,1004721028,1,2,1,2,True,False,Phish / Hack,etherscan.io labelcloud,None,None,input/labelcloud.csv,None,None,None
0x2ce845ba873d4caacc787f3e978ffa671052c83b,1020167798,1020187457,1,2,1,2,True,False,Scamming,CryptoScamDB,http://2021uni.org,Trust trading scam site,input/addresses.json,None,None,None
0x3cb3cca6185bff079b69dcb1fc2256dd8932632b,662775714,1095802387,307,89,241,21,True,False,Phish / Hack,etherscan.io labelcloud,None,None,input/labelcloud.csv,None,None,None
0xba9da55bbb2ca86e13315063ceb6331da677d9e9,864362998,870921833,26,83,17,39,True,False,Phish / Hack,etherscan.io labelcloud,None,None,input/labelcloud.csv,None,None,None
0xcfc84de17cc9564ab12871d4e9f911b74b44e9b2,864294123,872252669,13,153,10,16,True,False,Phish / Hack,etherscan.io labelcloud,None,None,input/labelcloud.csv,None,None,None
0x917a417d938b9f9e6ae7f9e5253fb6de410343e3,840578985,1004579677,2529,515,8,43,True,False,Phish / Hack,etherscan.io labelcloud,None,None,input/labelcloud.csv,None,None,None
0x911ffa9ec83bd443ba040f3c5e576d7601c1a433,851826890,866261700,4,1,4,1,True,False,Phish / Hack,etherscan.io labelcloud,None,None,input/labelcloud.csv,None,None,None
0xb0091be2ea814275a4590afbdf7c609c8e27bfee,840498149,850414632,5,12,4,11,True,False,Phish / Hack,etherscan.io labelcloud,None,None,input/labelcloud.csv,None,None,None
0xa51cc593b0a55b3ee61fb8835c87d352211bfccf,840487531,912081694,6,5,6,4,True,False,Phish / Hack,etherscan.io labelcloud,None,None,input/labelcloud.csv,None,None,None
0xd523911f139f5d6d9c8c8d2a1eef42f1a1df31f9,760238211,838946655,2,14,2,5,True,False,Phish / Hack,etherscan.io labelcloud,None,None,input/labelcloud.csv,None,None,None
0x079667f4f7a0b440ad35ebd780efd216751f0758,892198194,969096357,15,668,7,72,True,False,Phish / Hack,etherscan.io labelcloud,None,None,input/labelcloud.csv,None,None,None
