,transaction_index,from_address,to_address,value,input,output,trace_type,call_type,reward_type,gas,gas_used,subtraces,trace_address,error,status,trace_id,transaction_hash,block_number,block_id_group
0,178,0x77358e0eb7d07138c6ce859c970572d014d078dc,0x71c7656ec7ab88b098defb751b7401b5f6d8976f,30000000000000000,0x,0x,call,call,,0,0,0,,,1,call_0xca0c0eb856ddf493436a98a25a0485fb25ae9d4c2b88124253274ee30d8c198c_,0xca0c0eb856ddf493436a98a25a0485fb25ae9d4c2b88124253274ee30d8c198c,4599841,4599
1,63,0x71c7656ec7ab88b098defb751b7401b5f6d8976f,0xa4973ca595630f794413aaf290c4cf780987b142,1000000000000000000,0x,0x,call,call,,0,0,0,,,1,call_0x00a0cccf4c3cfabf0039b0e675457222210befc86a45d454b1b0008291af72b9_,0x00a0cccf4c3cfabf0039b0e675457222210befc86a45d454b1b0008291af72b9,4573024,4573
2,23,0xaf31bf4fa017768e6426308cf17e16d633700265,0x71c7656ec7ab88b098defb751b7401b5f6d8976f,10000000000000000,0x,0x,call,call,,0,0,0,,,1,call_0x33541ac7cdc6620948feb6f10c9b11ff487d365baa2e1b5979462fc194749387_,0x33541ac7cdc6620948feb6f10c9b11ff487d365baa2e1b5979462fc194749387,4551275,4551
3,39,0xaf31bf4fa017768e6426308cf17e16d633700265,0x71c7656ec7ab88b098defb751b7401b5f6d8976f,10000000000000000,0x,0x,call,call,,0,0,0,,,1,call_0x59744b209c47fc4a5c1750e8ce73bbbe667fb60e07c951da330efc0f950e5203_,0x59744b209c47fc4a5c1750e8ce73bbbe667fb60e07c951da330efc0f950e5203,4551285,4551
4,97,0x71c7656ec7ab88b098defb751b7401b5f6d8976f,0x9d3ed54ad8bf0bc91a15f60065f09155795df78a,50000000000000000,0x,0x,call,call,,0,0,0,,,1,call_0x99c6e64cb4b4b53088c5580dd1daf7c4f55824ee5e6f2862a8452934c544858c_,0x99c6e64cb4b4b53088c5580dd1daf7c4f55824ee5e6f2862a8452934c544858c,4530167,4530
5,28,0xb6c5518d79e7365e1503d157a0c460f85b4e2804,0x71c7656ec7ab88b098defb751b7401b5f6d8976f,300000000000000000,0x,0x,call,call,,69000,0,0,,,1,call_0x0edbc3bbb34386466f8861606f6f90bf19d85022d80f07397736ae88453f2db8_,0x0edbc3bbb34386466f8861606f6f90bf19d85022d80f07397736ae88453f2db8,4529042,4529
6,43,0xb3d73a71aee3920272adbdecc9709b8e786f5f8e,0x71c7656ec7ab88b098defb751b7401b5f6d8976f,15000000000000000,0x,0x,call,call,,10500,0,0,,,1,call_0x64cfcbb8b1a0fc7c218a8563bdb3a6ffd76f6f05fea83179cf010a09dfa9438b_,0x64cfcbb8b1a0fc7c218a8563bdb3a6ffd76f6f05fea83179cf010a09dfa9438b,4520387,4520
7,51,0x8ea05d73d5f8797e64d3133f3c8af25c2fd6c26b,0x71c7656ec7ab88b098defb751b7401b5f6d8976f,9617190000000000,0x,0x,call,call,,129000,0,0,,,1,call_0x585eb16ebeff29f236525f1edd30356635b387a4497e9b7d4d608313d3fdd562_,0x585eb16ebeff29f236525f1edd30356635b387a4497e9b7d4d608313d3fdd562,4517881,4517
