,transaction_index,from_address,to_address,value,input,output,trace_type,call_type,reward_type,gas,gas_used,subtraces,trace_address,error,status,trace_id,transaction_hash,block_number,block_id_group
0,112,0x14d465376c051cbcd80aa2d35fd5df9910f80543,0x71c7656ec7ab88b098defb751b7401b5f6d8976f,1310364000000000,0x,0x,call,call,,0,0,0,,,1,call_0x31e2928f43de70f1c863e3088f625f119951449f54d0409fffa21ee2475e7d69_,0x31e2928f43de70f1c863e3088f625f119951449f54d0409fffa21ee2475e7d69,8920570,8920
1,209,0xdf3b0554199faac00a7994438ae289f44406b04e,0x71c7656ec7ab88b098defb751b7401b5f6d8976f,50000000000000,0x,0x,call,call,,0,0,0,,,1,call_0x45ebfc09fe3c59480b4f2066f6d5d0c6c8cb7f90c6b6f8ab7793699436571825_,0x45ebfc09fe3c59480b4f2066f6d5d0c6c8cb7f90c6b6f8ab7793699436571825,8903091,8903
