date,value,sum
2020-08-31,0.0,0.0
2020-09-04,0.0,0.0
2020-09-08,0.0,0.0
2020-09-10,0.0,0.0
2020-09-12,0.0,0.0
2020-09-15,0.0,0.0
2020-09-16,0.0,0.0
2020-09-17,0.0,0.0
2020-09-18,0.0,0.0
2020-09-25,0.0,0.0
2020-09-26,0.0,0.0
2020-09-28,0.0,0.0
2020-09-29,0.0,0.0
2020-10-02,0.0,0.0
2020-10-05,0.0,0.0
2020-10-09,0.0,0.0
2020-10-17,0.0,0.0
2020-11-03,0.0,0.0
2020-11-07,0.0,0.0
2020-11-12,0.0,0.0
2020-11-17,0.0,0.0
2020-11-21,0.0,0.0
2020-11-24,0.0,0.0
2020-11-25,0.0,0.0
2020-11-29,0.0,0.0
2020-12-01,0.0,0.0
2020-12-04,0.0,0.0
2020-12-17,0.0,0.0
2021-01-11,0.0,0.0
2021-02-13,0.0,0.0
2021-02-27,0.0,0.0
2021-04-09,0.0,0.0
2021-06-11,0.0,0.0
2021-07-12,0.0,0.0
2021-07-15,0.0,0.0
2021-07-19,0.0,0.0
2021-07-23,0.0,0.0
2021-10-28,0.0,0.0
2021-12-05,0.0,0.0
2021-12-17,0.0,0.0
2021-12-19,0.0,0.0
