\relax 
\providecommand\babel@aux[2]{}
\@nameuse{bbl@beforestart}
\catcode `"\active 
\providecommand \oddpage@label [2]{}
\babel@aux{polish}{}
\@writefile{toc}{\contentsline {section}{\numberline {1}Obciążenia}{3}{}\protected@file@percent }
\@writefile{toc}{\contentsline {subsection}{\numberline {1.1}Potrzebne dane}{3}{}\protected@file@percent }
\@writefile{toc}{\contentsline {subsection}{\numberline {1.2}Statyka}{3}{}\protected@file@percent }
\@writefile{toc}{\contentsline {subsubsection}{\numberline {1.2.1}Sterolotka}{3}{}\protected@file@percent }
\@writefile{toc}{\contentsline {subsubsection}{\numberline {1.2.2}Siłownik}{3}{}\protected@file@percent }
\gdef \@abspage@last{3}
