\babel@toc {polish}{}\relax 
\contentsline {section}{\numberline {1}Obciążenia}{3}{}%
\contentsline {subsection}{\numberline {1.1}Potrzebne dane}{3}{}%
\contentsline {subsection}{\numberline {1.2}Statyka}{3}{}%
\contentsline {subsubsection}{\numberline {1.2.1}Sterolotka}{3}{}%
\contentsline {subsubsection}{\numberline {1.2.2}Siłownik}{3}{}%
