{
  "name": "stime",
  "permissions": "NONE",
  "restriction": "1",
  "_id": "YHhUQ",
  "actions": [
    {
      "type": "3",
      "storage": "1",
      "varName": "godzinka",
      "name": "Store Time Info"
    },
    {
      "type": "4",
      "storage": "1",
      "varName": "minute",
      "name": "Store Time Info"
    },
    {
      "storage": "1",
      "varName": "minute",
      "comparison": "4",
      "value": "10",
      "iftrue": "3",
      "iftrueVal": "1",
      "iffalse": "0",
      "iffalseVal": "1",
      "name": "Check Variable"
    },
    {
      "behavior": "0",
      "interpretation": "0",
      "code": "var min = tempVars(\"minute\").toString();\n\nif (min < 10) {\n    var min2 = '0' + min;\n    console.log(min2);\n} else {\n    min2;\n    console.log(min2);\n};\n\nthis.storeValue(min2, 1, \"minute\", cache);",
      "storage": "0",
      "varName": "",
      "name": "Run Script"
    },
    {
      "activity": "0",
      "nameText": "mija czas:🕔 ${tempVars(\"godzinka\")} : ${tempVars(\"minute\")}",
      "url": "",
      "stat": "0",
      "name": "Set Bot Activity"
    }
  ],
  "event-type": "3",
  "temp": "15"
}