{
  "name": "Documentation API",
  "version": "0.3.0",
  "description": "POC Documentation API",
  "title": "Documentation API",
  "url" : "https://tst-ariane.atlas.hermes",
  "sampleUrl": "",
  "output": "/tmp/apidoc-output",
  "input": [
    "example"
  ],
  "order": [
    "User",
    "PostUser",
    "GetUser",
    "City",
    "Category (official)"
  ],
  "header": {
    "title": "Introduction",
    "filename": "header.md"
  },
 
  "template": {
    "showRequiredLabels": true,
    "withCompare": true,
    "withGenerator": true,
    "aloneDisplay": false
  }
}
