[{  
    "id":12,
    "departamento":"Cundinamarca",
    "ciudades":[  
        "Agua de Dios",
        "Alb\u00e1n",
        "Anapoima",
        "Anolaima",
        "Apulo",
        "Arbel\u00e1ez",
        "Beltr\u00e1n",
        "Bituima",
        "Bogot\u00e1",
        "Bojac\u00e1",
        "Cabrera",
        "Cachipay",
        "Cajic\u00e1",
        "Caparrap\u00ed",
        "C\u00e1queza",
        "Carmen de Carupa",
        "Chaguan\u00ed",
        "Ch\u00eda",
        "Chipaque",
        "Choach\u00ed",
        "Chocont\u00e1",
        "Cogua",
        "Cota",
        "Cucunub\u00e1",
        "El Colegio",
        "El Pe\u00f1\u00f3n",
        "El Rosal",
        "Facatativ\u00e1",
        "F\u00f3meque",
        "Fosca",
        "Funza",
        "F\u00faquene",
        "Fusagasug\u00e1",
        "Gachal\u00e1",
        "Gachancip\u00e1",
        "Gachet\u00e1",
        "Gama",
        "Girardot",
        "Granada",
        "Guachet\u00e1",
        "Guaduas",
        "Guasca",
        "Guataqu\u00ed",
        "Guatavita",
        "Guayabal de S\u00edquima",
        "Guayabetal",
        "Guti\u00e9rrez",
        "Jerusal\u00e9n",
        "Jun\u00edn",
        "La Calera",
        "La Mesa",
        "La Palma",
        "La Pe\u00f1a",
        "La Vega",
        "Lenguazaque",
        "Machet\u00e1",
        "Madrid",
        "Manta",
        "Medina",
        "Mosquera",
        "Nari\u00f1o",
        "Nemoc\u00f3n",
        "Nilo",
        "Nimaima",
        "Nocaima",
        "Pacho",
        "Paime",
        "Pandi",
        "Paratebueno",
        "Pasca",
        "Puerto Salgar",
        "Pul\u00ed",
        "Quebradanegra",
        "Quetame",
        "Quipile",
        "Ricaurte",
        "San Antonio del Tequendama",
        "San Bernardo",
        "San Cayetano",
        "San Francisco",
        "San Juan de Rioseco",
        "Sasaima",
        "Sesquil\u00e9",
        "Sibat\u00e9",
        "Silvania",
        "Simijaca",
        "Soacha",
        "Sop\u00f3",
        "Subachoque",
        "Suesca",
        "Supat\u00e1",
        "Susa",
        "Sutatausa",
        "Tabio",
        "Tausa",
        "Tena",
        "Tenjo",
        "Tibacuy",
        "Tibirita",
        "Tocaima",
        "Tocancip\u00e1",
        "Topaip\u00ed",
        "Ubal\u00e1",
        "Ubaque",
        "Ubat\u00e9",
        "Une",
        "\u00datica",
        "Venecia",
        "Vergara",
        "Vian\u00ed",
        "Villag\u00f3mez",
        "Villapinz\u00f3n",
        "Villeta",
        "Viot\u00e1",
        "Yacop\u00ed",
        "Zipac\u00f3n",
        "Zipaquir\u00e1"
    ]
},