<picture>
                <source media="(min-width: 500px)" srcset="https://ego11.s3-sa-east-1.amazonaws.com/images/home/banner/01_Nuevo_Home_06.webp">
                <source media="(min-width: 0px)" srcset="https://ego11.s3-sa-east-1.amazonaws.com/images/home/banner/01_Nuevo_Home_06.webp">
                <img src="https://ego11.s3-sa-east-1.amazonaws.com/images/home/banner/01_Nuevo_Home-03.png" alt="">
            </picture>

            calc(32% - 14px)