<?xml version="1.0" encoding="UTF-8"?>
<svg width="46px" height="46px" viewBox="0 0 46 46" version="1.1" xmlns="http://www.w3.org/2000/svg" xmlns:xlink="http://www.w3.org/1999/xlink">
    <title>montaz-parkietow</title>
    <defs>
        <polygon id="path-1" points="0 0 45.7142857 0 45.7142857 45.7135945 0 45.7135945"></polygon>
    </defs>
    <g id="Sklep" stroke="none" stroke-width="1" fill="none" fill-rule="evenodd">
        <g id="01-Home" transform="translate(-647.000000, -761.000000)">
            <g id="montaz-parkietow" transform="translate(647.000000, 761.000000)">
                <mask id="mask-2" fill="white">
                    <use xlink:href="#path-1"></use>
                </mask>
                <g id="Clip-2"></g>
                <path d="M44.1106395,6.51135664 L40.8860664,9.73592975 L36.4034605,5.25332383 L40.0531381,1.60364622 L43.6233246,1.60364622 C43.8894469,1.60364622 44.1106395,1.8248388 44.1106395,2.09096113 L44.1106395,6.51135664 Z M44.1106395,17.7714415 L40.8860664,20.9960146 L36.4380218,16.5514262 L42.0715204,10.9213837 L42.0335029,10.8833663 L44.1106395,8.80622968 L44.1106395,17.7714415 Z M44.1106395,29.0315264 L40.8860664,32.2560995 L36.4380218,27.8115111 L42.0715204,22.1814686 L42.0335029,22.1469073 L44.1106395,20.0697707 L44.1106395,29.0315264 Z M44.1106395,40.2950674 L40.8860664,43.5196406 L36.4380218,39.071596 L42.0715204,33.4415535 L42.0335029,33.4069922 L44.1106395,31.3298556 L44.1106395,40.2950674 Z M44.1106395,43.6233246 C44.1106395,43.892903 43.8894469,44.1106395 43.6233246,44.1106395 L42.5588353,44.1106395 L44.1106395,42.5588353 L44.1106395,43.6233246 Z M30.2446295,44.1106395 L24.2758859,38.1384398 L28.7550357,33.65929 L34.1362365,39.0370346 L34.098219,39.071596 L39.1338064,44.1106395 L30.2446295,44.1106395 Z M18.3071423,44.1106395 L23.1422739,39.2720518 L27.9774055,44.1106395 L18.3071423,44.1106395 Z M12.1863288,39.071596 L17.8163713,33.4415535 L17.7818099,33.4069922 L23.1595546,28.0292475 L27.6006869,32.473836 L21.9706445,38.1038784 L22.0086619,38.1384398 L16.6309173,43.5196406 L12.1863288,39.071596 Z M5.99293653,44.1106395 L1.60364622,39.7213492 L1.60364622,36.4829515 L4.46186912,33.6247286 L9.88108739,39.0370346 L9.84306991,39.071596 L14.8786573,44.1106395 L5.99293653,44.1106395 Z M2.09096113,44.1106395 C1.82138267,44.1106395 1.60364622,43.892903 1.60364622,43.6233246 L1.60364622,41.9920293 L3.72225642,44.1106395 L2.09096113,44.1106395 Z M1.60364622,30.7284883 L3.34899394,32.473836 L1.60364622,34.2157276 L1.60364622,30.7284883 Z M1.60364622,25.2228666 L4.46186912,22.3577315 L9.88108739,27.7769497 L9.84306991,27.8115111 L15.4731124,33.4415535 L11.03198,37.886142 L1.60364622,28.4612643 L1.60364622,25.2228666 Z M1.60364622,19.4684034 L3.34899394,21.2137511 L1.60364622,22.9556427 L1.60364622,19.4684034 Z M1.60364622,13.9593256 L4.46186912,11.0976466 L9.88108739,16.5168649 L9.84306991,16.5514262 L15.4731124,22.1814686 L11.03198,26.6260571 L1.60364622,17.1977233 L1.60364622,13.9593256 Z M1.60364622,8.20486235 L3.34899394,9.94675393 L1.60364622,11.6921017 L1.60364622,8.20486235 Z M1.60364622,2.09096113 C1.60364622,1.8248388 1.82138267,1.60364622 2.09096113,1.60364622 L6.22795364,1.60364622 L9.88108739,5.25332383 L9.84306991,5.28788517 L15.4731124,10.9179276 L11.03198,15.3659722 L1.60364622,5.93763838 L1.60364622,2.09096113 Z M13.530765,1.60364622 L11.0146994,4.11625571 L8.50208988,1.60364622 L13.530765,1.60364622 Z M24.6871659,1.60364622 L21.9706445,4.31671149 L22.0086619,4.35472896 L16.6309173,9.73592975 L12.1448552,5.25332383 L15.7945328,1.60364622 L24.6871659,1.60364622 Z M29.9059284,21.2483124 L29.9439458,21.2137511 L24.3139034,15.5767964 L28.7550357,11.1356641 L34.1327804,16.5134087 L34.098219,16.5514262 L39.7282615,22.1814686 L35.283673,26.6260571 L29.9059284,21.2483124 Z M17.7818099,10.8833663 L23.1595546,5.50562162 L27.6006869,9.94675393 L21.9706445,15.5767964 L22.0086619,15.61827 L16.6309173,20.9960146 L12.1863288,16.5514262 L17.8163713,10.9213837 L17.7818099,10.8833663 Z M22.0086619,26.8783549 L16.6309173,32.2560995 L12.1863288,27.8115111 L17.8163713,22.1814686 L17.7818099,22.1469073 L23.1595546,16.7657065 L27.6006869,21.2137511 L21.9706445,26.8437935 L22.0086619,26.8783549 Z M24.3139034,26.8437935 L28.7550357,22.3992051 L34.1327804,27.7769497 L34.098219,27.8115111 L39.7317176,33.4415535 L35.283673,37.886142 L29.9059284,32.5083973 L29.9439458,32.473836 L24.3139034,26.8437935 Z M30.4831027,1.60364622 L34.1362365,5.25332383 L34.098219,5.28788517 L39.7317176,10.9179276 L35.283673,15.3659722 L29.9059284,9.98477141 L29.9439458,9.94675393 L24.3139034,4.31671149 L27.0269686,1.60364622 L30.4831027,1.60364622 Z M37.782458,1.60364622 L35.2698485,4.11625571 L32.7537828,1.60364622 L37.782458,1.60364622 Z M43.6233246,0 L2.09096113,0 C2.07022432,0 2.04948752,0 2.02875072,0.0034561341 C0.922787804,0.0311052069 0.034561341,0.922787804 0.0034561341,2.02875072 C0,2.04948752 0,2.07022432 0,2.09096113 L0,43.6233246 C0,44.7811295 0.933156206,45.7142857 2.09096113,45.7142857 L43.6233246,45.7142857 C44.7776734,45.7142857 45.7142857,44.7811295 45.7142857,43.6233246 L45.7142857,2.09096113 C45.7142857,0.936612341 44.7776734,0 43.6233246,0 L43.6233246,0 Z" id="Fill-1" fill="#FFFFFF" mask="url(#mask-2)"></path>
            </g>
        </g>
    </g>
</svg>