<?xml version="1.0" encoding="UTF-8"?>
<svg width="20px" height="20px" viewBox="0 0 20 20" version="1.1" xmlns="http://www.w3.org/2000/svg" xmlns:xlink="http://www.w3.org/1999/xlink">
    <title>01-wsparcie</title>
    <g id="Sklep" stroke="none" stroke-width="1" fill="none" fill-rule="evenodd">
        <g id="02-o-firmie" transform="translate(-426.000000, -6583.000000)" fill="#00993B" fill-rule="nonzero">
            <g id="01-wsparcie" transform="translate(426.000000, 6583.000000)">
                <path d="M10,20 L10,20 C8.34314575,20 7,18.6568542 7,17 L7,14 L13,14 L13,17 C13,18.6568542 11.6568542,20 10,20 Z" id="Path"></path>
                <path d="M10,16 C6.6862915,16 4,13.3137085 4,10 C4,6.6862915 6.6862915,4 10,4 C13.3137085,4 16,6.6862915 16,10 C15.9963846,13.3122098 13.3122098,15.9963846 10,16 Z M10,6 C7.790861,6 6,7.790861 6,10 C6,12.209139 7.790861,14 10,14 C12.209139,14 14,12.209139 14,10 C13.9976466,7.79183657 12.2081634,6.00235345 10,6 L10,6 Z" id="Shape"></path>
                <rect id="Rectangle" x="9.25" y="0" width="1.5" height="2"></rect>
                <rect id="Rectangle" x="0" y="9.25" width="2" height="1.5"></rect>
                <rect id="Rectangle" x="18" y="9.25" width="2" height="1.5"></rect>
                <rect id="Rectangle" transform="translate(16.364255, 3.635993) rotate(-44.999880) translate(-16.364255, -3.635993) " x="15.3641898" y="2.88607305" width="2.00013" height="1.49984"></rect>
                <rect id="Rectangle" transform="translate(3.635743, 3.635990) rotate(-44.990030) translate(-3.635743, -3.635990) " x="2.88582303" y="2.63592515" width="1.49984" height="2.00013"></rect>
            </g>
        </g>
    </g>
</svg>