<?xml version="1.0" encoding="UTF-8"?>
<svg width="24px" height="24px" viewBox="0 0 24 24" version="1.1" xmlns="http://www.w3.org/2000/svg" xmlns:xlink="http://www.w3.org/1999/xlink">
    <title>misja</title>
    <g id="Sklep" stroke="none" stroke-width="1" fill="none" fill-rule="evenodd">
        <g id="02-o-firmie" transform="translate(-376.000000, -5323.000000)" fill="#FFFFFF" fill-rule="nonzero">
            <g id="Group-3" transform="translate(100.000000, 5153.000000)">
                <g id="misja" transform="translate(276.000000, 170.000000)">
                    <path d="M10.6325174,16.901672 C8.81718537,16.9018234 7.29702192,15.5265225 7.11598076,13.7202406 C6.9349396,11.9139586 8.15191731,10.2643178 9.9311693,9.90418897 L12.1386005,7.6967578 C11.6483617,7.55789238 11.1419976,7.48406313 10.6325174,7.47716683 C7.37938585,7.47716683 4.74220165,10.114351 4.74220165,13.3674826 C4.74220165,16.6206142 7.37938585,19.2577983 10.6325174,19.2577983 C13.885649,19.2577983 16.5228332,16.6206142 16.5228332,13.3674826 C16.5159369,12.8580024 16.4421076,12.3516383 16.3032422,11.8613995 L14.095811,14.0688307 C13.7603679,15.7156046 12.3131069,16.8994085 10.6325174,16.901672 Z" id="Path"></path>
                    <path d="M18.1564062,10.0082355 C19.7871375,13.6481545 18.5866184,17.9334177 15.3021986,20.1963542 C12.0177788,22.4592906 7.58596221,22.0546574 4.76565242,19.2343476 C1.94534262,16.4140378 1.5407094,11.9822212 3.80364585,8.69780138 C6.0665823,5.41338161 10.3518455,4.21286253 13.9917645,5.84359378 L15.7484334,4.08692491 C11.1176824,1.53088524 5.31180521,2.77311316 2.13237941,7.00022153 C-1.04704638,11.2273299 -0.630231401,17.1499649 3.10990186,20.8900981 C6.85003512,24.6302314 12.7726701,25.0470464 16.9997785,21.8676206 C21.2268868,18.6881948 22.4691148,12.8823176 19.9130751,8.25156664 L18.1564062,10.0082355 Z" id="Path"></path>
                    <polygon id="Path" points="20.8592836 6.64427618 16.1965097 7.76225811 17.3368748 3.00406104 20.2525811 -5.23165134e-16 20.8463249 2.94987013 23.7961951 3.54361396"></polygon>
                    <path d="M10.6325174,14.2510306 C10.2751998,14.2510306 9.95309147,14.035704 9.8163597,13.7055824 C9.67962794,13.3754608 9.75519281,12.9954813 10.0078259,12.742791 L19.4323311,3.31828582 C19.655514,3.09510291 19.9808101,3.00794005 20.2856837,3.08963066 C20.5905572,3.17132127 20.8286905,3.4094546 20.9103811,3.71432811 C20.9920717,4.01920163 20.9049089,4.3444978 20.681726,4.5676807 L11.2572207,13.9921859 C11.0917265,14.1581579 10.8668995,14.2513143 10.6325174,14.2510306 Z" id="Path"></path>
                </g>
            </g>
        </g>
    </g>
</svg>