<?xml version="1.0" encoding="UTF-8"?>
<svg width="20px" height="18px" viewBox="0 0 20 18" version="1.1" xmlns="http://www.w3.org/2000/svg" xmlns:xlink="http://www.w3.org/1999/xlink">
    <title>hide</title>
    <g id="icons" stroke="none" stroke-width="1" fill="none" fill-rule="evenodd">
        <g id="icons/ui/hide" transform="translate(0.000000, -2.000000)" fill="#16273D" fill-rule="nonzero">
            <g id="hide" transform="translate(0.000000, 2.000000)">
                <path d="M13.07875,9.20666667 L14.303125,7.98229167 C14.3477083,8.231875 14.375,8.48770833 14.375,8.75 C14.375,11.1625 12.4120833,13.125 10,13.125 C9.73770833,13.125 9.48208333,13.0977083 9.23229167,13.053125 L10.4566667,11.82875 C11.811875,11.6279167 12.8779167,10.561875 13.07875,9.20666667 Z M16.6608333,5.62458333 C17.9364583,7.00166667 18.631875,8.39 18.7408333,8.75 C18.5077083,9.52020833 15.625625,15 10,15 C9.1475,15 8.365625,14.8629167 7.63875,14.6466667 L6.64229167,15.643125 C7.64791667,16.020625 8.76666667,16.25 10,16.25 C16.6620833,16.25 20,9.585 20,8.75 C20,8.33666667 19.180625,6.49458333 17.5460417,4.739375 L16.6608333,5.62458333 Z M18.566875,1.066875 L2.316875,17.316875 C2.19479167,17.4389583 2.035,17.5 1.875,17.5 C1.715,17.5 1.55520833,17.4389583 1.433125,17.316875 C1.18895833,17.0727083 1.18895833,16.6772917 1.433125,16.433125 L3.83125,14.035 C1.27895833,12.0141667 0,9.26666667 0,8.75 C0,7.915 3.33791667,1.25 10,1.25 C12.0152083,1.25 13.724375,1.86145833 15.1308333,2.73541667 L17.683125,0.183125 C17.9272917,-0.0610416667 18.3227083,-0.0610416667 18.566875,0.183125 C18.8110417,0.427291667 18.8110417,0.822708333 18.566875,1.066875 Z M4.72708333,13.1391667 L6.50104167,11.3652083 C5.95354167,10.6345833 5.625,9.73104167 5.625,8.75 C5.625,6.3375 7.58791667,4.375 10,4.375 C10.9810417,4.375 11.8845833,4.70354167 12.6152083,5.25104167 L14.2147917,3.65145833 C13.0402083,2.97125 11.6402083,2.5 10,2.5 C4.374375,2.5 1.49229167,7.97979167 1.25916667,8.75 C1.4025,9.22375 2.55645833,11.4735417 4.72708333,13.1391667 Z M7.395625,10.470625 L11.7204167,6.14583333 C11.2264583,5.818125 10.6358333,5.625 10,5.625 C8.276875,5.625 6.875,7.026875 6.875,8.75 C6.875,9.38583333 7.068125,9.97645833 7.395625,10.470625 Z" id="Hide"></path>
            </g>
        </g>
    </g>
</svg>