<?xml version="1.0" encoding="UTF-8"?>
<svg width="16px" height="16px" viewBox="0 0 16 16" version="1.1" xmlns="http://www.w3.org/2000/svg" xmlns:xlink="http://www.w3.org/1999/xlink">
    <title>plus</title>
    <g id="icons" stroke="none" stroke-width="1" fill="none" fill-rule="evenodd">
        <g id="icons/ui/plus" transform="translate(-2.000000, -2.000000)" fill="#0068B6" fill-rule="nonzero">
            <g id="plus" transform="translate(2.000000, 2.000000)">
                <path d="M0.746666667,10 L5.25333333,10 C5.66570595,10 6,10.3342941 6,10.7466667 L6,15.2533333 C6,15.4513616 6.07866644,15.6412792 6.2186936,15.7813064 C6.35872077,15.9213336 6.54863835,16 6.74666667,16 L9.25333333,16 C9.45136165,16 9.64127923,15.9213336 9.7813064,15.7813064 C9.92133356,15.6412792 10,15.4513616 10,15.2533333 L10,10.7466667 C10,10.3342941 10.3342941,10 10.7466667,10 L15.2533333,10 C15.4513616,10 15.6412792,9.92133356 15.7813064,9.7813064 C15.9213336,9.64127923 16,9.45136165 16,9.25333333 L16,6.74666667 C16,6.54863835 15.9213336,6.35872077 15.7813064,6.2186936 C15.6412792,6.07866644 15.4513616,6 15.2533333,6 L10.7466667,6 C10.3342941,6 10,5.66570595 10,5.25333333 L10,0.746666667 C10,0.548638354 9.92133356,0.358720766 9.7813064,0.218693603 C9.64127923,0.0786664408 9.45136165,0 9.25333333,0 L6.74666667,0 C6.33429405,0 6,0.334294053 6,0.746666667 L6,5.25333333 C6,5.66570595 5.66570595,6 5.25333333,6 L0.746666667,6 C0.334294053,6 0,6.33429405 0,6.74666667 L0,9.25333333 C0,9.66570595 0.334294053,10 0.746666667,10 Z" id="Path"></path>
            </g>
        </g>
    </g>
</svg>