<?xml version="1.0" encoding="UTF-8"?>
<svg width="49px" height="24px" viewBox="0 0 49 24" version="1.1" xmlns="http://www.w3.org/2000/svg" xmlns:xlink="http://www.w3.org/1999/xlink">
    <title>DHL-logo</title>
    <g id="Sklep" stroke="none" stroke-width="1" fill="none" fill-rule="evenodd">
        <g id="09-Zamowienie" transform="translate(-1276.000000, -898.000000)" fill-rule="nonzero">
            <g id="dostawa" transform="translate(1176.000000, 735.000000)">
                <g id="components/inputs/Leading-Icon" transform="translate(32.000000, 147.000000)">
                    <g id="DHL-logo" transform="translate(68.000000, 16.000000)">
                        <polygon id="Path" fill="#FECC00" points="0 24 0 0 48.9372041 0 48.9372041 24"></polygon>
                        <path d="M15.7784252,11.1125767 C15.5645748,11.4021657 15.2067653,11.9056051 14.9890167,12.1996494 C14.8784716,12.3491775 14.6788223,12.6206673 15.3407003,12.6206673 L18.8255144,12.6206673 C18.8255144,12.6206673 19.38715,11.8565977 19.8580106,11.2175527 C20.4984479,10.3482287 19.9134224,8.53941113 17.6237199,8.53941113 L8.60636312,8.53941113 L7.04286083,10.6637137 L15.5642964,10.6637137 C15.9945032,10.6637137 15.9886557,10.8274429 15.7784252,11.1125767 L15.7784252,11.1125767 Z M13.2183468,13.144712 C12.5564688,13.144712 12.7561182,12.8726654 12.8666632,12.7231372 C13.0844119,12.429093 13.4480689,11.9309442 13.6619192,11.6413551 C13.8724282,11.3562213 13.8779972,11.1924921 13.4472335,11.1924921 L9.55003352,11.1924921 L6.40994173,15.460032 L14.0676223,15.460032 C16.5967927,15.460032 18.0049193,13.7397618 18.4390244,13.1449905 C18.4390244,13.144712 13.9183726,13.144712 13.2183468,13.144712 Z M18.199835,15.460032 L22.6920848,15.460032 L24.395091,13.1444336 L19.9033981,13.1449905 C19.9020059,13.144712 18.199835,15.460032 18.199835,15.460032 L18.199835,15.460032 Z M29.7903573,8.53941113 L28.0673026,10.8797917 L26.0624555,10.8797917 L27.7846749,8.53941113 L23.2938174,8.53941113 L20.2893312,12.6206673 L31.2770072,12.6206673 L34.280658,8.53941113 L29.7903573,8.53941113 Z M24.6969319,15.460032 L29.187511,15.460032 L30.8913525,13.1449905 L26.4007735,13.1449905 C26.3991028,13.144712 24.6969319,15.460032 24.6969319,15.460032 Z M0,14.0580312 L0,14.5497757 L6.25623679,14.5497757 L6.61766617,14.0580312 L0,14.0580312 Z M7.2901253,13.144712 L0,13.144712 L0,13.6358996 L6.92786057,13.6358996 L7.2901253,13.144712 Z M0,15.460032 L5.58600526,15.460032 L5.94576394,14.971072 L0,14.971072 L0,15.460032 Z M42.3445986,14.5494972 L48.9372041,14.5494972 L48.9372041,14.0577528 L42.7065849,14.0577528 L42.3445986,14.5494972 Z M41.6749239,15.460032 L48.9372041,15.460032 L48.9372041,14.971072 L42.0344042,14.971072 L41.6749239,15.460032 Z M43.3779302,13.144712 L43.0167793,13.6364565 L48.9372041,13.6364565 L48.9372041,13.144712 L43.3779302,13.144712 Z M37.4959315,12.6206673 L40.5001392,8.53941113 L35.7439179,8.53941113 C35.7422472,8.53941113 32.7374826,12.6206673 32.7374826,12.6206673 L37.4959315,12.6206673 Z M32.3523849,13.144712 C32.3523849,13.144712 32.0240912,13.5932966 31.8645388,13.8093745 C31.3006755,14.5712164 31.7993812,15.460032 33.6399422,15.460032 L40.8521013,15.460032 L42.5559429,13.1449905 L32.3523849,13.1449905 L32.3523849,13.144712 Z" id="Shape" fill="#D50029"></path>
                    </g>
                </g>
            </g>
        </g>
    </g>
</svg>