<?xml version="1.0" encoding="UTF-8"?>
<svg width="5px" height="8px" viewBox="0 0 5 8" version="1.1" xmlns="http://www.w3.org/2000/svg" xmlns:xlink="http://www.w3.org/1999/xlink">
    <title>icons/ui/chevron-left</title>
    <g id="Sklep" stroke="none" stroke-width="1" fill="none" fill-rule="evenodd">
        <g id="01-Home" transform="translate(-1125.000000, -557.000000)" fill="#16273D">
            <g id="icons/ui/chevron-left" transform="translate(1127.500000, 561.000000) scale(-1, 1) translate(-1127.500000, -561.000000) translate(1125.000000, 557.000000)">
                <path d="M1.10645809,7.82551043 C0.853340504,8.05816319 0.442955799,8.05816319 0.1898382,7.82551043 C-0.0632793999,7.59285766 -0.0632793999,7.21565301 0.1898382,6.98300024 L3.43523199,4 L0.1898382,1.01699979 C-0.0632793999,0.784347015 -0.0632793999,0.407142351 0.1898382,0.174489579 C0.442955799,-0.058163193 0.853340504,-0.058163193 1.10645809,0.174489579 L4.81016181,3.57874491 C5.0632794,3.81139768 5.0632794,4.18860233 4.81016181,4.4212551 L1.10645809,7.82551043 Z" id="chevron"></path>
            </g>
        </g>
    </g>
</svg>