<?xml version="1.0" encoding="UTF-8"?>
<svg width="16px" height="4px" viewBox="0 0 16 4" version="1.1" xmlns="http://www.w3.org/2000/svg" xmlns:xlink="http://www.w3.org/1999/xlink">
    <title>minus</title>
    <g id="icons" stroke="none" stroke-width="1" fill="none" fill-rule="evenodd">
        <g id="icons/ui/minus" transform="translate(-2.000000, -8.000000)" fill="#0068B6" fill-rule="nonzero">
            <g id="minus" transform="translate(2.000000, 8.000000)">
                <rect id="Rectangle" x="0" y="0" width="16" height="4" rx="2"></rect>
            </g>
        </g>
    </g>
</svg>