<?xml version="1.0" encoding="UTF-8"?>
<svg width="20px" height="18px" viewBox="0 0 20 18" version="1.1" xmlns="http://www.w3.org/2000/svg" xmlns:xlink="http://www.w3.org/1999/xlink">
    <title>04-doradztwo</title>
    <g id="Sklep" stroke="none" stroke-width="1" fill="none" fill-rule="evenodd">
        <g id="02-o-firmie" transform="translate(-1302.000000, -6584.000000)" fill="#00993B" fill-rule="nonzero">
            <g id="04-doradztwo" transform="translate(1302.000000, 6584.000000)">
                <path d="M4,18 L4,18 C1.7908592,18 0,16.2091408 0,14 L0,14 C0,11.7908592 1.7908592,10 4,10 L5,10 L5,17 C5,17.5522861 4.5522852,18 4,18 Z" id="Path"></path>
                <path d="M16,18 L15,18 L15,10 L16,10 C18.2091408,10 20,11.7908592 20,14 L20,14 C20,16.2091408 18.2091408,18 16,18 Z" id="Path"></path>
                <path d="M17,13 L15,13 L15,7 C15,4.2431641 12.7568359,2 10,2 C7.2431641,2 5,4.2431641 5,7 L5,13 L3,13 L3,7 C3,3.1401367 6.140625,0 10,0 C13.859375,0 17,3.1401367 17,7 L17,13 Z" id="Path"></path>
                <path d="M10,14 L10,14 C8.8954296,14 8,14.8954296 8,16 L8,16 C8,17.1045704 8.8954296,18 10,18 L12,18 L12,16 C12,14.8954296 11.1045704,14 10,14 Z" id="Path"></path>
                <rect id="Rectangle" x="11" y="16" width="5" height="2"></rect>
            </g>
        </g>
    </g>
</svg>