<?xml version="1.0" encoding="UTF-8"?>
<svg width="19px" height="20px" viewBox="0 0 19 20" version="1.1" xmlns="http://www.w3.org/2000/svg" xmlns:xlink="http://www.w3.org/1999/xlink">
    <title>icons/woocommerce/cart</title>
    <g id="components-//-woocommerce" stroke="none" stroke-width="1" fill="none" fill-rule="evenodd">
        <g id="woocommerce/menu/menu-dark" transform="translate(-1525.000000, -50.000000)" fill="#16273D" fill-rule="nonzero">
            <g id="icons" transform="translate(1368.000000, 50.000000)">
                <g id="bag" transform="translate(157.000000, 0.000000)">
                    <path d="M15.3333333,20 L3.33333333,20 C1.49533333,20 0,18.5046667 0,16.6666667 C0,16.6388889 0.00155555556,16.6113333 0.00511111111,16.584 L1.71311111,2.92 C1.92088889,1.25511111 3.34311111,0 5.02088889,0 L13.6457778,0 C15.3235556,0 16.7457778,1.25511111 16.9533333,2.92 L18.6613333,16.584 C18.6651111,16.6113333 18.6666667,16.6388889 18.6666667,16.6666667 C18.6666667,18.5046667 17.1713333,20 15.3333333,20 Z M1.33355556,16.7053333 C1.35422222,17.7904444 2.24355556,18.6666667 3.33333333,18.6666667 L15.3333333,18.6666667 C16.4231111,18.6666667 17.3124444,17.7904444 17.3331111,16.7053333 L15.6306667,3.08511111 C15.5057778,2.08666667 14.6526667,1.33333333 13.6457778,1.33333333 L5.02088889,1.33333333 C4.014,1.33333333 3.16088889,2.08666667 3.03622222,3.08533333 L1.33355556,16.7053333 Z M13.3333333,4 C13.3333333,3.63177778 13.0348889,3.33333333 12.6666667,3.33333333 C12.2984444,3.33333333 12,3.63177778 12,4 C12,5.47044444 10.8037778,6.66666667 9.33333333,6.66666667 C7.86288889,6.66666667 6.66666667,5.47044444 6.66666667,4 C6.66666667,3.63177778 6.36822222,3.33333333 6,3.33333333 C5.63177778,3.33333333 5.33333333,3.63177778 5.33333333,4 C5.33333333,6.20577778 7.12755556,8 9.33333333,8 C11.5391111,8 13.3333333,6.20577778 13.3333333,4 Z" id="Shopping_Bag"></path>
                </g>
            </g>
        </g>
    </g>
</svg>