<?xml version="1.0" encoding="UTF-8"?>
<svg width="16px" height="16px" viewBox="0 0 16 16" version="1.1" xmlns="http://www.w3.org/2000/svg" xmlns:xlink="http://www.w3.org/1999/xlink">
    <title>icons/woocommerce/view/grid</title>
    <g id="Sklep" stroke="none" stroke-width="1" fill="none" fill-rule="evenodd">
        <g id="03-Kategoria" transform="translate(-376.000000, -422.000000)" fill="#16273D" fill-rule="nonzero">
            <g id="icons/woocommerce/view/grid" transform="translate(376.000000, 422.000000)">
                <path d="M5.71428571,7.42857143 L1.71428571,7.42857143 C0.768952381,7.42857143 0,6.65961905 0,5.71428571 L0,1.71428571 C0,0.768952381 0.768952381,0 1.71428571,0 L5.71428571,0 C6.65961905,0 7.42857143,0.768952381 7.42857143,1.71428571 L7.42857143,5.71428571 C7.42857143,6.65961905 6.65961905,7.42857143 5.71428571,7.42857143 Z M1.71428571,1.14285714 C1.39904762,1.14285714 1.14285714,1.39904762 1.14285714,1.71428571 L1.14285714,5.71428571 C1.14285714,6.02952381 1.39904762,6.28571429 1.71428571,6.28571429 L5.71428571,6.28571429 C6.02952381,6.28571429 6.28571429,6.02952381 6.28571429,5.71428571 L6.28571429,1.71428571 C6.28571429,1.39904762 6.02952381,1.14285714 5.71428571,1.14285714 L1.71428571,1.14285714 Z M14.2857143,7.42857143 L10.2857143,7.42857143 C9.34038095,7.42857143 8.57142857,6.65961905 8.57142857,5.71428571 L8.57142857,1.71428571 C8.57142857,0.768952381 9.34038095,0 10.2857143,0 L14.2857143,0 C15.2310476,0 16,0.768952381 16,1.71428571 L16,5.71428571 C16,6.65961905 15.2310476,7.42857143 14.2857143,7.42857143 Z M10.2857143,1.14285714 C9.97047619,1.14285714 9.71428571,1.39904762 9.71428571,1.71428571 L9.71428571,5.71428571 C9.71428571,6.02952381 9.97047619,6.28571429 10.2857143,6.28571429 L14.2857143,6.28571429 C14.6009524,6.28571429 14.8571429,6.02952381 14.8571429,5.71428571 L14.8571429,1.71428571 C14.8571429,1.39904762 14.6009524,1.14285714 14.2857143,1.14285714 L10.2857143,1.14285714 Z M5.71428571,16 L1.71428571,16 C0.768952381,16 0,15.2310476 0,14.2857143 L0,10.2857143 C0,9.34038095 0.768952381,8.57142857 1.71428571,8.57142857 L5.71428571,8.57142857 C6.65961905,8.57142857 7.42857143,9.34038095 7.42857143,10.2857143 L7.42857143,14.2857143 C7.42857143,15.2310476 6.65961905,16 5.71428571,16 Z M1.71428571,9.71428571 C1.39904762,9.71428571 1.14285714,9.97047619 1.14285714,10.2857143 L1.14285714,14.2857143 C1.14285714,14.6009524 1.39904762,14.8571429 1.71428571,14.8571429 L5.71428571,14.8571429 C6.02952381,14.8571429 6.28571429,14.6009524 6.28571429,14.2857143 L6.28571429,10.2857143 C6.28571429,9.97047619 6.02952381,9.71428571 5.71428571,9.71428571 L1.71428571,9.71428571 Z M14.2857143,16 L10.2857143,16 C9.34038095,16 8.57142857,15.2310476 8.57142857,14.2857143 L8.57142857,10.2857143 C8.57142857,9.34038095 9.34038095,8.57142857 10.2857143,8.57142857 L14.2857143,8.57142857 C15.2310476,8.57142857 16,9.34038095 16,10.2857143 L16,14.2857143 C16,15.2310476 15.2310476,16 14.2857143,16 Z M10.2857143,9.71428571 C9.97047619,9.71428571 9.71428571,9.97047619 9.71428571,10.2857143 L9.71428571,14.2857143 C9.71428571,14.6009524 9.97047619,14.8571429 10.2857143,14.8571429 L14.2857143,14.8571429 C14.6009524,14.8571429 14.8571429,14.6009524 14.8571429,14.2857143 L14.8571429,10.2857143 C14.8571429,9.97047619 14.6009524,9.71428571 14.2857143,9.71428571 L10.2857143,9.71428571 Z" id="Grid"></path>
            </g>
        </g>
    </g>
</svg>