<?xml version="1.0" encoding="UTF-8"?>
<svg width="26px" height="24px" viewBox="0 0 26 24" version="1.1" xmlns="http://www.w3.org/2000/svg" xmlns:xlink="http://www.w3.org/1999/xlink">
    <title>wizja</title>
    <g id="Sklep" stroke="none" stroke-width="1" fill="none" fill-rule="evenodd">
        <g id="02-o-firmie" transform="translate(-1068.000000, -5323.000000)" fill="#FFFFFF" fill-rule="nonzero">
            <g id="Group-3" transform="translate(100.000000, 5153.000000)">
                <g id="wizja" transform="translate(968.000000, 170.000000)">
                    <polygon id="Path" points="12.7288421 24 0 24 6.36378947 13.8947368"></polygon>
                    <polygon id="Path" points="10.1052632 8.84210526 2.52631579 8.84210526 5.68421053 5.68421053 2.52631579 2.52631579 11.3684211 2.52631579 10.1052632 6.31578947"></polygon>
                    <rect id="Rectangle" x="13.8947368" y="5.05263158" width="2.52631579" height="6.31578947"></rect>
                    <rect id="Rectangle" x="10.1052632" y="0" width="6.31578947" height="6.31578947"></rect>
                    <path d="M15.1578947,7.57894737 L5.05263158,24 L25.2631579,24 L15.1578947,7.57894737 Z M17.6328632,16.4210526 L12.6829263,16.4210526 L15.1578947,12.3992842 L17.6328632,16.4210526 Z" id="Shape"></path>
                </g>
            </g>
        </g>
    </g>
</svg>