<?xml version="1.0" encoding="UTF-8"?>
<svg width="59px" height="61px" viewBox="0 0 59 61" version="1.1" xmlns="http://www.w3.org/2000/svg" xmlns:xlink="http://www.w3.org/1999/xlink">
    <title>posadzki-zywiczne-sign</title>
    <g id="components-//-woocommerce" stroke="none" stroke-width="1" fill="none" fill-rule="evenodd">
        <g id="woocommerce/product/card/list/default" transform="translate(-1041.000000, -8.000000)">
            <g id="posadzki-zywiczne-sign" transform="translate(1041.000000, 8.000000)">
                <rect id="container" fill="#00919A" x="1" y="2" width="56" height="56"></rect>
                <g id="posadzki-zywiczne">
                    <path d="M10.72002,48 L58.72002,48 L58.72002,0 L10.72002,0 L10.72002,48 Z M12.6401398,46.0798802 L56.7999002,46.0798802 L56.7999002,1.92011981 L12.6401398,1.92011981 L12.6401398,46.0798802 Z" id="Fill-1" fill="#FFFFFF"></path>
                    <g id="Group-22" transform="translate(0.000000, 3.540960)">
                        <path d="M2.44247769,55.8164628 L0.960059904,54.334045 C0.341252574,53.7152376 0,52.892158 0,52.0165626 C0,51.1407675 0.341252574,50.3176879 0.960059904,49.6988805 L25.7225176,26.2190203 C26.9599326,24.9816053 29.1200674,24.9816053 30.3574824,26.2190203 L31.8399002,27.7016378 C32.4587075,28.3202454 32.7999601,29.1435248 32.7999601,30.0191202 C32.7999601,30.8947156 32.4587075,31.7177952 31.8399002,32.3366025 L7.07744244,55.8164628 C6.45883479,56.4352701 5.63555546,56.7765227 4.75996006,56.7765227 C3.88436467,56.7765227 3.06128502,56.4352701 2.44247769,55.8164628 Z" id="Path" fill="#FFFFFF"></path>
                        <path d="M27.0799401,27.5766425 L2.31748237,51.0565027 C2.06149302,51.3132908 1.91992013,51.6537446 1.91992013,52.0165626 C1.91992013,52.3793806 2.06149302,52.7196348 2.31748237,52.9764228 L3.80009984,54.4590403 C4.31367598,54.9708193 5.20624415,54.9708193 5.72001997,54.4590403 L30.4824777,30.9789804 C30.738467,30.7221923 30.8800399,30.3819381 30.8800399,30.0191202 C30.8800399,29.6563022 30.738467,29.316048 30.4824777,29.0590603 L29.0000599,27.5766425 C28.7430722,27.3206531 28.402818,27.1790802 28.04,27.1790802 C27.677182,27.1790802 27.3369278,27.3206531 27.0799401,27.5766425 Z" id="Path" fill="#00919A"></path>
                        <polygon id="Fill-4" fill="#FFFFFF" points="29.1446837 27.3918789 27.7872613 26.0344564 31.1612488 22.6602692 32.5186713 24.0178913"></polygon>
                        <polygon id="Fill-6" fill="#FFFFFF" points="32.0256023 30.2709404 30.6681798 28.9135179 34.041169 25.5403291 35.3987911 26.8977515"></polygon>
                        <path d="M37.5540337,29.0990802 C36.7205708,29.0990802 35.9040805,28.7616216 35.3152252,28.1719675 L29.8881311,22.743875 C29.298477,22.1560181 28.96002,21.3393282 28.96002,20.5050665 C28.96002,20.1186863 29.0293088,19.7390952 29.1670878,19.3780743 L29.9827793,17.2369091 L31.7771009,17.9212114 L30.9616091,20.0615779 C30.9070965,20.2031508 30.8799401,20.3521118 30.8799401,20.5050665 C30.8799401,20.8331402 31.0131264,21.1538257 31.2447549,21.3852545 L36.6728473,26.8143453 C37.0113044,27.1538008 37.5474443,27.2672188 37.998321,27.0974911 L40.1376891,26.2817996 L40.8221911,28.0763209 L38.6818246,28.8918127 C38.320005,29.0295917 37.9402142,29.0990802 37.5540337,29.0990802" id="Fill-8" fill="#FFFFFF"></path>
                        <polygon id="Fill-10" fill="#FFFFFF" points="35.5562385 23.6128411 34.468783 22.5253855 35.8262055 21.1677634 36.913661 22.2554186"></polygon>
                        <polygon id="Fill-10" fill="#FFFFFF" points="30.5562385 9.61284107 29.468783 8.52538553 30.8262055 7.16776338 31.913661 8.2554186"></polygon>
                        <polygon id="Fill-10" fill="#FFFFFF" points="33.5562385 12.6128411 32.468783 11.5253855 33.8262055 10.1677634 34.913661 11.2554186"></polygon>
                        <polygon id="Fill-10" fill="#FFFFFF" points="36.5562385 15.6128411 35.468783 14.5253855 36.8262055 13.1677634 37.913661 14.2554186"></polygon>
                        <polygon id="Fill-10" fill="#FFFFFF" points="39.5562385 18.6128411 38.468783 17.5253855 39.8262055 16.1677634 40.913661 17.2554186"></polygon>
                        <polygon id="Fill-10" fill="#FFFFFF" points="42.5562385 21.6128411 41.468783 20.5253855 42.8262055 19.1677634 43.913661 20.2554186"></polygon>
                        <polygon id="Fill-10" fill="#FFFFFF" points="45.5562385 24.6128411 44.468783 23.5253855 45.8262055 22.1677634 46.913661 23.2554186"></polygon>
                        <polygon id="Fill-10" fill="#FFFFFF" points="48.5562385 27.6128411 47.468783 26.5253855 48.8262055 25.1677634 49.913661 26.2554186"></polygon>
                        <path d="M44.8257465,32.882349 L37.3224652,25.3790677 L37.3224652,25.3790677 L38.6798877,24.0216453 L45.5328439,30.8744205 C45.9234073,31.2648622 46.5565294,31.2648788 46.9471132,30.8744576 L47.7625176,30.0591601 L47.7625176,30.0591601 C48.0183073,29.8021723 48.1598802,29.4619182 48.1598802,29.0991002 C48.1598802,28.7362822 48.0183073,28.396028 47.7625176,28.1390403 L29.9199401,10.2966624 C29.4061643,9.78468374 28.5137958,9.78468374 28.00002,10.2966624 L27.1846156,11.1119599 C26.7940193,11.5024122 26.7939778,12.1355772 27.1844764,12.5261271 C27.1844919,12.5261426 27.1845074,12.526158 27.1845692,12.5261271 L34.0636928,19.4052507 L34.0636928,19.4052507 L32.7062704,20.7628729 L25.1766314,13.2332339 C24.3955828,12.4521853 24.3955828,11.1858553 25.1766314,10.4048068 L26.6423978,8.93904029 L26.6423978,8.93904029 C27.8800125,7.70162531 30.0399476,7.70162531 31.2775622,8.93904029 L49.1199401,26.7816178 C49.7387474,27.4004252 50.08,28.2235048 50.08,29.0991002 C50.08,29.9746956 49.7387474,30.7977752 49.1199401,31.4165826 L47.6541736,32.882349 C46.873125,33.6633976 45.6067951,33.6633976 44.8257465,32.882349 Z" id="Fill-12" fill="#FFFFFF"></path>
                        <g id="Group-5" transform="translate(31.566319, 0.000000)" fill="#FFFFFF">
                            <polygon id="Fill-19" points="1.35742247 7.29286104 0 5.93543857 3.04491545 2.89032344 4.40233792 4.24794559"></polygon>
                            <polygon id="Fill-20" points="6.15646401 2.49379953 4.79904154 1.13637706 5.93521892 0 7.29264139 1.35762215"></polygon>
                            <polygon id="Fill-20" points="8.15646401 12.4937995 6.79904154 11.1363771 7.93521892 10 9.29264139 11.3576221"></polygon>
                            <polygon id="Fill-20" points="13.156464 7.49379953 11.7990415 6.13637706 12.9352189 5 14.2926414 6.35762215"></polygon>
                            <polygon id="Fill-20" points="15.156464 18.4937995 13.7990415 17.1363771 14.9352189 16 16.2926414 17.3576221"></polygon>
                            <polygon id="Fill-21" points="18.6730054 24.5371982 17.3155829 23.1797758 22.1717927 18.3235659 23.5292152 19.6809884"></polygon>
                        </g>
                    </g>
                </g>
            </g>
        </g>
    </g>
</svg>