<?xml version="1.0" encoding="UTF-8"?>
<svg width="22px" height="18px" viewBox="0 0 22 18" version="1.1" xmlns="http://www.w3.org/2000/svg" xmlns:xlink="http://www.w3.org/1999/xlink">
    <title>02-dostawy</title>
    <g id="Sklep" stroke="none" stroke-width="1" fill="none" fill-rule="evenodd">
        <g id="01-Home" transform="translate(-717.000000, -1983.000000)" fill="#00993B" fill-rule="nonzero">
            <g id="02-dostawy" transform="translate(717.000000, 1983.000000)">
                <path d="M8,13.5 C8.8270988,13.5 9.5,14.1729012 9.5,15 C9.5,15.8270988 8.8270988,16.5 8,16.5 C7.1729012,16.5 6.5,15.8270988 6.5,15 C6.5,14.1729012 7.1729012,13.5 8,13.5 M8,12 C6.3431511,12 5,13.3431511 5,15 C5,16.6568489 6.3431511,18 8,18 C9.6568489,18 11,16.6568489 11,15 C11,13.3431511 9.6568489,12 8,12 L8,12 Z" id="Shape"></path>
                <path d="M17,13.5 C17.8270988,13.5 18.5,14.1729012 18.5,15 C18.5,15.8270988 17.8270988,16.5 17,16.5 C16.1729012,16.5 15.5,15.8270988 15.5,15 C15.5,14.1729012 16.1729012,13.5 17,13.5 M17,12 C15.3431511,12 14,13.3431511 14,15 C14,16.6568489 15.3431511,18 17,18 C18.6568489,18 20,16.6568489 20,15 C20,13.3431511 18.6568489,12 17,12 L17,12 Z" id="Shape"></path>
                <path d="M5.5,1.5 C7.7056084,1.5 9.5,3.2943916 9.5,5.5 C9.5,7.7056084 7.7056084,9.5 5.5,9.5 C3.2943916,9.5 1.5,7.7056084 1.5,5.5 C1.5,3.2943916 3.2943897,1.5 5.5,1.5 M5.5,0 C2.462429,0 0,2.462429 0,5.5 C0,8.537571 2.462429,11 5.5,11 C8.537571,11 11,8.537571 11,5.5 C11,2.462429 8.537571,0 5.5,0 L5.5,0 Z" id="Shape"></path>
                <polygon id="Path" points="6.9848633 7.515625 4.6499023 6.0927734 4.6499023 3 6.1499023 3 6.1499023 5.25 7.7651367 6.234375"></polygon>
                <path d="M19,6 L16,6 L16,5 C16,3.8953857 15.1045532,3 14,3 L9.2401123,3 C9.7191162,3.715271 10,4.5745239 10,5.5 C10,7.9852905 7.9852905,10 5.5,10 C4.5745239,10 3.715271,9.7191162 3,9.2401123 L3,14 C3,14.5522461 3.4476929,15 4,15 L6,15 C6,13.8953857 6.8954468,13 8,13 C9.1045532,13 10,13.8953857 10,15 L15,15 C15,13.8953857 15.8954468,13 17,13 C18.1045532,13 19,13.8953857 19,15 L21,15 C21.5523071,15 22,14.5522461 22,14 L22,9.9998779 L19,6 Z M20,11 L16,11 L16,8 L18,8 L20,10.6665039 L20,11 Z" id="Shape"></path>
            </g>
        </g>
    </g>
</svg>