<?xml version="1.0" encoding="UTF-8"?>
<svg width="24px" height="20px" viewBox="0 0 24 20" version="1.1" xmlns="http://www.w3.org/2000/svg" xmlns:xlink="http://www.w3.org/1999/xlink">
    <title>icons/woocommerce/wishlist</title>
    <g id="components-//-woocommerce" stroke="none" stroke-width="1" fill="none" fill-rule="evenodd">
        <g id="woocommerce/menu/menu-dark" transform="translate(-1470.000000, -50.000000)" fill="#16273D" fill-rule="nonzero">
            <g id="icons" transform="translate(1368.000000, 50.000000)">
                <g id="wishlist" transform="translate(102.000000, 0.000000)">
                    <path d="M11.8333333,20 C11.1595729,20 10.5252569,19.737037 10.0479792,19.2595062 L10.0479792,19.2592593 L1.88076042,11.0792593 C0.668090278,9.86469136 0,8.24987654 0,6.53185185 L0,6.43135802 C0,4.71333333 0.668090278,3.0982716 1.88076042,1.88395062 C3.09343056,0.66962963 4.70621528,0 6.42081597,0 L6.52189236,0 C8.23649306,0 9.84927778,0.669135802 11.0619479,1.8837037 L11.8333333,2.6562963 L12.6047188,1.8837037 C13.8173889,0.669135802 15.4301736,0 17.1447743,0 L17.2458507,0 C18.9604514,0 20.5732361,0.669135802 21.7859063,1.8837037 C22.9985764,3.0982716 23.6666667,4.71308642 23.6666667,6.43111111 L23.6666667,6.53160494 C23.6666667,8.24962963 22.9985764,9.86469136 21.7859063,11.0790123 L13.6186875,19.2592593 C13.1414097,19.737037 12.5070938,20 11.8333333,20 Z M11.077381,18.4449367 C11.4825714,18.8522373 12.1848512,18.8512223 12.5892857,18.444683 L20.9372679,10.0380495 C21.8910278,9.07676937 22.4166667,7.79954577 22.4166667,6.44060829 L22.4166667,6.33732396 C22.4166667,4.97838647 21.8910278,3.7009091 20.9372679,2.74013649 C19.9835079,1.77936388 18.7145159,1.25 17.3656448,1.25 L17.2623313,1.25 C15.9134603,1.25 14.6444683,1.77885634 13.6907083,2.73988272 L12.3677917,4.07217438 C12.0724663,4.36959263 11.5942004,4.36959263 11.298875,4.07217438 L9.97595833,2.73988272 C9.02219841,1.77885634 7.75320635,1.25 6.40433532,1.25 L6.30102183,1.25 C4.95215079,1.25 3.68315873,1.77885634 2.72939881,2.73988272 C1.77563889,3.7009091 1.25,4.9781327 1.25,6.33707019 L1.25,6.44035452 C1.25,7.799292 1.77563889,9.07676937 2.72939881,10.037542 L11.077381,18.4449367 Z" id="Add_to_Favorite"></path>
                </g>
            </g>
        </g>
    </g>
</svg>