0000.001 (0) Opened log file at time: Fri, 15 Jul 2022 10:16:14 +0000 on http://localhost
0000.009 (0) UpdraftPlus WordPress backup plugin (https://updraftplus.com): 2.22.7.25 WP: 5.9.1 PHP: 7.4.16 (apache2handler, Windows NT DESKTOP-LHMEAM8 6.2 build 9200 (Windows 8 Professional Edition) AMD64) MySQL: 5.7.24 (max packet size=1048576) WPLANG: pl_PL Server: Apache/2.4.33 (Win64) OpenSSL/1.0.2u mod_fcgid/2.3.9 PHP/7.4.16 safe_mode: 0 max_execution_time: 900 memory_limit: 256M (used: 105.8M | 8M) multisite: N openssl: OpenSSL 1.1.0g  2 Nov 2017 mcrypt: N LANG:  ZipArchive::addFile: Y
0000.012 (0) Free space on disk containing Updraft's temporary directory: 113509.1 MB
0000.019 (0) Tasks: Backup files: 1 (schedule: unset) Backup DB: 1 (schedule: unset)
0000.041 (0) Semaphore (fd, sk_options) being initialised
0000.047 (0) Requesting semaphore lock (fd) (apparently not via scheduler)
0000.054 (0) Set semaphore last lock (fd) time to 2022-07-15 10:16:14
0000.056 (0) Semaphore lock (fd) complete
0000.063 (0) Backup run: resumption=0, nonce=c87c60444c7f, file_nonce=c87c60444c7f begun at=1657880174 (0s ago), job type=backup, label=Automatyczne tworzenie kopii przed aktua
0000.067 (0) Scheduling a resumption (1) after 300 seconds (1657880474) in case this run gets aborted
0000.116 (0) Checking if we have a zip executable available
0000.121 (0) Creation of backups of directories: beginning
0000.127 (0) No backup of plugins: excluded by user's options
0000.130 (0) No backup of themes: excluded by user's options
0000.131 (0) No backup of uploads: excluded by user's options
0000.139 (0) Beginning creation of dump of wpcore (split every: 400 MB)
0001.859 (0) Total entities for the zip file: 230 directories, 2375 files (0 skipped as non-modified), 46.8 MB
0002.857 (0) Adding batch to zip file (UpdraftPlus_ZipArchive): over 2.0 seconds have passed since the last write (0.7 MB, 59 (59) files added so far); re-opening (prior size: 0 KB)
0003.301 (0) Zip: backup_2022-07-15-1216_Janser_c87c60444c7f-wpcore.zip.tmp: 100 files added (on-disk size: 183.8 KB)
0005.016 (0) Zip: backup_2022-07-15-1216_Janser_c87c60444c7f-wpcore.zip.tmp: 200 files added (on-disk size: 183.8 KB)
0005.860 (0) Adding batch to zip file (UpdraftPlus_ZipArchive): over 2.0 seconds have passed since the last write (2.6 MB, 202 (261) files added so far); re-opening (prior size: 183.8 KB)
0006.653 (0) Zip: backup_2022-07-15-1216_Janser_c87c60444c7f-wpcore.zip.tmp: 300 files added (on-disk size: 1115.2 KB)
0008.859 (0) Adding batch to zip file (UpdraftPlus_ZipArchive): over 2.0 seconds have passed since the last write (3.6 MB, 137 (398) files added so far); re-opening (prior size: 1115.2 KB)
0009.172 (0) Zip: backup_2022-07-15-1216_Janser_c87c60444c7f-wpcore.zip.tmp: 400 files added (on-disk size: 2026.6 KB)
0011.258 (0) Zip: backup_2022-07-15-1216_Janser_c87c60444c7f-wpcore.zip.tmp: 500 files added (on-disk size: 2026.6 KB)
0011.858 (0) Adding batch to zip file (UpdraftPlus_ZipArchive): over 2.0 seconds have passed since the last write (0.9 MB, 110 (508) files added so far); re-opening (prior size: 2026.6 KB)
0014.921 (0) Adding batch to zip file (UpdraftPlus_ZipArchive): over 2.0 seconds have passed since the last write (0.2 MB, 28 (536) files added so far); re-opening (prior size: 2316.1 KB)
0017.867 (0) Adding batch to zip file (UpdraftPlus_ZipArchive): over 2.0 seconds have passed since the last write (0.3 MB, 31 (567) files added so far); re-opening (prior size: 2390 KB)
0018.003 (0) Zip: backup_2022-07-15-1216_Janser_c87c60444c7f-wpcore.zip.tmp: 600 files added (on-disk size: 2480.4 KB)
0018.761 (0) Zip: backup_2022-07-15-1216_Janser_c87c60444c7f-wpcore.zip.tmp: 700 files added (on-disk size: 2480.4 KB)
0019.458 (0) Zip: backup_2022-07-15-1216_Janser_c87c60444c7f-wpcore.zip.tmp: 800 files added (on-disk size: 2480.4 KB)
0020.169 (0) Zip: backup_2022-07-15-1216_Janser_c87c60444c7f-wpcore.zip.tmp: 900 files added (on-disk size: 2480.4 KB)
0020.861 (0) Adding batch to zip file (UpdraftPlus_ZipArchive): over 2.0 seconds have passed since the last write (1 MB, 431 (998) files added so far); re-opening (prior size: 2480.4 KB)
0021.071 (0) Zip: backup_2022-07-15-1216_Janser_c87c60444c7f-wpcore.zip.tmp: 1000 files added (on-disk size: 2875.8 KB)
0021.728 (0) Zip: backup_2022-07-15-1216_Janser_c87c60444c7f-wpcore.zip.tmp: 1100 files added (on-disk size: 2875.8 KB)
0023.801 (0) Zip: backup_2022-07-15-1216_Janser_c87c60444c7f-wpcore.zip.tmp: 1200 files added (on-disk size: 2875.8 KB)
0023.891 (0) Adding batch to zip file (UpdraftPlus_ZipArchive): over 2.0 seconds have passed since the last write (1.9 MB, 209 (1207) files added so far); re-opening (prior size: 2875.8 KB)
0024.988 (0) Zip: backup_2022-07-15-1216_Janser_c87c60444c7f-wpcore.zip.tmp: 1300 files added (on-disk size: 3488.8 KB)
0026.752 (0) Zip: backup_2022-07-15-1216_Janser_c87c60444c7f-wpcore.zip.tmp: 1400 files added (on-disk size: 3488.8 KB)
0026.888 (0) Adding batch to zip file (UpdraftPlus_ZipArchive): over 2.0 seconds have passed since the last write (4.3 MB, 194 (1401) files added so far); re-opening (prior size: 3488.8 KB)
0029.600 (0) Zip: backup_2022-07-15-1216_Janser_c87c60444c7f-wpcore.zip.tmp: 1500 files added (on-disk size: 4383 KB)
0029.866 (0) Adding batch to zip file (UpdraftPlus_ZipArchive): over 2.0 seconds have passed since the last write (2.5 MB, 132 (1533) files added so far); re-opening (prior size: 4383 KB)
0032.264 (0) Zip: backup_2022-07-15-1216_Janser_c87c60444c7f-wpcore.zip.tmp: 1600 files added (on-disk size: 5138 KB)
0032.891 (0) Adding batch to zip file (UpdraftPlus_ZipArchive): over 2.0 seconds have passed since the last write (10.6 MB, 80 (1613) files added so far); re-opening (prior size: 5138 KB)
0036.363 (0) Zip: backup_2022-07-15-1216_Janser_c87c60444c7f-wpcore.zip.tmp: 1700 files added (on-disk size: 7672.6 KB)
0036.857 (0) Adding batch to zip file (UpdraftPlus_ZipArchive): over 2.0 seconds have passed since the last write (5.7 MB, 124 (1737) files added so far); re-opening (prior size: 7672.6 KB)
0038.169 (0) Zip: backup_2022-07-15-1216_Janser_c87c60444c7f-wpcore.zip.tmp: 1800 files added (on-disk size: 9079.5 KB)
0039.873 (0) Adding batch to zip file (UpdraftPlus_ZipArchive): over 2.0 seconds have passed since the last write (2.9 MB, 154 (1891) files added so far); re-opening (prior size: 9079.5 KB)
0040.624 (0) Zip: backup_2022-07-15-1216_Janser_c87c60444c7f-wpcore.zip.tmp: 1900 files added (on-disk size: 9894.6 KB)
0042.554 (0) Zip: backup_2022-07-15-1216_Janser_c87c60444c7f-wpcore.zip.tmp: 2000 files added (on-disk size: 9894.6 KB)
0042.870 (0) Adding batch to zip file (UpdraftPlus_ZipArchive): over 2.0 seconds have passed since the last write (4.4 MB, 130 (2021) files added so far); re-opening (prior size: 9894.6 KB)
0044.850 (0) Zip: backup_2022-07-15-1216_Janser_c87c60444c7f-wpcore.zip.tmp: 2100 files added (on-disk size: 11351.1 KB)
0045.903 (0) Adding batch to zip file (UpdraftPlus_ZipArchive): over 2.0 seconds have passed since the last write (2.3 MB, 163 (2184) files added so far); re-opening (prior size: 11351.1 KB)
0046.733 (0) Zip: backup_2022-07-15-1216_Janser_c87c60444c7f-wpcore.zip.tmp: 2200 files added (on-disk size: 11933.7 KB)
0048.544 (0) Zip: backup_2022-07-15-1216_Janser_c87c60444c7f-wpcore.zip.tmp: 2300 files added (on-disk size: 11933.7 KB)
0048.863 (0) Adding batch to zip file (UpdraftPlus_ZipArchive): over 2.0 seconds have passed since the last write (1.8 MB, 132 (2316) files added so far); re-opening (prior size: 11933.7 KB)
0050.611 (0) Creating zip file manifest (C:\Janser/wp-content/updraft/backup_2022-07-15-1216_Janser_c87c60444c7f-wpcore.zip.list-temp.tmp)
0050.624 (0) Successfully created zip file manifest (size: 122519)
0050.767 (0) Created wpcore zip (0) - 12538.8 KB in 50.6 s (247.7 KB/s) (sha1: 11baf6df0aa050aa5f8bf129179f06e1a14c5a8d, sha256: 79da06a8299b1efab7b9aabdb33cb43b78a4cb1b87065a0323ae9905fa171684)
0050.772 (0) No backup of others: excluded by user's options
0050.774 (0) No backup of more: excluded by user's options
0050.780 (0) Saving backup status to database (elements: 2)
0050.784 (0) Beginning creation of database dump (WordPress DB)
0050.787 (0) SQL compatibility mode is: NO_ZERO_IN_DATE,ERROR_FOR_DIVISION_BY_ZERO,NO_AUTO_CREATE_USER,NO_ENGINE_SUBSTITUTION
0051.203 (0) Table sk_options: Total expected rows (via COUNT): 438
0051.204 (0) Table is relatively small; fetch_rows will thus be: 500 (allow_further_reductions=1, is_first_fetch=1, known_bigger_than_table=1)
0051.242 (0) Table sk_options: Rows added in this batch (next record: 947): 434 (uncompressed bytes in this segment=788737) in 0.05 seconds
0051.256 (0) Table sk_options: finishing file(s) (2, 145.5 KB)
0051.267 (0) Table sk_users: Total expected rows (via COUNT): 1
0051.269 (0) Table is relatively small; fetch_rows will thus be: 20 (allow_further_reductions=1, is_first_fetch=1, known_bigger_than_table=1)
0051.274 (0) Table sk_users: Rows added in this batch (next record: 1): 1 (uncompressed bytes in this segment=1391) in 0.01 seconds
0051.285 (0) Table sk_users: finishing file(s) (2, 0.6 KB)
0051.298 (0) Table sk_usermeta: Total expected rows (via COUNT): 24
0051.300 (0) Table is relatively small; fetch_rows will thus be: 20 (allow_further_reductions=1, is_first_fetch=1, known_bigger_than_table=1)
0051.305 (0) Table sk_usermeta: Rows added in this batch (next record: 24): 24 (uncompressed bytes in this segment=16283) in 0.01 seconds
0051.320 (0) Table sk_usermeta: finishing file(s) (2, 3.2 KB)
0051.337 (0) Table sk_actionscheduler_actions: Total expected rows (via COUNT): 2
0051.340 (0) Table is relatively small; fetch_rows will thus be: 20 (allow_further_reductions=1, is_first_fetch=1, known_bigger_than_table=1)
0051.343 (0) Table sk_actionscheduler_actions: Rows added in this batch (next record: 7): 2 (uncompressed bytes in this segment=2232) in 0.01 seconds
0051.360 (0) Table sk_actionscheduler_actions: finishing file(s) (2, 0.7 KB)
0051.377 (0) Table sk_actionscheduler_claims: Total expected rows (via COUNT): 0
0051.383 (0) Table sk_actionscheduler_claims: Rows added in this batch (next record: -1): 0 (uncompressed bytes in this segment=624) in 0.01 seconds
0051.396 (0) Table sk_actionscheduler_claims: finishing file(s) (2, 0.4 KB)
0051.416 (0) Table sk_actionscheduler_groups: Total expected rows (via COUNT): 1
0051.419 (0) Table is relatively small; fetch_rows will thus be: 20 (allow_further_reductions=1, is_first_fetch=1, known_bigger_than_table=1)
0051.425 (0) Table sk_actionscheduler_groups: Rows added in this batch (next record: 1): 1 (uncompressed bytes in this segment=689) in 0.01 seconds
0051.438 (0) Table sk_actionscheduler_groups: finishing file(s) (2, 0.4 KB)
0051.457 (0) Table sk_actionscheduler_logs: Total expected rows (via COUNT): 6
0051.459 (0) Table is relatively small; fetch_rows will thus be: 20 (allow_further_reductions=1, is_first_fetch=1, known_bigger_than_table=1)
0051.462 (0) Table sk_actionscheduler_logs: Rows added in this batch (next record: 6): 6 (uncompressed bytes in this segment=1342) in 0.01 seconds
0051.474 (0) Table sk_actionscheduler_logs: finishing file(s) (2, 0.5 KB)
0051.495 (0) Table sk_commentmeta: Total expected rows (via COUNT): 0
0051.501 (0) Table sk_commentmeta: Rows added in this batch (next record: -1): 0 (uncompressed bytes in this segment=685) in 0.01 seconds
0051.517 (0) Table sk_commentmeta: finishing file(s) (2, 0.4 KB)
0051.530 (0) Table sk_comments: Total expected rows (via COUNT): 1
0051.532 (0) Table is relatively small; fetch_rows will thus be: 20 (allow_further_reductions=1, is_first_fetch=1, known_bigger_than_table=1)
0051.538 (0) Table sk_comments: Rows added in this batch (next record: 1): 1 (uncompressed bytes in this segment=2199) in 0.01 seconds
0051.548 (0) Table sk_comments: finishing file(s) (2, 0.8 KB)
0051.565 (0) Table sk_links: Total expected rows (via COUNT): 0
0051.570 (0) Table sk_links: Rows added in this batch (next record: -1): 0 (uncompressed bytes in this segment=1310) in 0.01 seconds
0051.580 (0) Table sk_links: finishing file(s) (2, 0.5 KB)
0051.592 (0) Table sk_postmeta: Total expected rows (via COUNT): 70
0051.594 (0) Table is relatively small; fetch_rows will thus be: 100 (allow_further_reductions=1, is_first_fetch=1, known_bigger_than_table=1)
0051.600 (0) Table sk_postmeta: Rows added in this batch (next record: 94): 70 (uncompressed bytes in this segment=5105) in 0.01 seconds
0051.612 (0) Table sk_postmeta: finishing file(s) (2, 1.4 KB)
0051.624 (0) Table sk_posts: Total expected rows (via COUNT): 21
0051.626 (0) Table is relatively small; fetch_rows will thus be: 20 (allow_further_reductions=1, is_first_fetch=1, known_bigger_than_table=1)
0051.632 (0) Table sk_posts: Rows added in this batch (next record: 23): 21 (uncompressed bytes in this segment=20333) in 0.01 seconds
0051.645 (0) Table sk_posts: finishing file(s) (2, 5.7 KB)
0051.657 (0) Table sk_term_relationships: Total expected rows (approximate): 0
0051.662 (0) Table sk_term_relationships: Rows added in this batch (next record: 100000): 8 (uncompressed bytes in this segment=800) in 0.01 seconds
0051.673 (0) Table sk_term_relationships: finishing file(s) (2, 0.4 KB)
0051.685 (0) Table sk_term_taxonomy: Total expected rows (via COUNT): 17
0051.686 (0) Table is relatively small; fetch_rows will thus be: 20 (allow_further_reductions=1, is_first_fetch=1, known_bigger_than_table=1)
0051.691 (0) Table sk_term_taxonomy: Rows added in this batch (next record: 19): 17 (uncompressed bytes in this segment=1549) in 0.01 seconds
0051.702 (0) Table sk_term_taxonomy: finishing file(s) (2, 0.6 KB)
0051.713 (0) Table sk_termmeta: Total expected rows (via COUNT): 0
0051.718 (0) Table sk_termmeta: Rows added in this batch (next record: -1): 0 (uncompressed bytes in this segment=658) in 0.01 seconds
0051.729 (0) Table sk_termmeta: finishing file(s) (2, 0.4 KB)
0051.740 (0) Table sk_terms: Total expected rows (via COUNT): 17
0051.742 (0) Table is relatively small; fetch_rows will thus be: 20 (allow_further_reductions=1, is_first_fetch=1, known_bigger_than_table=1)
0051.747 (0) Table sk_terms: Rows added in this batch (next record: 19): 17 (uncompressed bytes in this segment=1414) in 0.01 seconds
0051.758 (0) Table sk_terms: finishing file(s) (2, 0.6 KB)
0051.770 (0) Table sk_wc_category_lookup: Total expected rows (approximate): 0
0051.774 (0) Table sk_wc_category_lookup: Rows added in this batch (next record: 0): 0 (uncompressed bytes in this segment=535) in 0.00 seconds
0051.786 (0) Table sk_wc_category_lookup: finishing file(s) (2, 0.3 KB)
0051.800 (0) Table sk_wc_product_meta_lookup: Total expected rows (via COUNT): 0
0051.803 (0) Table sk_wc_product_meta_lookup: Rows added in this batch (next record: -1): 0 (uncompressed bytes in this segment=1361) in 0.01 seconds
0051.813 (0) Table sk_wc_product_meta_lookup: finishing file(s) (2, 0.5 KB)
0051.825 (0) Table sk_wc_reserved_stock: Total expected rows (approximate): 0
0051.828 (0) Table sk_wc_reserved_stock: Rows added in this batch (next record: 0): 0 (uncompressed bytes in this segment=665) in 0.00 seconds
0051.933 (0) Table sk_wc_reserved_stock: finishing file(s) (2, 0.4 KB)
0051.942 (0) Table sk_wc_tax_rate_classes: Total expected rows (via COUNT): 2
0051.944 (0) Table is relatively small; fetch_rows will thus be: 20 (allow_further_reductions=1, is_first_fetch=1, known_bigger_than_table=1)
0051.949 (0) Table sk_wc_tax_rate_classes: Rows added in this batch (next record: 2): 2 (uncompressed bytes in this segment=827) in 0.01 seconds
0051.959 (0) Table sk_wc_tax_rate_classes: finishing file(s) (2, 0.4 KB)
0051.974 (0) Table sk_woocommerce_order_itemmeta: Total expected rows (via COUNT): 0
0051.978 (0) Table sk_woocommerce_order_itemmeta: Rows added in this batch (next record: -1): 0 (uncompressed bytes in this segment=771) in 0.01 seconds
0051.992 (0) Table sk_woocommerce_order_itemmeta: finishing file(s) (2, 0.4 KB)
0052.009 (0) Table sk_woocommerce_payment_tokenmeta: Total expected rows (via COUNT): 0
0052.011 (0) Table sk_woocommerce_payment_tokenmeta: Rows added in this batch (next record: -1): 0 (uncompressed bytes in this segment=798) in 0.01 seconds
0052.023 (0) Table sk_woocommerce_payment_tokenmeta: finishing file(s) (2, 0.4 KB)
0052.036 (0) Table sk_frmt_form_entry: Total expected rows (via COUNT): 0
0052.040 (0) Table sk_frmt_form_entry: Rows added in this batch (next record: -1): 0 (uncompressed bytes in this segment=783) in 0.00 seconds
0052.050 (0) Table sk_frmt_form_entry: finishing file(s) (2, 0.4 KB)
0052.063 (0) Table sk_frmt_form_entry_meta: Total expected rows (via COUNT): 0
0052.068 (0) Table sk_frmt_form_entry_meta: Rows added in this batch (next record: -1): 0 (uncompressed bytes in this segment=902) in 0.01 seconds
0052.080 (0) Table sk_frmt_form_entry_meta: finishing file(s) (2, 0.4 KB)
0052.093 (0) Table sk_frmt_form_views: Total expected rows (via COUNT): 0
0052.097 (0) Table sk_frmt_form_views: Rows added in this batch (next record: -1): 0 (uncompressed bytes in this segment=951) in 0.01 seconds
0052.107 (0) Table sk_frmt_form_views: finishing file(s) (2, 0.4 KB)
0052.122 (0) Table sk_wc_admin_note_actions: Total expected rows (via COUNT): 38
0052.124 (0) Table is relatively small; fetch_rows will thus be: 50 (allow_further_reductions=1, is_first_fetch=1, known_bigger_than_table=1)
0052.129 (0) Table sk_wc_admin_note_actions: Rows added in this batch (next record: 38): 38 (uncompressed bytes in this segment=7356) in 0.01 seconds
0052.142 (0) Table sk_wc_admin_note_actions: finishing file(s) (2, 1.8 KB)
0052.155 (0) Table sk_wc_admin_notes: Total expected rows (via COUNT): 34
0052.157 (0) Table is relatively small; fetch_rows will thus be: 50 (allow_further_reductions=1, is_first_fetch=1, known_bigger_than_table=1)
0052.161 (0) Table sk_wc_admin_notes: Rows added in this batch (next record: 34): 34 (uncompressed bytes in this segment=17476) in 0.01 seconds
0052.174 (0) Table sk_wc_admin_notes: finishing file(s) (2, 4.6 KB)
0052.186 (0) Table sk_wc_customer_lookup: Total expected rows (via COUNT): 0
0052.190 (0) Table sk_wc_customer_lookup: Rows added in this batch (next record: -1): 0 (uncompressed bytes in this segment=1266) in 0.01 seconds
0052.203 (0) Table sk_wc_customer_lookup: finishing file(s) (2, 0.5 KB)
0052.216 (0) Table sk_wc_download_log: Total expected rows (via COUNT): 0
0052.219 (0) Table sk_wc_download_log: Rows added in this batch (next record: -1): 0 (uncompressed bytes in this segment=926) in 0.01 seconds
0052.229 (0) Table sk_wc_download_log: finishing file(s) (2, 0.5 KB)
0052.241 (0) Table sk_wc_order_coupon_lookup: Total expected rows (approximate): 0
0052.244 (0) Table sk_wc_order_coupon_lookup: Rows added in this batch (next record: 0): 0 (uncompressed bytes in this segment=717) in 0.00 seconds
0052.256 (0) Table sk_wc_order_coupon_lookup: finishing file(s) (2, 0.4 KB)
0052.269 (0) Table sk_wc_order_product_lookup: Total expected rows (via COUNT): 0
0052.271 (0) Table sk_wc_order_product_lookup: Rows added in this batch (next record: -1): 0 (uncompressed bytes in this segment=1227) in 0.00 seconds
0052.284 (0) Table sk_wc_order_product_lookup: finishing file(s) (2, 0.5 KB)
0052.296 (0) Table sk_wc_order_stats: Total expected rows (via COUNT): 0
0052.298 (0) Table sk_wc_order_stats: Rows added in this batch (next record: -1): 0 (uncompressed bytes in this segment=1122) in 0.00 seconds
0052.309 (0) Table sk_wc_order_stats: finishing file(s) (2, 0.5 KB)
0052.322 (0) Table sk_wc_order_tax_lookup: Total expected rows (approximate): 0
0052.324 (0) Table sk_wc_order_tax_lookup: Rows added in this batch (next record: 0): 0 (uncompressed bytes in this segment=799) in 0.00 seconds
0052.337 (0) Table sk_wc_order_tax_lookup: finishing file(s) (2, 0.4 KB)
0052.351 (0) Table sk_wc_rate_limits: Total expected rows (via COUNT): 0
0052.353 (0) Table sk_wc_rate_limits: Rows added in this batch (next record: -1): 0 (uncompressed bytes in this segment=640) in 0.00 seconds
0052.366 (0) Table sk_wc_rate_limits: finishing file(s) (2, 0.4 KB)
0052.380 (0) Table sk_wc_webhooks: Total expected rows (via COUNT): 0
0052.384 (0) Table sk_wc_webhooks: Rows added in this batch (next record: -1): 0 (uncompressed bytes in this segment=1230) in 0.01 seconds
0052.396 (0) Table sk_wc_webhooks: finishing file(s) (2, 0.5 KB)
0052.413 (0) Table sk_woocommerce_api_keys: Total expected rows (via COUNT): 0
0052.417 (0) Table sk_woocommerce_api_keys: Rows added in this batch (next record: -1): 0 (uncompressed bytes in this segment=1046) in 0.01 seconds
0052.429 (0) Table sk_woocommerce_api_keys: finishing file(s) (2, 0.5 KB)
0052.442 (0) Table sk_woocommerce_attribute_taxonomies: Total expected rows (via COUNT): 0
0052.444 (0) Table sk_woocommerce_attribute_taxonomies: Rows added in this batch (next record: -1): 0 (uncompressed bytes in this segment=961) in 0.00 seconds
0052.456 (0) Table sk_woocommerce_attribute_taxonomies: finishing file(s) (2, 0.4 KB)
0052.468 (0) Table sk_woocommerce_downloadable_product_permissions: Total expected rows (via COUNT): 0
0052.470 (0) Table sk_woocommerce_downloadable_product_permissions: Rows added in this batch (next record: -1): 0 (uncompressed bytes in this segment=1538) in 0.00 seconds
0052.484 (0) Table sk_woocommerce_downloadable_product_permissions: finishing file(s) (2, 0.5 KB)
0052.500 (0) Table sk_woocommerce_log: Total expected rows (via COUNT): 0
0052.503 (0) Table sk_woocommerce_log: Rows added in this batch (next record: -1): 0 (uncompressed bytes in this segment=722) in 0.01 seconds
0052.517 (0) Table sk_woocommerce_log: finishing file(s) (2, 0.4 KB)
0052.531 (0) Table sk_woocommerce_order_items: Total expected rows (via COUNT): 0
0052.534 (0) Table sk_woocommerce_order_items: Rows added in this batch (next record: -1): 0 (uncompressed bytes in this segment=739) in 0.01 seconds
0052.546 (0) Table sk_woocommerce_order_items: finishing file(s) (2, 0.4 KB)
0052.560 (0) Table sk_woocommerce_payment_tokens: Total expected rows (via COUNT): 0
0052.563 (0) Table sk_woocommerce_payment_tokens: Rows added in this batch (next record: -1): 0 (uncompressed bytes in this segment=841) in 0.00 seconds
0052.574 (0) Table sk_woocommerce_payment_tokens: finishing file(s) (2, 0.4 KB)
0052.588 (0) Table sk_woocommerce_sessions: Total expected rows (via COUNT): 1
0052.590 (0) Table is relatively small; fetch_rows will thus be: 20 (allow_further_reductions=1, is_first_fetch=1, known_bigger_than_table=1)
0052.595 (0) Table sk_woocommerce_sessions: Rows added in this batch (next record: 1): 1 (uncompressed bytes in this segment=2174) in 0.01 seconds
0052.609 (0) Table sk_woocommerce_sessions: finishing file(s) (2, 0.8 KB)
0052.622 (0) Table sk_woocommerce_shipping_zone_locations: Total expected rows (via COUNT): 0
0052.627 (0) Table sk_woocommerce_shipping_zone_locations: Rows added in this batch (next record: -1): 0 (uncompressed bytes in this segment=874) in 0.01 seconds
0052.639 (0) Table sk_woocommerce_shipping_zone_locations: finishing file(s) (2, 0.4 KB)
0052.653 (0) Table sk_woocommerce_shipping_zone_methods: Total expected rows (via COUNT): 0
0052.657 (0) Table sk_woocommerce_shipping_zone_methods: Rows added in this batch (next record: -1): 0 (uncompressed bytes in this segment=775) in 0.00 seconds
0052.669 (0) Table sk_woocommerce_shipping_zone_methods: finishing file(s) (2, 0.4 KB)
0052.683 (0) Table sk_woocommerce_shipping_zones: Total expected rows (via COUNT): 0
0052.686 (0) Table sk_woocommerce_shipping_zones: Rows added in this batch (next record: -1): 0 (uncompressed bytes in this segment=633) in 0.01 seconds
0052.696 (0) Table sk_woocommerce_shipping_zones: finishing file(s) (2, 0.4 KB)
0052.709 (0) Table sk_woocommerce_tax_rate_locations: Total expected rows (via COUNT): 0
0052.712 (0) Table sk_woocommerce_tax_rate_locations: Rows added in this batch (next record: -1): 0 (uncompressed bytes in this segment=848) in 0.00 seconds
0052.723 (0) Table sk_woocommerce_tax_rate_locations: finishing file(s) (2, 0.4 KB)
0052.737 (0) Table sk_woocommerce_tax_rates: Total expected rows (via COUNT): 0
0052.740 (0) Table sk_woocommerce_tax_rates: Rows added in this batch (next record: -1): 0 (uncompressed bytes in this segment=1301) in 0.00 seconds
0052.753 (0) Table sk_woocommerce_tax_rates: finishing file(s) (2, 0.5 KB)
0052.768 (0) Table sk_yoast_indexable: Total expected rows (via COUNT): 26
0052.770 (0) Table is relatively small; fetch_rows will thus be: 50 (allow_further_reductions=1, is_first_fetch=1, known_bigger_than_table=1)
0052.778 (0) Table sk_yoast_indexable: Rows added in this batch (next record: 28): 26 (uncompressed bytes in this segment=15532) in 0.02 seconds
0052.792 (0) Table sk_yoast_indexable: finishing file(s) (2, 3 KB)
0052.805 (0) Table sk_yoast_indexable_hierarchy: Total expected rows (approximate): 19
0052.810 (0) Table sk_yoast_indexable_hierarchy: Rows added in this batch (next record: 1000): 19 (uncompressed bytes in this segment=1097) in 0.01 seconds
0052.823 (0) Table sk_yoast_indexable_hierarchy: finishing file(s) (2, 0.4 KB)
0052.836 (0) Table sk_yoast_migrations: Total expected rows (via COUNT): 23
0052.838 (0) Table is relatively small; fetch_rows will thus be: 20 (allow_further_reductions=1, is_first_fetch=1, known_bigger_than_table=1)
0052.843 (0) Table sk_yoast_migrations: Rows added in this batch (next record: 23): 23 (uncompressed bytes in this segment=1240) in 0.01 seconds
0052.855 (0) Table sk_yoast_migrations: finishing file(s) (2, 0.6 KB)
0052.869 (0) Table sk_yoast_primary_term: Total expected rows (via COUNT): 0
0052.874 (0) Table sk_yoast_primary_term: Rows added in this batch (next record: -1): 0 (uncompressed bytes in this segment=858) in 0.01 seconds
0052.887 (0) Table sk_yoast_primary_term: finishing file(s) (2, 0.4 KB)
0052.901 (0) Table sk_yoast_seo_links: Total expected rows (via COUNT): 1
0052.903 (0) Table is relatively small; fetch_rows will thus be: 20 (allow_further_reductions=1, is_first_fetch=1, known_bigger_than_table=1)
0052.908 (0) Table sk_yoast_seo_links: Rows added in this batch (next record: 1): 1 (uncompressed bytes in this segment=1134) in 0.01 seconds
0052.921 (0) Table sk_yoast_seo_links: finishing file(s) (2, 0.5 KB)
0052.926 (0) backup_2022-07-15-1216_Janser_c87c60444c7f-db-table-sk_options.table.tmpr948.gz (1/52/fopen): adding to final database dump
0052.937 (0) backup_2022-07-15-1216_Janser_c87c60444c7f-db-table-sk_options.table.gz (2/52/fopen): adding to final database dump
0052.941 (0) backup_2022-07-15-1216_Janser_c87c60444c7f-db-table-sk_users.table.tmpr2.gz (3/52/fopen): adding to final database dump
0052.944 (0) backup_2022-07-15-1216_Janser_c87c60444c7f-db-table-sk_users.table.gz (4/52/fopen): adding to final database dump
0052.947 (0) backup_2022-07-15-1216_Janser_c87c60444c7f-db-table-sk_usermeta.table.tmpr25.gz (5/52/fopen): adding to final database dump
0052.950 (0) backup_2022-07-15-1216_Janser_c87c60444c7f-db-table-sk_usermeta.table.gz (6/52/fopen): adding to final database dump
0052.953 (0) backup_2022-07-15-1216_Janser_c87c60444c7f-db-table-sk_actionscheduler_actions.table.tmpr8.gz (7/52/fopen): adding to final database dump
0052.957 (0) backup_2022-07-15-1216_Janser_c87c60444c7f-db-table-sk_actionscheduler_actions.table.gz (8/52/fopen): adding to final database dump
0052.959 (0) backup_2022-07-15-1216_Janser_c87c60444c7f-db-table-sk_actionscheduler_claims.table.tmpr0.gz (9/52/fopen): adding to final database dump
0052.962 (0) backup_2022-07-15-1216_Janser_c87c60444c7f-db-table-sk_actionscheduler_claims.table.gz (10/52/fopen): adding to final database dump
0052.964 (0) backup_2022-07-15-1216_Janser_c87c60444c7f-db-table-sk_actionscheduler_groups.table.tmpr2.gz (11/52/fopen): adding to final database dump
0052.967 (0) backup_2022-07-15-1216_Janser_c87c60444c7f-db-table-sk_actionscheduler_groups.table.gz (12/52/fopen): adding to final database dump
0052.969 (0) backup_2022-07-15-1216_Janser_c87c60444c7f-db-table-sk_actionscheduler_logs.table.tmpr7.gz (13/52/fopen): adding to final database dump
0052.972 (0) backup_2022-07-15-1216_Janser_c87c60444c7f-db-table-sk_actionscheduler_logs.table.gz (14/52/fopen): adding to final database dump
0052.974 (0) backup_2022-07-15-1216_Janser_c87c60444c7f-db-table-sk_commentmeta.table.tmpr0.gz (15/52/fopen): adding to final database dump
0052.976 (0) backup_2022-07-15-1216_Janser_c87c60444c7f-db-table-sk_commentmeta.table.gz (16/52/fopen): adding to final database dump
0052.979 (0) backup_2022-07-15-1216_Janser_c87c60444c7f-db-table-sk_comments.table.tmpr2.gz (17/52/fopen): adding to final database dump
0052.982 (0) backup_2022-07-15-1216_Janser_c87c60444c7f-db-table-sk_comments.table.gz (18/52/fopen): adding to final database dump
0052.984 (0) backup_2022-07-15-1216_Janser_c87c60444c7f-db-table-sk_links.table.tmpr0.gz (19/52/fopen): adding to final database dump
0052.987 (0) backup_2022-07-15-1216_Janser_c87c60444c7f-db-table-sk_links.table.gz (20/52/fopen): adding to final database dump
0052.989 (0) backup_2022-07-15-1216_Janser_c87c60444c7f-db-table-sk_postmeta.table.tmpr95.gz (21/52/fopen): adding to final database dump
0052.992 (0) backup_2022-07-15-1216_Janser_c87c60444c7f-db-table-sk_postmeta.table.gz (22/52/fopen): adding to final database dump
0052.995 (0) backup_2022-07-15-1216_Janser_c87c60444c7f-db-table-sk_posts.table.tmpr24.gz (23/52/fopen): adding to final database dump
0052.999 (0) backup_2022-07-15-1216_Janser_c87c60444c7f-db-table-sk_posts.table.gz (24/52/fopen): adding to final database dump
0053.001 (0) backup_2022-07-15-1216_Janser_c87c60444c7f-db-table-sk_term_relationships.table.tmpr100001.gz (25/52/fopen): adding to final database dump
0053.004 (0) backup_2022-07-15-1216_Janser_c87c60444c7f-db-table-sk_term_relationships.table.gz (26/52/fopen): adding to final database dump
0053.006 (0) backup_2022-07-15-1216_Janser_c87c60444c7f-db-table-sk_term_taxonomy.table.tmpr20.gz (27/52/fopen): adding to final database dump
0053.009 (0) backup_2022-07-15-1216_Janser_c87c60444c7f-db-table-sk_term_taxonomy.table.gz (28/52/fopen): adding to final database dump
0053.012 (0) backup_2022-07-15-1216_Janser_c87c60444c7f-db-table-sk_termmeta.table.tmpr0.gz (29/52/fopen): adding to final database dump
0053.015 (0) backup_2022-07-15-1216_Janser_c87c60444c7f-db-table-sk_termmeta.table.gz (30/52/fopen): adding to final database dump
0053.018 (0) backup_2022-07-15-1216_Janser_c87c60444c7f-db-table-sk_terms.table.tmpr20.gz (31/52/fopen): adding to final database dump
0053.020 (0) backup_2022-07-15-1216_Janser_c87c60444c7f-db-table-sk_terms.table.gz (32/52/fopen): adding to final database dump
0053.022 (0) backup_2022-07-15-1216_Janser_c87c60444c7f-db-table-sk_wc_category_lookup.table.tmpr1.gz (33/52/fopen): adding to final database dump
0053.025 (0) backup_2022-07-15-1216_Janser_c87c60444c7f-db-table-sk_wc_category_lookup.table.gz (34/52/fopen): adding to final database dump
0053.027 (0) backup_2022-07-15-1216_Janser_c87c60444c7f-db-table-sk_wc_product_meta_lookup.table.tmpr0.gz (35/52/fopen): adding to final database dump
0053.029 (0) backup_2022-07-15-1216_Janser_c87c60444c7f-db-table-sk_wc_product_meta_lookup.table.gz (36/52/fopen): adding to final database dump
0053.032 (0) backup_2022-07-15-1216_Janser_c87c60444c7f-db-table-sk_wc_reserved_stock.table.tmpr1.gz (37/52/fopen): adding to final database dump
0053.034 (0) backup_2022-07-15-1216_Janser_c87c60444c7f-db-table-sk_wc_reserved_stock.table.gz (38/52/fopen): adding to final database dump
0053.037 (0) backup_2022-07-15-1216_Janser_c87c60444c7f-db-table-sk_wc_tax_rate_classes.table.tmpr3.gz (39/52/fopen): adding to final database dump
0053.040 (0) backup_2022-07-15-1216_Janser_c87c60444c7f-db-table-sk_wc_tax_rate_classes.table.gz (40/52/fopen): adding to final database dump
0053.042 (0) backup_2022-07-15-1216_Janser_c87c60444c7f-db-table-sk_woocommerce_order_itemmeta.table.tmpr0.gz (41/52/fopen): adding to final database dump
0053.044 (0) backup_2022-07-15-1216_Janser_c87c60444c7f-db-table-sk_woocommerce_order_itemmeta.table.gz (42/52/fopen): adding to final database dump
0053.047 (0) backup_2022-07-15-1216_Janser_c87c60444c7f-db-table-sk_woocommerce_payment_tokenmeta.table.tmpr0.gz (43/52/fopen): adding to final database dump
0053.049 (0) backup_2022-07-15-1216_Janser_c87c60444c7f-db-table-sk_woocommerce_payment_tokenmeta.table.gz (44/52/fopen): adding to final database dump
0053.051 (0) backup_2022-07-15-1216_Janser_c87c60444c7f-db-table-sk_frmt_form_entry.table.tmpr0.gz (45/52/fopen): adding to final database dump
0053.054 (0) backup_2022-07-15-1216_Janser_c87c60444c7f-db-table-sk_frmt_form_entry.table.gz (46/52/fopen): adding to final database dump
0053.056 (0) backup_2022-07-15-1216_Janser_c87c60444c7f-db-table-sk_frmt_form_entry_meta.table.tmpr0.gz (47/52/fopen): adding to final database dump
0053.058 (0) backup_2022-07-15-1216_Janser_c87c60444c7f-db-table-sk_frmt_form_entry_meta.table.gz (48/52/fopen): adding to final database dump
0053.061 (0) backup_2022-07-15-1216_Janser_c87c60444c7f-db-table-sk_frmt_form_views.table.tmpr0.gz (49/52/fopen): adding to final database dump
0053.063 (0) backup_2022-07-15-1216_Janser_c87c60444c7f-db-table-sk_frmt_form_views.table.gz (50/52/fopen): adding to final database dump
0053.066 (0) backup_2022-07-15-1216_Janser_c87c60444c7f-db-table-sk_wc_admin_note_actions.table.tmpr39.gz (51/52/fopen): adding to final database dump
0053.069 (0) backup_2022-07-15-1216_Janser_c87c60444c7f-db-table-sk_wc_admin_note_actions.table.gz (52/52/fopen): adding to final database dump
0053.071 (0) backup_2022-07-15-1216_Janser_c87c60444c7f-db-table-sk_wc_admin_notes.table.tmpr35.gz (53/52/fopen): adding to final database dump
0053.074 (0) backup_2022-07-15-1216_Janser_c87c60444c7f-db-table-sk_wc_admin_notes.table.gz (54/52/fopen): adding to final database dump
0053.076 (0) backup_2022-07-15-1216_Janser_c87c60444c7f-db-table-sk_wc_customer_lookup.table.tmpr0.gz (55/52/fopen): adding to final database dump
0053.079 (0) backup_2022-07-15-1216_Janser_c87c60444c7f-db-table-sk_wc_customer_lookup.table.gz (56/52/fopen): adding to final database dump
0053.082 (0) backup_2022-07-15-1216_Janser_c87c60444c7f-db-table-sk_wc_download_log.table.tmpr0.gz (57/52/fopen): adding to final database dump
0053.084 (0) backup_2022-07-15-1216_Janser_c87c60444c7f-db-table-sk_wc_download_log.table.gz (58/52/fopen): adding to final database dump
0053.087 (0) backup_2022-07-15-1216_Janser_c87c60444c7f-db-table-sk_wc_order_coupon_lookup.table.tmpr1.gz (59/52/fopen): adding to final database dump
0053.089 (0) backup_2022-07-15-1216_Janser_c87c60444c7f-db-table-sk_wc_order_coupon_lookup.table.gz (60/52/fopen): adding to final database dump
0053.091 (0) backup_2022-07-15-1216_Janser_c87c60444c7f-db-table-sk_wc_order_product_lookup.table.tmpr0.gz (61/52/fopen): adding to final database dump
0053.094 (0) backup_2022-07-15-1216_Janser_c87c60444c7f-db-table-sk_wc_order_product_lookup.table.gz (62/52/fopen): adding to final database dump
0053.097 (0) backup_2022-07-15-1216_Janser_c87c60444c7f-db-table-sk_wc_order_stats.table.tmpr0.gz (63/52/fopen): adding to final database dump
0053.099 (0) backup_2022-07-15-1216_Janser_c87c60444c7f-db-table-sk_wc_order_stats.table.gz (64/52/fopen): adding to final database dump
0053.102 (0) backup_2022-07-15-1216_Janser_c87c60444c7f-db-table-sk_wc_order_tax_lookup.table.tmpr1.gz (65/52/fopen): adding to final database dump
0053.104 (0) backup_2022-07-15-1216_Janser_c87c60444c7f-db-table-sk_wc_order_tax_lookup.table.gz (66/52/fopen): adding to final database dump
0053.106 (0) backup_2022-07-15-1216_Janser_c87c60444c7f-db-table-sk_wc_rate_limits.table.tmpr0.gz (67/52/fopen): adding to final database dump
0053.109 (0) backup_2022-07-15-1216_Janser_c87c60444c7f-db-table-sk_wc_rate_limits.table.gz (68/52/fopen): adding to final database dump
0053.111 (0) backup_2022-07-15-1216_Janser_c87c60444c7f-db-table-sk_wc_webhooks.table.tmpr0.gz (69/52/fopen): adding to final database dump
0053.114 (0) backup_2022-07-15-1216_Janser_c87c60444c7f-db-table-sk_wc_webhooks.table.gz (70/52/fopen): adding to final database dump
0053.116 (0) backup_2022-07-15-1216_Janser_c87c60444c7f-db-table-sk_woocommerce_api_keys.table.tmpr0.gz (71/52/fopen): adding to final database dump
0053.119 (0) backup_2022-07-15-1216_Janser_c87c60444c7f-db-table-sk_woocommerce_api_keys.table.gz (72/52/fopen): adding to final database dump
0053.122 (0) backup_2022-07-15-1216_Janser_c87c60444c7f-db-table-sk_woocommerce_attribute_taxonomies.table.tmpr0.gz (73/52/fopen): adding to final database dump
0053.124 (0) backup_2022-07-15-1216_Janser_c87c60444c7f-db-table-sk_woocommerce_attribute_taxonomies.table.gz (74/52/fopen): adding to final database dump
0053.127 (0) backup_2022-07-15-1216_Janser_c87c60444c7f-db-table-sk_woocommerce_downloadable_product_permissions.table.tmpr0.gz (75/52/fopen): adding to final database dump
0053.130 (0) backup_2022-07-15-1216_Janser_c87c60444c7f-db-table-sk_woocommerce_downloadable_product_permissions.table.gz (76/52/fopen): adding to final database dump
0053.133 (0) backup_2022-07-15-1216_Janser_c87c60444c7f-db-table-sk_woocommerce_log.table.tmpr0.gz (77/52/fopen): adding to final database dump
0053.136 (0) backup_2022-07-15-1216_Janser_c87c60444c7f-db-table-sk_woocommerce_log.table.gz (78/52/fopen): adding to final database dump
0053.139 (0) backup_2022-07-15-1216_Janser_c87c60444c7f-db-table-sk_woocommerce_order_items.table.tmpr0.gz (79/52/fopen): adding to final database dump
0053.141 (0) backup_2022-07-15-1216_Janser_c87c60444c7f-db-table-sk_woocommerce_order_items.table.gz (80/52/fopen): adding to final database dump
0053.144 (0) backup_2022-07-15-1216_Janser_c87c60444c7f-db-table-sk_woocommerce_payment_tokens.table.tmpr0.gz (81/52/fopen): adding to final database dump
0053.146 (0) backup_2022-07-15-1216_Janser_c87c60444c7f-db-table-sk_woocommerce_payment_tokens.table.gz (82/52/fopen): adding to final database dump
0053.149 (0) backup_2022-07-15-1216_Janser_c87c60444c7f-db-table-sk_woocommerce_sessions.table.tmpr2.gz (83/52/fopen): adding to final database dump
0053.152 (0) backup_2022-07-15-1216_Janser_c87c60444c7f-db-table-sk_woocommerce_sessions.table.gz (84/52/fopen): adding to final database dump
0053.155 (0) backup_2022-07-15-1216_Janser_c87c60444c7f-db-table-sk_woocommerce_shipping_zone_locations.table.tmpr0.gz (85/52/fopen): adding to final database dump
0053.158 (0) backup_2022-07-15-1216_Janser_c87c60444c7f-db-table-sk_woocommerce_shipping_zone_locations.table.gz (86/52/fopen): adding to final database dump
0053.160 (0) backup_2022-07-15-1216_Janser_c87c60444c7f-db-table-sk_woocommerce_shipping_zone_methods.table.tmpr0.gz (87/52/fopen): adding to final database dump
0053.162 (0) backup_2022-07-15-1216_Janser_c87c60444c7f-db-table-sk_woocommerce_shipping_zone_methods.table.gz (88/52/fopen): adding to final database dump
0053.165 (0) backup_2022-07-15-1216_Janser_c87c60444c7f-db-table-sk_woocommerce_shipping_zones.table.tmpr0.gz (89/52/fopen): adding to final database dump
0053.168 (0) backup_2022-07-15-1216_Janser_c87c60444c7f-db-table-sk_woocommerce_shipping_zones.table.gz (90/52/fopen): adding to final database dump
0053.170 (0) backup_2022-07-15-1216_Janser_c87c60444c7f-db-table-sk_woocommerce_tax_rate_locations.table.tmpr0.gz (91/52/fopen): adding to final database dump
0053.173 (0) backup_2022-07-15-1216_Janser_c87c60444c7f-db-table-sk_woocommerce_tax_rate_locations.table.gz (92/52/fopen): adding to final database dump
0053.175 (0) backup_2022-07-15-1216_Janser_c87c60444c7f-db-table-sk_woocommerce_tax_rates.table.tmpr0.gz (93/52/fopen): adding to final database dump
0053.177 (0) backup_2022-07-15-1216_Janser_c87c60444c7f-db-table-sk_woocommerce_tax_rates.table.gz (94/52/fopen): adding to final database dump
0053.180 (0) backup_2022-07-15-1216_Janser_c87c60444c7f-db-table-sk_yoast_indexable.table.tmpr29.gz (95/52/fopen): adding to final database dump
0053.183 (0) backup_2022-07-15-1216_Janser_c87c60444c7f-db-table-sk_yoast_indexable.table.gz (96/52/fopen): adding to final database dump
0053.185 (0) backup_2022-07-15-1216_Janser_c87c60444c7f-db-table-sk_yoast_indexable_hierarchy.table.tmpr1001.gz (97/52/fopen): adding to final database dump
0053.189 (0) backup_2022-07-15-1216_Janser_c87c60444c7f-db-table-sk_yoast_indexable_hierarchy.table.gz (98/52/fopen): adding to final database dump
0053.191 (0) backup_2022-07-15-1216_Janser_c87c60444c7f-db-table-sk_yoast_migrations.table.tmpr24.gz (99/52/fopen): adding to final database dump
0053.195 (0) backup_2022-07-15-1216_Janser_c87c60444c7f-db-table-sk_yoast_migrations.table.gz (100/52/fopen): adding to final database dump
0053.199 (0) backup_2022-07-15-1216_Janser_c87c60444c7f-db-table-sk_yoast_primary_term.table.tmpr0.gz (101/52/fopen): adding to final database dump
0053.202 (0) backup_2022-07-15-1216_Janser_c87c60444c7f-db-table-sk_yoast_primary_term.table.gz (102/52/fopen): adding to final database dump
0053.204 (0) backup_2022-07-15-1216_Janser_c87c60444c7f-db-table-sk_yoast_seo_links.table.tmpr2.gz (103/52/fopen): adding to final database dump
0053.207 (0) backup_2022-07-15-1216_Janser_c87c60444c7f-db-table-sk_yoast_seo_links.table.gz (104/52/fopen): adding to final database dump
0053.259 (0) backup_2022-07-15-1216_Janser_c87c60444c7f-db.gz: finished writing out complete database file (185.6 KB)
0053.307 (0) Total database tables backed up: 52 (backup_2022-07-15-1216_Janser_c87c60444c7f-db.gz, size: 190148, sha1: 7430ba04cb23b85945e43df2772f8cb2737b9874, sha256: 049537b9eae3450cfb3fbeb98beade56bf0223672c3ddc657012708178944722)
0053.320 (0) backup_2022-07-15-1216_Janser_c87c60444c7f-wpcore.zip: wpcore: This file has not yet been successfully uploaded: will queue
0053.322 (0) backup_2022-07-15-1216_Janser_c87c60444c7f-db.gz: db: This file has not yet been successfully uploaded: will queue
0053.324 (0) Saving backup history. Total backup size: 12.4 MB
0053.331 (0) Requesting upload of the files that have not yet been successfully uploaded (2)
0053.338 (0) Cloud backup selection (1/1): none with instance (1/1) (last)
0053.340 (0) No remote despatch: user chose no remote backup service
0053.342 (0) Recording as successfully uploaded: backup_2022-07-15-1216_Janser_c87c60444c7f-wpcore.zip
0053.348 (0) Deleting zip manifest (backup_2022-07-15-1216_Janser_c87c60444c7f-wpcore.zip.list.tmp)
0053.352 (0) Recording as successfully uploaded: backup_2022-07-15-1216_Janser_c87c60444c7f-db.gz
0053.361 (0) Retain: beginning examination of existing backup sets; user setting: retain_files=2, retain_db=2
0053.365 (0) Number of backup sets in history: 1; groups (db): 1
0053.368 (0) Examining (for databases) backup set with group_id=0, nonce=c87c60444c7f, datestamp=1657880174 (Jul 15 2022 10:16:14)
0053.370 (0) This backup set is the backup set just made, so will not be deleted.
0053.370 (0) Number of backup sets in history: 1; groups (files): 1
0053.373 (0) Examining (for files) backup set with nonce=c87c60444c7f, datestamp=1657880174 (Jul 15 2022 10:16:14)
0053.373 (0) This backup set is the backup set just made, so will not be deleted.
0053.375 (0) This backup set remains non-empty (f=1/d=1); will retain in history
0053.377 (0) Retain: saving new backup history (sets now: 1) and finishing retain operation
0053.384 (0) Resume backup (c87c60444c7f, 0): finish run
0053.390 (0) Decremented the semaphore (fd) by 1
0053.394 (0) Semaphore (fd) unlocked
0053.397 (0) There were no errors in the uploads, so the 'resume' event (1) is being unscheduled
0053.405 (0) The backup apparently succeeded and is now complete
0053.407 (0) No email will/can be sent - the user has not configured an email address.
0053.410 (0) Udało się wykonać i zakończyć tworzenie kopii
