[
  {
    "model": "auth.user",
    "pk": 1,
    "fields": {
      "password": "pbkdf2_sha256$216000$gbs37yh7LfoW$6teodTSVHtixNd3uPRKFGm7rP7eZ7Uee84q+4IjQRPI=",
      "last_login": "2020-03-21T06:25:30.036Z",
      "is_superuser": 1,
      "username": "Nora",
      "first_name": "",
      "last_name": "",
      "email": "nora@cornershop.io",
      "is_staff": 1,
      "is_active": 1,
      "date_joined": "2021-02-02 17:18:08.030959",
      "groups": [],
      "user_permissions": []
    }
  }
]