.git/
admin/gfx/
admin/includes/emailpdfs/
admin/templates_c/
bilder/
build/
docs/
downloads/
export/
gfx/
includes/plugins/
includes/vendor/
install/
jtllogs/
media/
mediafiles/
templates/
templates_c/
tests/
uploads/