../Core/Src/lcd_gfx.c:5:6:gfx_draw_pixel	24	static
../Core/Src/lcd_gfx.c:14:6:gfx_draw_line	48	static
../Core/Src/lcd_gfx.c:57:6:gfx_draw_fast_vline	32	static
../Core/Src/lcd_gfx.c:63:6:gfx_fill_rect	32	static
../Core/Src/lcd_gfx.c:72:6:gfx_fill_screen	24	static
../Core/Src/lcd_gfx.c:78:6:gfx_draw_circle	40	static
../Core/Src/lcd_gfx.c:113:6:gfx_fill_circle_helper	40	static
../Core/Src/lcd_gfx.c:142:6:gfx_fill_circle	32	static
../Core/Src/lcd_gfx.c:148:6:gfx_init	24	static
