C:/TouchGFXProjects/Project_IoT_STM32_ESP32_AWS/Core/Src/stm32f4xx_it.c:74:6:NMI_Handler	0	static
C:/TouchGFXProjects/Project_IoT_STM32_ESP32_AWS/Core/Src/stm32f4xx_it.c:87:6:HardFault_Handler	0	static
C:/TouchGFXProjects/Project_IoT_STM32_ESP32_AWS/Core/Src/stm32f4xx_it.c:102:6:MemManage_Handler	0	static
C:/TouchGFXProjects/Project_IoT_STM32_ESP32_AWS/Core/Src/stm32f4xx_it.c:117:6:BusFault_Handler	0	static
C:/TouchGFXProjects/Project_IoT_STM32_ESP32_AWS/Core/Src/stm32f4xx_it.c:132:6:UsageFault_Handler	0	static
C:/TouchGFXProjects/Project_IoT_STM32_ESP32_AWS/Core/Src/stm32f4xx_it.c:147:6:DebugMon_Handler	0	static
C:/TouchGFXProjects/Project_IoT_STM32_ESP32_AWS/Core/Src/stm32f4xx_it.c:167:6:USART1_IRQHandler	0	static
C:/TouchGFXProjects/Project_IoT_STM32_ESP32_AWS/Core/Src/stm32f4xx_it.c:181:6:TIM6_DAC_IRQHandler	0	static
C:/TouchGFXProjects/Project_IoT_STM32_ESP32_AWS/Core/Src/stm32f4xx_it.c:195:6:LTDC_IRQHandler	0	static
C:/TouchGFXProjects/Project_IoT_STM32_ESP32_AWS/Core/Src/stm32f4xx_it.c:209:6:DMA2D_IRQHandler	0	static
