C:/TouchGFXProjects/Project_IoT_STM32_ESP32_AWS/Drivers/STM32F4xx_HAL_Driver/Src/stm32f4xx_hal_dma.c:1185:17:DMA_CalcBaseAndBitshift	8	static
C:/TouchGFXProjects/Project_IoT_STM32_ESP32_AWS/Drivers/STM32F4xx_HAL_Driver/Src/stm32f4xx_hal_dma.c:170:19:HAL_DMA_Init	16	static
C:/TouchGFXProjects/Project_IoT_STM32_ESP32_AWS/Drivers/STM32F4xx_HAL_Driver/Src/stm32f4xx_hal_dma.c:309:19:HAL_DMA_DeInit	16	static
C:/TouchGFXProjects/Project_IoT_STM32_ESP32_AWS/Drivers/STM32F4xx_HAL_Driver/Src/stm32f4xx_hal_dma.c:407:19:HAL_DMA_Start	12	static
C:/TouchGFXProjects/Project_IoT_STM32_ESP32_AWS/Drivers/STM32F4xx_HAL_Driver/Src/stm32f4xx_hal_dma.c:451:19:HAL_DMA_Start_IT	16	static
C:/TouchGFXProjects/Project_IoT_STM32_ESP32_AWS/Drivers/STM32F4xx_HAL_Driver/Src/stm32f4xx_hal_dma.c:513:19:HAL_DMA_Abort	16	static
C:/TouchGFXProjects/Project_IoT_STM32_ESP32_AWS/Drivers/STM32F4xx_HAL_Driver/Src/stm32f4xx_hal_dma.c:580:19:HAL_DMA_Abort_IT	0	static
C:/TouchGFXProjects/Project_IoT_STM32_ESP32_AWS/Drivers/STM32F4xx_HAL_Driver/Src/stm32f4xx_hal_dma.c:610:19:HAL_DMA_PollForTransfer	40	static
C:/TouchGFXProjects/Project_IoT_STM32_ESP32_AWS/Drivers/STM32F4xx_HAL_Driver/Src/stm32f4xx_hal_dma.c:746:6:HAL_DMA_IRQHandler	32	static
C:/TouchGFXProjects/Project_IoT_STM32_ESP32_AWS/Drivers/STM32F4xx_HAL_Driver/Src/stm32f4xx_hal_dma.c:967:19:HAL_DMA_RegisterCallback	8	static
C:/TouchGFXProjects/Project_IoT_STM32_ESP32_AWS/Drivers/STM32F4xx_HAL_Driver/Src/stm32f4xx_hal_dma.c:1029:19:HAL_DMA_UnRegisterCallback	8	static
C:/TouchGFXProjects/Project_IoT_STM32_ESP32_AWS/Drivers/STM32F4xx_HAL_Driver/Src/stm32f4xx_hal_dma.c:1114:22:HAL_DMA_GetState	0	static
C:/TouchGFXProjects/Project_IoT_STM32_ESP32_AWS/Drivers/STM32F4xx_HAL_Driver/Src/stm32f4xx_hal_dma.c:1125:10:HAL_DMA_GetError	0	static
