../Src/stm32f4xx_hal_msp.c:63:6:HAL_MspInit	16	static
../Src/stm32f4xx_hal_msp.c:85:6:HAL_SPI_MspInit	48	static
../Src/stm32f4xx_hal_msp.c:122:6:HAL_SPI_MspDeInit	16	static
../Src/stm32f4xx_hal_msp.c:152:6:HAL_TIM_Base_MspInit	24	static
../Src/stm32f4xx_hal_msp.c:174:6:HAL_TIM_Base_MspDeInit	16	static
