<svg viewBox="0 0 93 93" fill="none" xmlns="http://www.w3.org/2000/svg">
<path d="M1.00794 4.5149C1.00404 2.5765 2.57644 1.0041 4.51484 1.008L88.9249 1.1754C92.0389 1.1816 93.5949 4.9478 91.3929 7.1503L7.15024 91.393C4.94774 93.595 1.18154 92.039 1.17544 88.925L1.00794 4.5149Z" fill="currentColor" stroke="black"/>
</svg>
