{
   "type": "sqlite",
   "database": "./src/database/happy.db3",
   "migrations": ["./src/database/migrations/*.ts"],
   "entities": ["./src/database/models/*.ts"],
   "cli": {
      "migrationsDir": "./src/database/migrations"
   }
}