{
	"CAR_TABLE_NAME": "ENC[AES256_GCM,data:Q3OF8A==,iv:c3N7JFqVBRK8Ym9LT9kape6iEgFRBIhK7wdgQYZa1x0=,tag:pLGWAh0nFwfqpUI/UmFb3w==,type:str]",
	"sops": {
		"kms": null,
		"gcp_kms": null,
		"azure_kv": null,
		"lastmodified": "2021-06-16T17:40:03Z",
		"mac": "ENC[AES256_GCM,data:kXDXIUWKLKmCjtp/TuBWKsLeLb7Em1W+DR5XvsC9p34Sj/eeM3HoSL0P69UG6MXBfMGhyI84BIDW7opct2lJBt3PHu/8jHlkMxp04XxO61pk2Dk+pSBjrSI1cmZkvHZkGOfFlKZa+POnr0DgP94XyBfzyJFDwyxZPl9CGHWgH0k=,iv:XQoUCs0FEfZD2BV9tKNpc/y18F5fp2unD/MB5vmwl8M=,tag:lzUDvn7zXqq989IZvncfYw==,type:str]",
		"pgp": [
			{
				"created_at": "2021-06-16T17:40:03Z",
				"enc": "-----BEGIN PGP MESSAGE-----\n\nhQGMA1xYOnWxWL9sAQv+K0d31/5OTPlqARVFzFGUJID+2zdg1cvaG+fuFN8z50/Y\nSuH7N8gyCRROabXHBHMpQQAyLDxcDL5kVzBkhF+gfp0Hh6KrujThRj/oYXrAgfqi\nHkyFk2r0kmXVjUhJQwWcIXhx5HcxIGQYTR+0QUoLB6PXqbgEHWkZ8G1drWLl5KG4\nZ/YMoHTrKzy+bdD2UaVlOnOIBCSrX2wYc8dB3DHJ/WfoI/2RxGNFDCDTG8NpRsmb\naXqXLBCS6c35B4anTxkpLW8se6mPCG1vdTUtv76/xGsOx9ClEwqQG5cAcvorcA8I\ntJdBJyZp5f5YvcWkXDpg5a3zKnzd/hFfEb+/Ct/vq97PLkVlHPMDPQCvCO96jcTD\nLsGvP4eEX79wjes+x/OIHFvOPPm/BXzgoD+fEO9Cx50GyIKitayxSzOyqLgZtOJt\n4yxoKJDnD0ldvqk4WNcHZqZBDVZG7Fv7Bl+QcsSvQQnfGuDhZAGMGO3rM9c8ugQX\n0S2/ln9HF07rkBg1xG5v0l4BunZspZwgCQDbT2bjXQkNq+voU3l4gd/sfbFPGuYw\n3lf3wEeruHeYPgK7YaNbS2yMxS6cCTSUTmH+Z/ouCmEZOK7r/K8rww+mvLzbVaDI\nBo1SN1wsTOhWhMPfNA7j\n=r7YW\n-----END PGP MESSAGE-----\n",
				"fp": "AF7FA38C706F4A62ABCA1C6A9691C82B785BCCDD"
			}
		],
		"unencrypted_suffix": "_unencrypted",
		"version": "3.5.0"
	}
}