M48
METRIC,TZ
T1C0.400
T2C0.400
T3C1.000
T4C2.200
T5C2.500
%
G90
G05
T1
X132220Y-103975
X132588Y-91694
X132944Y-97485
X133490Y-103975
X133731Y-88011
X133731Y-89154
X133731Y-90170
X133731Y-92710
X133731Y-93726
X133731Y-94742
X133960Y-97485
X134760Y-103975
X134976Y-97485
X136030Y-103975
X136144Y-97536
X137160Y-88011
X137160Y-89154
X137160Y-90170
X137287Y-92710
X137287Y-93726
X137287Y-94742
X137300Y-103975
X137414Y-97536
X138170Y-106375
X138170Y-113163
X138430Y-97536
X138684Y-103962
X139446Y-97536
X139446Y-106369
X139446Y-113157
X139700Y-103962
X140614Y-97587
X140665Y-99924
X140665Y-101194
X140665Y-102464
X140716Y-98806
X140716Y-103962
X140964Y-106375
X140970Y-113157
X142240Y-88773
X142240Y-106369
X142246Y-113151
X143198Y-93581
X143504Y-106375
X143510Y-113157
X144774Y-106375
X144780Y-113157
X144932Y-92050
X145796Y-108077
X145796Y-109347
X145796Y-110617
X145796Y-111887
X147066Y-107569
X147066Y-108839
X147066Y-110109
X147066Y-111379
X147066Y-112649
X147193Y-94488
X148215Y-89770
X148514Y-97358
X148514Y-98882
X148514Y-101422
X148514Y-102946
X149606Y-112928
X149936Y-106502
X150149Y-93106
X150444Y-108280
X150444Y-111328
X150952Y-106502
X150952Y-113360
X151714Y-108280
X151714Y-109804
X151714Y-111328
X151968Y-106502
X151968Y-113360
X152781Y-97358
X152781Y-98882
X152781Y-101422
X152781Y-102946
X152984Y-106502
X152984Y-108280
X152984Y-111328
X152984Y-113360
X153162Y-92837
X154000Y-106502
X154000Y-113360
X154940Y-107264
X155016Y-108534
X155016Y-109804
X155016Y-111074
X155016Y-112344
X156286Y-107518
X156286Y-109042
X156286Y-110566
X156286Y-111836
X156718Y-106375
X156718Y-112979
X157988Y-106375
X157988Y-112979
X159258Y-106375
X159258Y-112979
X159766Y-96520
X159766Y-104648
X159893Y-98349
X159893Y-99619
X159893Y-100889
X159893Y-102159
X160528Y-106375
X160528Y-112979
X160782Y-96520
X160782Y-104648
X161798Y-96520
X161798Y-104648
X161798Y-106375
X161798Y-112979
X162941Y-92710
X163043Y-104648
X163195Y-96495
X163271Y-106375
X163351Y-112979
X164313Y-104648
X164465Y-96495
X164846Y-106375
X164846Y-112979
X165583Y-104648
X165608Y-96520
X166116Y-106375
X166116Y-112979
X166853Y-104648
X166878Y-96520
X167386Y-106375
X167386Y-112979
X168123Y-104648
X168148Y-96520
X168656Y-106375
X168656Y-112979
X169164Y-94615
X169164Y-97282
X169393Y-104648
X169926Y-112979
X170180Y-98044
X172263Y-93004
X172288Y-89270
X172288Y-90540
X172288Y-91734
X172339Y-94299
X172949Y-88203
X173990Y-96356
X174015Y-88203
X175057Y-96356
X175082Y-88203
X175565Y-95391
X175590Y-89168
T2
X125603Y-107721
X125603Y-109245
X125603Y-110261
X125603Y-111785
X125610Y-98628
X125610Y-100152
X125610Y-101168
X125610Y-102692
X127127Y-107721
X127127Y-109245
X127127Y-110261
X127127Y-111785
X127134Y-98628
X127134Y-100152
X127134Y-101168
X127134Y-102692
X129159Y-107721
X129159Y-109245
X129159Y-110261
X129159Y-111785
X129166Y-98628
X129166Y-100152
X129166Y-101168
X129166Y-102692
X130683Y-107721
X130683Y-109245
X130683Y-110261
X130683Y-111785
X130690Y-98628
X130690Y-100152
X130690Y-101168
X130690Y-102692
X172110Y-107569
X172110Y-109093
X172110Y-110109
X172110Y-111633
X172161Y-99365
X172161Y-100889
X172161Y-101905
X172161Y-103429
X173634Y-107569
X173634Y-109093
X173634Y-110109
X173634Y-111633
X173685Y-99365
X173685Y-100889
X173685Y-101905
X173685Y-103429
X175666Y-107569
X175666Y-109093
X175666Y-110109
X175666Y-111633
X175717Y-99365
X175717Y-100889
X175717Y-101905
X175717Y-103429
X177190Y-107569
X177190Y-109093
X177190Y-110109
X177190Y-111633
X177241Y-99365
X177241Y-100889
X177241Y-101905
X177241Y-103429
T3
X126439Y-91115
X126439Y-93655
X142500Y-83000
X142500Y-117000
X145040Y-83000
X145040Y-117000
X147580Y-83000
X147580Y-117000
X150120Y-83000
X150120Y-117000
X152660Y-83000
X152660Y-117000
X155200Y-83000
X155200Y-117000
X157740Y-83000
X157740Y-117000
X160280Y-83000
X160280Y-117000
X176759Y-91226
X176759Y-93766
T4
X135331Y-100584
X135382Y-109728
X167183Y-101346
X167284Y-109550
T5
X127351Y-83500
X127351Y-116500
X132601Y-81250
X132601Y-118750
X136351Y-85000
X136351Y-115000
X166351Y-85000
X166351Y-115000
X170101Y-81250
X170101Y-118750
X175351Y-83500
X175351Y-116500
T0
M30
