(kicad_sch (version 20230221) (generator eeschema)

  (uuid 27c95fa5-6fcf-4261-9b67-e3653b00ab59)

  (paper "A4")

  (title_block
    (title "Stackable Power Module")
    (date "2023-03-21")
    (rev "${VERSION}")
    (company "SearchWing e.V.")
  )

  (lib_symbols
    (symbol "power:GND" (power) (pin_names (offset 0)) (in_bom yes) (on_board yes)
      (property "Reference" "#PWR" (at 0 -6.35 0)
        (effects (font (size 1.27 1.27)) hide)
      )
      (property "Value" "GND" (at 0 -3.81 0)
        (effects (font (size 1.27 1.27)))
      )
      (property "Footprint" "" (at 0 0 0)
        (effects (font (size 1.27 1.27)) hide)
      )
      (property "Datasheet" "" (at 0 0 0)
        (effects (font (size 1.27 1.27)) hide)
      )
      (property "ki_keywords" "global power" (at 0 0 0)
        (effects (font (size 1.27 1.27)) hide)
      )
      (property "ki_description" "Power symbol creates a global label with name \"GND\" , ground" (at 0 0 0)
        (effects (font (size 1.27 1.27)) hide)
      )
      (symbol "GND_0_1"
        (polyline
          (pts
            (xy 0 0)
            (xy 0 -1.27)
            (xy 1.27 -1.27)
            (xy 0 -2.54)
            (xy -1.27 -1.27)
            (xy 0 -1.27)
          )
          (stroke (width 0) (type default))
          (fill (type none))
        )
      )
      (symbol "GND_1_1"
        (pin power_in line (at 0 0 270) (length 0) hide
          (name "GND" (effects (font (size 1.27 1.27))))
          (number "1" (effects (font (size 1.27 1.27))))
        )
      )
    )
    (symbol "searchwing_components:100uF-Al.-Elk.-35V-300mOhm" (pin_numbers hide) (pin_names (offset 0.254)) (in_bom yes) (on_board yes)
      (property "Reference" "C?" (at 5.715 2.54 0)
        (effects (font (size 1.27 1.27)) (justify right))
      )
      (property "Value" "100uF-Al.-Elk.-35V-300mOhm" (at -5.08 5.08 0)
        (effects (font (size 1.27 1.27)) (justify right) hide)
      )
      (property "Footprint" "searchwing_components:EEE0JA331XP" (at 0 -7.62 0)
        (effects (font (size 0 0)) hide)
      )
      (property "Datasheet" "https://industrial.panasonic.com/cdbs/www-data/pdf/RDE0000/ABA0000C1199.pdf" (at 0 0 0)
        (effects (font (size 0 0)) hide)
      )
      (property "JLCPCB" "-" (at -6.985 -0.635 0)
        (effects (font (size 1.27 1.27)) hide)
      )
      (property "JLCPCB_Number" "-" (at 0 0 0)
        (effects (font (size 1.27 1.27)) hide)
      )
      (property "MANUFACTURER" "Panasonic" (at -2.54 8.89 0)
        (effects (font (size 1.27 1.27)) hide)
      )
      (property "MFG_PART_NUMBER" "EEE-TQV101XAP" (at 0 11.43 0)
        (effects (font (size 1.27 1.27)) hide)
      )
      (property "Mouser" "https://www.mouser.de/ProductDetail/Panasonic/EEE-TQV101XAP?qs=GGwTQoheSSrAQhLsgP2KBg%3D%3D" (at 0 16.51 0)
        (effects (font (size 1.27 1.27)) hide)
      )
      (property "Digikey" "https://www.digikey.de/de/products/detail/panasonic-electronic-components/EEE-TQV101XAP/3837556?s=N4IgTCBcDaIKIILQBUCKA1AjABkwDQEEAFEAXQF8g" (at 1.27 13.97 0)
        (effects (font (size 1.27 1.27)) hide)
      )
      (property "FOOTPRINT_FORMATED" "SMD electrolyt capacitor" (at -17.145 1.905 0)
        (effects (font (size 1.27 1.27)) hide)
      )
      (property "CAPACITY" "100uF" (at 6.35 0.635 0)
        (effects (font (size 1.27 1.27)))
      )
      (property "TYPE" "Al.-Elk." (at 6.985 -3.175 0)
        (effects (font (size 1.27 1.27)))
      )
      (property "TOLERANCE" "20%" (at 12.065 0.635 0)
        (effects (font (size 1.27 1.27)) hide)
      )
      (property "RATING" "35V" (at 5.08 -1.27 0)
        (effects (font (size 1.27 1.27)))
      )
      (property "ki_keywords" "cap capacitor" (at 0 0 0)
        (effects (font (size 1.27 1.27)) hide)
      )
      (property "ki_description" "Polarized capacitor" (at 0 0 0)
        (effects (font (size 1.27 1.27)) hide)
      )
      (property "ki_fp_filters" "C_*" (at 0 0 0)
        (effects (font (size 1.27 1.27)) hide)
      )
      (symbol "100uF-Al.-Elk.-35V-300mOhm_0_0"
        (text "+" (at -1.27 2.54 0)
          (effects (font (size 1.27 1.27)))
        )
      )
      (symbol "100uF-Al.-Elk.-35V-300mOhm_0_1"
        (polyline
          (pts
            (xy -2.032 -0.762)
            (xy 2.032 -0.762)
          )
          (stroke (width 0.508) (type default))
          (fill (type none))
        )
        (polyline
          (pts
            (xy -2.032 0.762)
            (xy 2.032 0.762)
          )
          (stroke (width 0.508) (type default))
          (fill (type none))
        )
      )
      (symbol "100uF-Al.-Elk.-35V-300mOhm_1_1"
        (pin input line (at 0 3.81 270) (length 2.794)
          (name "~" (effects (font (size 1.27 1.27))))
          (number "1" (effects (font (size 1.27 1.27))))
        )
        (pin passive line (at 0 -3.81 90) (length 2.794)
          (name "~" (effects (font (size 1.27 1.27))))
          (number "2" (effects (font (size 1.27 1.27))))
        )
      )
    )
    (symbol "searchwing_components:10uF-1210-50V-X7S" (pin_numbers hide) (pin_names (offset 0.254)) (in_bom yes) (on_board yes)
      (property "Reference" "C?" (at 3.175 1.905 0)
        (effects (font (size 1.27 1.27)) (justify left))
      )
      (property "Value" "10uF-1210-50V-X7S" (at -8.89 24.13 0)
        (effects (font (size 1.27 1.27)) (justify left) hide)
      )
      (property "Footprint" "searchwing_components:C_1210_3225Metric" (at 0 -10.16 0)
        (effects (font (size 1.27 1.27)) hide)
      )
      (property "Datasheet" "~" (at 0 0 0)
        (effects (font (size 1.27 1.27)) hide)
      )
      (property "Mouser" "https://www.mouser.de/ProductDetail/TDK/CGA6P3X7S1H106K250AB?qs=NRhsANhppD%252BlCzhzZe83DQ%3D%3D" (at 1.27 18.415 0)
        (effects (font (size 1.27 1.27)) hide)
      )
      (property "MANUFACTURER" "TDK" (at 0 11.43 0)
        (effects (font (size 1.27 1.27)) hide)
      )
      (property "MFG_PART_NUMBER" "CGA6P3X7S1H106K250AB" (at 2.54 15.24 0)
        (effects (font (size 1.27 1.27)) hide)
      )
      (property "Digikey" "https://www.digikey.de/de/products/detail/tdk-corporation/CGA6P3X7S1H106K250AB/2672897?s=N4IgTCBcDaIMIHECCA2ACgZgBoHYDKAjABIEAMKA0mAKylIBCIAugL5A" (at 1.27 21.59 0)
        (effects (font (size 1.27 1.27)) hide)
      )
      (property "FOOTPRINT_FORMATED" "1210" (at 5.715 -5.715 0)
        (effects (font (size 1.27 1.27)))
      )
      (property "CAPACITY" "10uF" (at 5.715 0 0)
        (effects (font (size 1.27 1.27)))
      )
      (property "TYPE" "X7S" (at 5.08 -3.81 0)
        (effects (font (size 1.27 1.27)))
      )
      (property "TOLERANCE" "10%" (at 11.43 0 0)
        (effects (font (size 1.27 1.27)) hide)
      )
      (property "RATING" "50V" (at 5.08 -1.905 0)
        (effects (font (size 1.27 1.27)))
      )
      (property "ki_keywords" "cap capacitor" (at 0 0 0)
        (effects (font (size 1.27 1.27)) hide)
      )
      (property "ki_description" "Unpolarized capacitor" (at 0 0 0)
        (effects (font (size 1.27 1.27)) hide)
      )
      (property "ki_fp_filters" "C_*" (at 0 0 0)
        (effects (font (size 1.27 1.27)) hide)
      )
      (symbol "10uF-1210-50V-X7S_0_1"
        (polyline
          (pts
            (xy -2.032 -0.762)
            (xy 2.032 -0.762)
          )
          (stroke (width 0.508) (type default))
          (fill (type none))
        )
        (polyline
          (pts
            (xy -2.032 0.762)
            (xy 2.032 0.762)
          )
          (stroke (width 0.508) (type default))
          (fill (type none))
        )
      )
      (symbol "10uF-1210-50V-X7S_1_1"
        (pin passive line (at 0 3.81 270) (length 2.794)
          (name "~" (effects (font (size 1.27 1.27))))
          (number "1" (effects (font (size 1.27 1.27))))
        )
        (pin passive line (at 0 -3.81 90) (length 2.794)
          (name "~" (effects (font (size 1.27 1.27))))
          (number "2" (effects (font (size 1.27 1.27))))
        )
      )
    )
    (symbol "searchwing_components:1uH_10.8A_12.1mOhm" (pin_numbers hide) (pin_names (offset 1.016) hide) (in_bom yes) (on_board yes)
      (property "Reference" "L?" (at -1.27 0 90)
        (effects (font (size 1.27 1.27)))
      )
      (property "Value" "1uH_10.8A_12.1mOhm" (at -12.7 -1.905 0)
        (effects (font (size 1.27 1.27)) hide)
      )
      (property "Footprint" "searchwing_components:IHLP2020CZER1R0M8A" (at 0 12.7 0)
        (effects (font (size 1.27 1.27)) hide)
      )
      (property "Datasheet" "https://www.vishay.com/docs/34563/ihlp-2020cz-8a.pdf" (at 0 15.24 0)
        (effects (font (size 1.27 1.27)) hide)
      )
      (property "Mouser" "https://www.mouser.de/ProductDetail/Vishay-Dale/IHLP2020CZER1R0M8A?qs=sGAEpiMZZMv126LJFLh8y6Xt5bZaT3kdwCMocolCyfU%3D" (at 3.81 17.78 0)
        (effects (font (size 1.27 1.27)) hide)
      )
      (property "Digikey" "https://www.digikey.de/de/products/detail/vishay-dale/IHLP2020CZER1R0M8A/13985220?s=N4IgTCBcDaIJIAkAyAFMAGDBhAWgUQCUBGA9AWQA4BBEAXQF8g" (at 1.27 20.32 0)
        (effects (font (size 1.27 1.27)) hide)
      )
      (property "MFG_PART_NUMBER" "IHLP2020CZER1R0M8A" (at 0 24.13 0)
        (effects (font (size 1.27 1.27)) hide)
      )
      (property "MANUFACTURER" "Vishay / Dale" (at -8.89 4.445 0)
        (effects (font (size 1.27 1.27)) hide)
      )
      (property "FOOTPRINT_FORMATED" "SMD Inductor" (at -8.89 1.905 0)
        (effects (font (size 1.27 1.27)) hide)
      )
      (property "INDUCTANCE" "1uH" (at 3.81 0.635 0)
        (effects (font (size 1.27 1.27)))
      )
      (property "RATING" "8A" (at 3.175 -1.27 0)
        (effects (font (size 1.27 1.27)))
      )
      (property "ki_keywords" "inductor choke coil reactor magnetic" (at 0 0 0)
        (effects (font (size 1.27 1.27)) hide)
      )
      (property "ki_description" "Inductor" (at 0 0 0)
        (effects (font (size 1.27 1.27)) hide)
      )
      (property "ki_fp_filters" "Choke_* *Coil* Inductor_* L_*" (at 0 0 0)
        (effects (font (size 1.27 1.27)) hide)
      )
      (symbol "1uH_10.8A_12.1mOhm_0_1"
        (arc (start 0 -2.54) (mid 0.6323 -1.905) (end 0 -1.27)
          (stroke (width 0) (type default))
          (fill (type none))
        )
        (arc (start 0 -1.27) (mid 0.6323 -0.635) (end 0 0)
          (stroke (width 0) (type default))
          (fill (type none))
        )
        (arc (start 0 0) (mid 0.6323 0.635) (end 0 1.27)
          (stroke (width 0) (type default))
          (fill (type none))
        )
        (arc (start 0 1.27) (mid 0.6323 1.905) (end 0 2.54)
          (stroke (width 0) (type default))
          (fill (type none))
        )
      )
      (symbol "1uH_10.8A_12.1mOhm_1_1"
        (pin passive line (at 0 3.81 270) (length 1.27)
          (name "1" (effects (font (size 1.27 1.27))))
          (number "1" (effects (font (size 1.27 1.27))))
        )
        (pin passive line (at 0 -3.81 90) (length 1.27)
          (name "2" (effects (font (size 1.27 1.27))))
          (number "2" (effects (font (size 1.27 1.27))))
        )
      )
    )
    (symbol "searchwing_components:2nF2-0603-50V-C0G" (pin_numbers hide) (pin_names (offset 0.254)) (in_bom yes) (on_board yes)
      (property "Reference" "C?" (at 3.81 2.54 0)
        (effects (font (size 1.27 1.27)) (justify left))
      )
      (property "Value" "2nF2-0603-50V-C0G" (at -24.765 4.445 0)
        (effects (font (size 1.27 1.27)) (justify left) hide)
      )
      (property "Footprint" "searchwing_components:C_0603_1608Metric" (at -20.32 -2.54 0)
        (effects (font (size 1.27 1.27)) hide)
      )
      (property "Datasheet" "~" (at 0 0 0)
        (effects (font (size 1.27 1.27)) hide)
      )
      (property "Mouser" "https://www.mouser.de/ProductDetail/Samsung-Electro-Mechanics/CL10C222JB8NNNC?qs=X6jEic%2FHinAn%252BGnX4fsk9Q%3D%3D" (at -3.175 24.13 0)
        (effects (font (size 1.27 1.27)) hide)
      )
      (property "MANUFACTURER" "Samsung Electro-Mechanics" (at 3.81 20.955 0)
        (effects (font (size 1.27 1.27)) hide)
      )
      (property "MFG_PART_NUMBER" "CL10C222JB8NNNC" (at -1.27 16.51 0)
        (effects (font (size 1.27 1.27)) hide)
      )
      (property "Digikey" "https://www.digikey.de/de/products/detail/samsung-electro-mechanics/CL10C222JB8NNNC/3887418?s=N4IgTCBcDaIMIBkCMAGOYMCkBCAOAcoXCALoC%2BQA" (at 0 18.415 0)
        (effects (font (size 1.27 1.27)) hide)
      )
      (property "FOOTPRINT_FORMATED" "0603" (at 6.35 -5.08 0)
        (effects (font (size 1.27 1.27)))
      )
      (property "CAPACITY" "2nF2" (at 6.35 0.635 0)
        (effects (font (size 1.27 1.27)))
      )
      (property "TYPE" "C0G" (at 5.715 -3.175 0)
        (effects (font (size 1.27 1.27)))
      )
      (property "TOLERANCE" "5%" (at 10.795 0.635 0)
        (effects (font (size 1.27 1.27)) hide)
      )
      (property "RATING" "50V" (at 5.715 -1.27 0)
        (effects (font (size 1.27 1.27)))
      )
      (property "ki_keywords" "cap capacitor" (at 0 0 0)
        (effects (font (size 1.27 1.27)) hide)
      )
      (property "ki_description" "Unpolarized capacitor" (at 0 0 0)
        (effects (font (size 1.27 1.27)) hide)
      )
      (property "ki_fp_filters" "C_*" (at 0 0 0)
        (effects (font (size 1.27 1.27)) hide)
      )
      (symbol "2nF2-0603-50V-C0G_0_1"
        (polyline
          (pts
            (xy -2.032 -0.762)
            (xy 2.032 -0.762)
          )
          (stroke (width 0.508) (type default))
          (fill (type none))
        )
        (polyline
          (pts
            (xy -2.032 0.762)
            (xy 2.032 0.762)
          )
          (stroke (width 0.508) (type default))
          (fill (type none))
        )
      )
      (symbol "2nF2-0603-50V-C0G_1_1"
        (pin passive line (at 0 3.81 270) (length 2.794)
          (name "~" (effects (font (size 1.27 1.27))))
          (number "1" (effects (font (size 1.27 1.27))))
        )
        (pin passive line (at 0 -3.81 90) (length 2.794)
          (name "~" (effects (font (size 1.27 1.27))))
          (number "2" (effects (font (size 1.27 1.27))))
        )
      )
    )
    (symbol "searchwing_components:60Ohm@100MHz" (pin_numbers hide) (pin_names (offset 1.016) hide) (in_bom yes) (on_board yes)
      (property "Reference" "L?" (at 3.175 0.635 0)
        (effects (font (size 1.27 1.27)))
      )
      (property "Value" "60Ohm@100MHz" (at -13.97 0.635 90)
        (effects (font (size 1.27 1.27)))
      )
      (property "Footprint" "searchwing_components:BLM41PG102SH1L" (at 0 12.7 0)
        (effects (font (size 0 0)) hide)
      )
      (property "Datasheet" "https://www.murata.com/en-eu/products/productdata/8796740681758/QNFA9106.pdf" (at 0 15.24 0)
        (effects (font (size 0 0)) hide)
      )
      (property "MFG_PART_NUMBER" "BLM41PG600SH1L" (at 0 24.13 0)
        (effects (font (size 1.27 1.27)) hide)
      )
      (property "FOOTPRINT_FORMATED" "1806 SMD Ferrite Bead" (at -10.16 0 90)
        (effects (font (size 1.27 1.27)) hide)
      )
      (property "Mouser" "https://www.mouser.de/ProductDetail/Murata-Electronics/BLM41PG600SH1L?qs=4yPICbTHszSmAPhNSgdtbw%3D%3D&gclid=CjwKCAiAhKycBhAQEiwAgf19ej1eoplzwX7tJFgMt24KAzdw6yVph3jDWk4oFR1AMr30MIpluRgX6RoCBeYQAvD_BwE" (at 3.81 17.78 0)
        (effects (font (size 1.27 1.27)) hide)
      )
      (property "Digikey" "https://www.digikey.de/de/products/detail/murata-electronics/BLM41PG600SH1L/2588144?s=N4IgTCBcDaIEIBkCyAWAjABQOIDYAMeAygBJoIgC6AvkA" (at 1.27 20.32 0)
        (effects (font (size 1.27 1.27)) hide)
      )
      (property "MANUFACTURER" "Murata Electronics" (at -12.065 0.635 90)
        (effects (font (size 1.27 1.27)) hide)
      )
      (property "RATING" "6A" (at 3.175 -1.27 0)
        (effects (font (size 1.27 1.27)))
      )
      (property "ki_keywords" "inductor choke coil reactor magnetic" (at 0 0 0)
        (effects (font (size 1.27 1.27)) hide)
      )
      (property "ki_description" "Inductor" (at 0 0 0)
        (effects (font (size 1.27 1.27)) hide)
      )
      (property "ki_fp_filters" "Choke_* *Coil* Inductor_* L_*" (at 0 0 0)
        (effects (font (size 1.27 1.27)) hide)
      )
      (symbol "60Ohm@100MHz_0_1"
        (arc (start 0 -2.54) (mid 0.6323 -1.905) (end 0 -1.27)
          (stroke (width 0) (type default))
          (fill (type none))
        )
        (arc (start 0 -1.27) (mid 0.6323 -0.635) (end 0 0)
          (stroke (width 0) (type default))
          (fill (type none))
        )
        (arc (start 0 0) (mid 0.6323 0.635) (end 0 1.27)
          (stroke (width 0) (type default))
          (fill (type none))
        )
        (arc (start 0 1.27) (mid 0.6323 1.905) (end 0 2.54)
          (stroke (width 0) (type default))
          (fill (type none))
        )
      )
      (symbol "60Ohm@100MHz_1_1"
        (pin passive line (at 0 3.81 270) (length 1.27)
          (name "1" (effects (font (size 1.27 1.27))))
          (number "1" (effects (font (size 1.27 1.27))))
        )
        (pin passive line (at 0 -3.81 90) (length 1.27)
          (name "2" (effects (font (size 1.27 1.27))))
          (number "2" (effects (font (size 1.27 1.27))))
        )
      )
    )
  )

  (junction (at 163.83 46.99) (diameter 0) (color 0 0 0 0)
    (uuid 2496a9d5-80d7-431d-bece-0e4f48df8df3)
  )
  (junction (at 132.08 46.99) (diameter 0) (color 0 0 0 0)
    (uuid 259f9940-aedd-47ba-9fcf-ab95f391f4f7)
  )
  (junction (at 99.06 46.99) (diameter 0) (color 0 0 0 0)
    (uuid 490b2408-71e2-4bc7-a8bf-e881ee85f4ff)
  )
  (junction (at 63.5 74.93) (diameter 0) (color 0 0 0 0)
    (uuid 4e88ba83-cd00-46a0-897b-85a054d9fe74)
  )
  (junction (at 99.06 74.93) (diameter 0) (color 0 0 0 0)
    (uuid 6725b916-e84d-4206-9a3b-21437bd277fb)
  )
  (junction (at 63.5 46.99) (diameter 0) (color 0 0 0 0)
    (uuid 87536e7c-dcb6-44c8-bda8-14d342a1434b)
  )
  (junction (at 132.08 74.93) (diameter 0) (color 0 0 0 0)
    (uuid d93938b9-3039-4dfe-9bad-676f61dbc745)
  )

  (wire (pts (xy 132.08 74.93) (xy 163.83 74.93))
    (stroke (width 0) (type default))
    (uuid 0c35c029-6754-49c3-9246-db87a680c25b)
  )
  (wire (pts (xy 63.5 46.99) (xy 63.5 57.15))
    (stroke (width 0) (type default))
    (uuid 15d60d42-c11c-40c8-bcc8-0485bd46d561)
  )
  (wire (pts (xy 54.61 74.93) (xy 63.5 74.93))
    (stroke (width 0) (type default))
    (uuid 228a93cb-329c-4e6e-803d-eb2988ae6c00)
  )
  (wire (pts (xy 163.83 57.15) (xy 163.83 46.99))
    (stroke (width 0) (type default))
    (uuid 260d9f7c-c4e2-46c8-98f6-32e22fc24682)
  )
  (wire (pts (xy 85.09 46.99) (xy 99.06 46.99))
    (stroke (width 0) (type default))
    (uuid 2d45f3ec-2497-4d2b-ad78-6954f234d3a6)
  )
  (wire (pts (xy 99.06 64.77) (xy 99.06 74.93))
    (stroke (width 0) (type default))
    (uuid 35ed75fd-656b-4b83-a46c-670de9e609e3)
  )
  (wire (pts (xy 132.08 46.99) (xy 132.08 57.15))
    (stroke (width 0) (type default))
    (uuid 36612c0a-576c-4f27-aa9c-8f1cb7d8af80)
  )
  (wire (pts (xy 54.61 46.99) (xy 63.5 46.99))
    (stroke (width 0) (type default))
    (uuid 4136ebb2-e6af-435a-b88e-87c5805fe98e)
  )
  (wire (pts (xy 132.08 46.99) (xy 163.83 46.99))
    (stroke (width 0) (type default))
    (uuid 5c025824-79f5-4520-9922-675ce5a9b48c)
  )
  (wire (pts (xy 118.11 46.99) (xy 132.08 46.99))
    (stroke (width 0) (type default))
    (uuid 6dd5b552-5e66-46c8-9f67-ae3f51966bfe)
  )
  (wire (pts (xy 163.83 46.99) (xy 168.91 46.99))
    (stroke (width 0) (type default))
    (uuid 87259be9-281b-4918-bafe-46b5a1309b9e)
  )
  (wire (pts (xy 99.06 46.99) (xy 99.06 57.15))
    (stroke (width 0) (type default))
    (uuid 88e6e6aa-f9c1-47a2-b7a3-9a31f5714151)
  )
  (wire (pts (xy 99.06 74.93) (xy 132.08 74.93))
    (stroke (width 0) (type default))
    (uuid a0436627-c2f2-4edb-b8d6-b63a6ea529b1)
  )
  (wire (pts (xy 63.5 64.77) (xy 63.5 74.93))
    (stroke (width 0) (type default))
    (uuid a3add934-b510-4121-aecb-024a7d0cc4af)
  )
  (wire (pts (xy 99.06 46.99) (xy 110.49 46.99))
    (stroke (width 0) (type default))
    (uuid bf51fdc3-7e1e-4d0b-a434-503f0762fc85)
  )
  (wire (pts (xy 63.5 46.99) (xy 77.47 46.99))
    (stroke (width 0) (type default))
    (uuid c9463f08-ee41-4261-91d0-5e8b04ad61a1)
  )
  (wire (pts (xy 163.83 74.93) (xy 163.83 64.77))
    (stroke (width 0) (type default))
    (uuid de8848b3-4305-42fe-ad6a-9ef3586143c0)
  )
  (wire (pts (xy 63.5 74.93) (xy 99.06 74.93))
    (stroke (width 0) (type default))
    (uuid ec4f81e6-a248-472b-a72a-9fb2c51de3c2)
  )
  (wire (pts (xy 132.08 64.77) (xy 132.08 74.93))
    (stroke (width 0) (type default))
    (uuid f79be855-0afd-4d94-b3d0-11c81685a62c)
  )

  (hierarchical_label "power-filtered" (shape output) (at 168.91 46.99 0) (fields_autoplaced)
    (effects (font (size 1.27 1.27)) (justify left))
    (uuid c8f02ab2-5ef4-478e-af33-ed0e4c2d12bf)
  )
  (hierarchical_label "power-in" (shape input) (at 54.61 46.99 180) (fields_autoplaced)
    (effects (font (size 1.27 1.27)) (justify right))
    (uuid eae3d1c3-676e-4aa8-a04e-070aad1611f7)
  )

  (symbol (lib_id "searchwing_components:2nF2-0603-50V-C0G") (at 132.08 60.96 0) (unit 1)
    (in_bom yes) (on_board yes) (dnp no) (fields_autoplaced)
    (uuid 1e8d37cf-211b-4129-bc04-308b54dee37f)
    (property "Reference" "C203" (at 135.89 56.515 0)
      (effects (font (size 1.27 1.27)) (justify left))
    )
    (property "Value" "2nF2-0603-50V-C0G" (at 107.315 56.515 0)
      (effects (font (size 1.27 1.27)) (justify left) hide)
    )
    (property "Footprint" "searchwing_components:C_0603_1608Metric" (at 111.76 63.5 0)
      (effects (font (size 1.27 1.27)) hide)
    )
    (property "Datasheet" "~" (at 132.08 60.96 0)
      (effects (font (size 1.27 1.27)) hide)
    )
    (property "Mouser" "https://www.mouser.de/ProductDetail/Samsung-Electro-Mechanics/CL10C222JB8NNNC?qs=X6jEic%2FHinAn%252BGnX4fsk9Q%3D%3D" (at 128.905 36.83 0)
      (effects (font (size 1.27 1.27)) hide)
    )
    (property "MANUFACTURER" "Samsung Electro-Mechanics" (at 135.89 40.005 0)
      (effects (font (size 1.27 1.27)) hide)
    )
    (property "Digikey" "https://www.digikey.de/de/products/detail/samsung-electro-mechanics/CL10C222JB8NNNC/3887418?s=N4IgTCBcDaIMIBkCMAGOYMCkBCAOAcoXCALoC%2BQA" (at 132.08 42.545 0)
      (effects (font (size 1.27 1.27)) hide)
    )
    (property "MFG_PART_NUMBER" "CL10C222JB8NNNC" (at 130.81 44.45 0)
      (effects (font (size 1.27 1.27)) hide)
    )
    (property "FOOTPRINT_FORMATED" "0603" (at 135.89 59.055 0)
      (effects (font (size 1.27 1.27)) (justify left))
    )
    (property "CAPACITY" "2nF2" (at 135.89 61.595 0)
      (effects (font (size 1.27 1.27)) (justify left))
    )
    (property "TYPE" "C0G" (at 135.89 64.135 0)
      (effects (font (size 1.27 1.27)) (justify left))
    )
    (property "TOLERANCE" "5%" (at 142.875 60.325 0)
      (effects (font (size 1.27 1.27)) hide)
    )
    (property "RATING" "50V" (at 135.89 66.675 0)
      (effects (font (size 1.27 1.27)) (justify left))
    )
    (pin "1" (uuid 98008db1-abcb-4d8a-aab0-236c28d3cbd3))
    (pin "2" (uuid 945a2f27-83ca-402e-8332-5cc5fee0131f))
    (instances
      (project "stackable-powermodule"
        (path "/861a7ead-61a9-46ce-a25a-a861ee2f3ddf/fb8817c8-859c-4f5b-ac0e-47d071507085"
          (reference "C203") (unit 1)
        )
      )
    )
  )

  (symbol (lib_id "searchwing_components:100uF-Al.-Elk.-35V-300mOhm") (at 163.83 60.96 0) (unit 1)
    (in_bom yes) (on_board yes) (dnp no) (fields_autoplaced)
    (uuid 65a96415-371f-4b82-adba-bfa00cfd8ba2)
    (property "Reference" "C204" (at 167.64 56.6062 0)
      (effects (font (size 1.27 1.27)) (justify left))
    )
    (property "Value" "100uF-Al.-Elk.-35V-300mOhm" (at 158.75 55.88 0)
      (effects (font (size 1.27 1.27)) (justify right) hide)
    )
    (property "Footprint" "searchwing_components:EEE0JA331XP" (at 163.83 68.58 0)
      (effects (font (size 0 0)) hide)
    )
    (property "Datasheet" "https://industrial.panasonic.com/cdbs/www-data/pdf/RDE0000/ABA0000C1199.pdf" (at 163.83 60.96 0)
      (effects (font (size 0 0)) hide)
    )
    (property "JLCPCB" "-" (at 156.845 61.595 0)
      (effects (font (size 1.27 1.27)) hide)
    )
    (property "JLCPCB_Number" "-" (at 163.83 60.96 0)
      (effects (font (size 1.27 1.27)) hide)
    )
    (property "Mouser" "https://www.mouser.de/ProductDetail/Panasonic/EEE-TQV101XAP?qs=GGwTQoheSSrAQhLsgP2KBg%3D%3D" (at 163.83 44.45 0)
      (effects (font (size 1.27 1.27)) hide)
    )
    (property "Digikey" "https://www.digikey.de/de/products/detail/panasonic-electronic-components/EEE-TQV101XAP/3837556?s=N4IgTCBcDaIKIILQBUCKA1AjABkwDQEEAFEAXQF8g" (at 165.1 46.99 0)
      (effects (font (size 1.27 1.27)) hide)
    )
    (property "MANUFACTURER" "Panasonic" (at 161.29 52.07 0)
      (effects (font (size 1.27 1.27)) hide)
    )
    (property "FOOTPRINT_FORMATED" "SMD electrolyt capacitor" (at 146.685 59.055 0)
      (effects (font (size 1.27 1.27)) hide)
    )
    (property "MFG_PART_NUMBER" "EEE-TQV101XAP" (at 163.83 49.53 0)
      (effects (font (size 1.27 1.27)) hide)
    )
    (property "CAPACITY" "100uF" (at 167.64 59.1462 0)
      (effects (font (size 1.27 1.27)) (justify left))
    )
    (property "TYPE" "Al.-Elk." (at 167.64 61.6862 0)
      (effects (font (size 1.27 1.27)) (justify left))
    )
    (property "TOLERANCE" "20%" (at 175.895 60.325 0)
      (effects (font (size 1.27 1.27)) hide)
    )
    (property "RATING" "35V" (at 167.64 64.2262 0)
      (effects (font (size 1.27 1.27)) (justify left))
    )
    (pin "1" (uuid b73d5987-b1fd-4867-b2e7-f1ead6aadf06))
    (pin "2" (uuid 5c476fce-cddc-462b-8059-2939069ca562))
    (instances
      (project "stackable-powermodule"
        (path "/861a7ead-61a9-46ce-a25a-a861ee2f3ddf/fb8817c8-859c-4f5b-ac0e-47d071507085"
          (reference "C204") (unit 1)
        )
      )
    )
  )

  (symbol (lib_id "searchwing_components:10uF-1210-50V-X7S") (at 63.5 60.96 0) (unit 1)
    (in_bom yes) (on_board yes) (dnp no) (fields_autoplaced)
    (uuid a8e7617a-4052-47c3-9aa0-90aff92412de)
    (property "Reference" "C201" (at 67.31 56.515 0)
      (effects (font (size 1.27 1.27)) (justify left))
    )
    (property "Value" "10uF-1210-50V-X7S" (at 54.61 36.83 0)
      (effects (font (size 1.27 1.27)) (justify left) hide)
    )
    (property "Footprint" "searchwing_components:C_1210_3225Metric" (at 63.5 71.12 0)
      (effects (font (size 1.27 1.27)) hide)
    )
    (property "Datasheet" "~" (at 63.5 60.96 0)
      (effects (font (size 1.27 1.27)) hide)
    )
    (property "Mouser" "https://www.mouser.de/ProductDetail/TDK/CGA6P3X7S1H106K250AB?qs=NRhsANhppD%252BlCzhzZe83DQ%3D%3D" (at 64.77 42.545 0)
      (effects (font (size 1.27 1.27)) hide)
    )
    (property "MANUFACTURER" "TDK" (at 63.5 49.53 0)
      (effects (font (size 1.27 1.27)) hide)
    )
    (property "Digikey" "https://www.digikey.de/de/products/detail/tdk-corporation/CGA6P3X7S1H106K250AB/2672897?s=N4IgTCBcDaIMIHECCA2ACgZgBoHYDKAjABIEAMKA0mAKylIBCIAugL5A" (at 64.77 39.37 0)
      (effects (font (size 1.27 1.27)) hide)
    )
    (property "MFG_PART_NUMBER" "CGA6P3X7S1H106K250AB" (at 66.04 45.72 0)
      (effects (font (size 1.27 1.27)) hide)
    )
    (property "FOOTPRINT_FORMATED" "1210" (at 67.31 59.055 0)
      (effects (font (size 1.27 1.27)) (justify left))
    )
    (property "CAPACITY" "10uF" (at 67.31 61.595 0)
      (effects (font (size 1.27 1.27)) (justify left))
    )
    (property "TYPE" "X7S" (at 67.31 64.135 0)
      (effects (font (size 1.27 1.27)) (justify left))
    )
    (property "TOLERANCE" "10%" (at 74.93 60.96 0)
      (effects (font (size 1.27 1.27)) hide)
    )
    (property "RATING" "50V" (at 67.31 66.675 0)
      (effects (font (size 1.27 1.27)) (justify left))
    )
    (pin "1" (uuid c7a97752-6091-4e24-821a-d3dd09d49c58))
    (pin "2" (uuid b0ef0c12-9633-40c0-9aa8-d3b011e6e0d4))
    (instances
      (project "stackable-powermodule"
        (path "/861a7ead-61a9-46ce-a25a-a861ee2f3ddf/fb8817c8-859c-4f5b-ac0e-47d071507085"
          (reference "C201") (unit 1)
        )
      )
    )
  )

  (symbol (lib_id "power:GND") (at 54.61 74.93 0) (unit 1)
    (in_bom yes) (on_board yes) (dnp no) (fields_autoplaced)
    (uuid bc93ebb9-af0e-416e-afd3-9c5583d6ab19)
    (property "Reference" "#PWR0201" (at 54.61 81.28 0)
      (effects (font (size 1.27 1.27)) hide)
    )
    (property "Value" "GND" (at 54.61 78.74 0)
      (effects (font (size 1.27 1.27)))
    )
    (property "Footprint" "" (at 54.61 74.93 0)
      (effects (font (size 1.27 1.27)) hide)
    )
    (property "Datasheet" "" (at 54.61 74.93 0)
      (effects (font (size 1.27 1.27)) hide)
    )
    (pin "1" (uuid adbbfb71-a7c2-4bcb-b145-a7ee62a356f1))
    (instances
      (project "stackable-powermodule"
        (path "/861a7ead-61a9-46ce-a25a-a861ee2f3ddf/fb8817c8-859c-4f5b-ac0e-47d071507085"
          (reference "#PWR0201") (unit 1)
        )
      )
    )
  )

  (symbol (lib_id "searchwing_components:1uH_10.8A_12.1mOhm") (at 81.28 46.99 90) (unit 1)
    (in_bom yes) (on_board yes) (dnp no) (fields_autoplaced)
    (uuid d3aeb4bf-e683-40f4-967f-a14c67b2ba1d)
    (property "Reference" "L201" (at 81.28 40.64 90)
      (effects (font (size 1.27 1.27)))
    )
    (property "Value" "1uH_10.8A_12.1mOhm" (at 83.185 59.69 0)
      (effects (font (size 1.27 1.27)) hide)
    )
    (property "Footprint" "searchwing_components:IHLP2020CZER1R0M8A" (at 68.58 46.99 0)
      (effects (font (size 1.27 1.27)) hide)
    )
    (property "Datasheet" "https://www.vishay.com/docs/34563/ihlp-2020cz-8a.pdf" (at 66.04 46.99 0)
      (effects (font (size 1.27 1.27)) hide)
    )
    (property "Mouser" "https://www.mouser.de/ProductDetail/Vishay-Dale/IHLP2020CZER1R0M8A?qs=sGAEpiMZZMv126LJFLh8y6Xt5bZaT3kdwCMocolCyfU%3D" (at 63.5 43.18 0)
      (effects (font (size 1.27 1.27)) hide)
    )
    (property "Digikey" "https://www.digikey.de/de/products/detail/vishay-dale/IHLP2020CZER1R0M8A/13985220?s=N4IgTCBcDaIJIAkAyAFMAGDBhAWgUQCUBGA9AWQA4BBEAXQF8g" (at 60.96 45.72 0)
      (effects (font (size 1.27 1.27)) hide)
    )
    (property "MANUFACTURER" "Vishay / Dale" (at 76.835 55.88 0)
      (effects (font (size 1.27 1.27)) hide)
    )
    (property "MFG_PART_NUMBER" "IHLP2020CZER1R0M8A" (at 57.15 46.99 0)
      (effects (font (size 1.27 1.27)) hide)
    )
    (property "FOOTPRINT_FORMATED" "SMD Inductor" (at 79.375 55.88 0)
      (effects (font (size 1.27 1.27)) hide)
    )
    (property "INDUCTANCE" "1uH" (at 81.28 43.18 90)
      (effects (font (size 1.27 1.27)))
    )
    (property "RATING" "8A" (at 81.28 45.72 90)
      (effects (font (size 1.27 1.27)))
    )
    (pin "1" (uuid 95e696e9-e103-4488-9429-b3e2ea1904ba))
    (pin "2" (uuid c553a83c-df76-4a67-b642-9a71b4c8ced7))
    (instances
      (project "stackable-powermodule"
        (path "/861a7ead-61a9-46ce-a25a-a861ee2f3ddf/fb8817c8-859c-4f5b-ac0e-47d071507085"
          (reference "L201") (unit 1)
        )
      )
    )
  )

  (symbol (lib_id "searchwing_components:2nF2-0603-50V-C0G") (at 99.06 60.96 0) (unit 1)
    (in_bom yes) (on_board yes) (dnp no) (fields_autoplaced)
    (uuid dd267365-587c-4e27-8b2f-f2db9a1bdf50)
    (property "Reference" "C202" (at 102.87 56.515 0)
      (effects (font (size 1.27 1.27)) (justify left))
    )
    (property "Value" "2nF2-0603-50V-C0G" (at 74.295 56.515 0)
      (effects (font (size 1.27 1.27)) (justify left) hide)
    )
    (property "Footprint" "searchwing_components:C_0603_1608Metric" (at 78.74 63.5 0)
      (effects (font (size 1.27 1.27)) hide)
    )
    (property "Datasheet" "~" (at 99.06 60.96 0)
      (effects (font (size 1.27 1.27)) hide)
    )
    (property "Mouser" "https://www.mouser.de/ProductDetail/Samsung-Electro-Mechanics/CL10C222JB8NNNC?qs=X6jEic%2FHinAn%252BGnX4fsk9Q%3D%3D" (at 95.885 36.83 0)
      (effects (font (size 1.27 1.27)) hide)
    )
    (property "MANUFACTURER" "Samsung Electro-Mechanics" (at 102.87 40.005 0)
      (effects (font (size 1.27 1.27)) hide)
    )
    (property "Digikey" "https://www.digikey.de/de/products/detail/samsung-electro-mechanics/CL10C222JB8NNNC/3887418?s=N4IgTCBcDaIMIBkCMAGOYMCkBCAOAcoXCALoC%2BQA" (at 99.06 42.545 0)
      (effects (font (size 1.27 1.27)) hide)
    )
    (property "MFG_PART_NUMBER" "CL10C222JB8NNNC" (at 97.79 44.45 0)
      (effects (font (size 1.27 1.27)) hide)
    )
    (property "FOOTPRINT_FORMATED" "0603" (at 102.87 59.055 0)
      (effects (font (size 1.27 1.27)) (justify left))
    )
    (property "CAPACITY" "2nF2" (at 102.87 61.595 0)
      (effects (font (size 1.27 1.27)) (justify left))
    )
    (property "TYPE" "C0G" (at 102.87 64.135 0)
      (effects (font (size 1.27 1.27)) (justify left))
    )
    (property "TOLERANCE" "5%" (at 109.855 60.325 0)
      (effects (font (size 1.27 1.27)) hide)
    )
    (property "RATING" "50V" (at 102.87 66.675 0)
      (effects (font (size 1.27 1.27)) (justify left))
    )
    (pin "1" (uuid 382f9fa5-3ffc-4a41-9423-feee98f04da7))
    (pin "2" (uuid ab80c782-7a9c-4bcb-a948-db4357f2b6fe))
    (instances
      (project "stackable-powermodule"
        (path "/861a7ead-61a9-46ce-a25a-a861ee2f3ddf/fb8817c8-859c-4f5b-ac0e-47d071507085"
          (reference "C202") (unit 1)
        )
      )
    )
  )

  (symbol (lib_id "searchwing_components:60Ohm@100MHz") (at 114.3 46.99 90) (unit 1)
    (in_bom yes) (on_board yes) (dnp no) (fields_autoplaced)
    (uuid e486a2c2-c926-4c0e-8d17-904bcc5d421f)
    (property "Reference" "L202" (at 114.3 40.64 90)
      (effects (font (size 1.27 1.27)))
    )
    (property "Value" "60Ohm@100MHz" (at 114.3 43.18 90)
      (effects (font (size 1.27 1.27)))
    )
    (property "Footprint" "searchwing_components:BLM41PG102SH1L" (at 101.6 46.99 0)
      (effects (font (size 0 0)) hide)
    )
    (property "Datasheet" "https://www.murata.com/en-eu/products/productdata/8796740681758/QNFA9106.pdf" (at 99.06 46.99 0)
      (effects (font (size 0 0)) hide)
    )
    (property "Mouser" "https://www.mouser.de/ProductDetail/Murata-Electronics/BLM41PG600SH1L?qs=4yPICbTHszSmAPhNSgdtbw%3D%3D&gclid=CjwKCAiAhKycBhAQEiwAgf19ej1eoplzwX7tJFgMt24KAzdw6yVph3jDWk4oFR1AMr30MIpluRgX6RoCBeYQAvD_BwE" (at 96.52 43.18 0)
      (effects (font (size 1.27 1.27)) hide)
    )
    (property "Digikey" "https://www.digikey.de/de/products/detail/murata-electronics/BLM41PG600SH1L/2588144?s=N4IgTCBcDaIEIBkCyAWAjABQOIDYAMeAygBJoIgC6AvkA" (at 93.98 45.72 0)
      (effects (font (size 1.27 1.27)) hide)
    )
    (property "MFG_PART_NUMBER" "BLM41PG600SH1L" (at 90.17 46.99 0)
      (effects (font (size 1.27 1.27)) hide)
    )
    (property "FOOTPRINT_FORMATED" "1806 SMD Ferrite Bead" (at 114.3 57.15 90)
      (effects (font (size 1.27 1.27)) hide)
    )
    (property "MANUFACTURER" "Murata Electronics" (at 113.665 59.055 90)
      (effects (font (size 1.27 1.27)) hide)
    )
    (property "RATING" "6A" (at 114.3 45.72 90)
      (effects (font (size 1.27 1.27)))
    )
    (pin "1" (uuid ab946507-cc7b-4e8f-8daf-be47d762930d))
    (pin "2" (uuid bab15260-7794-4d16-a391-6c41342f816c))
    (instances
      (project "stackable-powermodule"
        (path "/861a7ead-61a9-46ce-a25a-a861ee2f3ddf/fb8817c8-859c-4f5b-ac0e-47d071507085"
          (reference "L202") (unit 1)
        )
      )
    )
  )
)
