testid,clienttxpower,bandwidth,channel,short_preamble,retrys,distance,iperf_args
18,30,5,11,0,9,20150,-u
19,30,5,11,0,9,20150,
20,30,5,11,0,9,20650,-u
21,30,5,11,0,9,20650,
22,30,5,11,0,9,21150,-u
23,30,5,11,0,9,21150,
24,30,5,11,0,9,19150,-u
25,30,5,11,0,9,19150,
