G04 #@! TF.GenerationSoftware,KiCad,Pcbnew,6.0.9+dfsg-1~bpo11+1*
G04 #@! TF.CreationDate,2022-12-11T17:58:39+00:00*
G04 #@! TF.ProjectId,rpi-hat,7270692d-6861-4742-9e6b-696361645f70,rev?*
G04 #@! TF.SameCoordinates,Original*
G04 #@! TF.FileFunction,Copper,L2,Bot*
G04 #@! TF.FilePolarity,Positive*
%FSLAX46Y46*%
G04 Gerber Fmt 4.6, Leading zero omitted, Abs format (unit mm)*
G04 Created by KiCad (PCBNEW 6.0.9+dfsg-1~bpo11+1) date 2022-12-11 17:58:39*
%MOMM*%
%LPD*%
G01*
G04 APERTURE LIST*
G04 #@! TA.AperFunction,ComponentPad*
%ADD10C,1.600000*%
G04 #@! TD*
G04 #@! TA.AperFunction,ComponentPad*
%ADD11O,1.600000X1.600000*%
G04 #@! TD*
G04 #@! TA.AperFunction,ComponentPad*
%ADD12R,1.500000X1.500000*%
G04 #@! TD*
G04 #@! TA.AperFunction,ComponentPad*
%ADD13C,1.500000*%
G04 #@! TD*
G04 #@! TA.AperFunction,SMDPad,CuDef*
%ADD14R,1.000000X3.000000*%
G04 #@! TD*
G04 #@! TA.AperFunction,ViaPad*
%ADD15C,0.800000*%
G04 #@! TD*
G04 #@! TA.AperFunction,Conductor*
%ADD16C,0.254000*%
G04 #@! TD*
G04 #@! TA.AperFunction,Conductor*
%ADD17C,0.508000*%
G04 #@! TD*
G04 APERTURE END LIST*
D10*
X114935000Y-100867000D03*
D11*
X114935000Y-98327000D03*
D12*
X119507000Y-103632000D03*
D13*
X119507000Y-101092000D03*
X119507000Y-98552000D03*
X119507000Y-96012000D03*
D14*
X90932000Y-102342000D03*
X90932000Y-97302000D03*
X93472000Y-102342000D03*
X93472000Y-97302000D03*
X96012000Y-102342000D03*
X96012000Y-97302000D03*
X98552000Y-102342000D03*
X98552000Y-97302000D03*
X101092000Y-102342000D03*
X101092000Y-97302000D03*
X103632000Y-102342000D03*
X103632000Y-97302000D03*
X106172000Y-102342000D03*
X106172000Y-97302000D03*
X108712000Y-102342000D03*
X108712000Y-97302000D03*
D15*
X90932000Y-103708200D03*
X97282000Y-99314000D03*
X104775000Y-97282000D03*
X97282000Y-97028000D03*
X99949000Y-100584000D03*
X97282000Y-98171000D03*
X102235000Y-102108000D03*
X102235000Y-100965000D03*
X102235000Y-103251000D03*
X113284000Y-99568000D03*
X92202000Y-101854000D03*
X93472000Y-99822000D03*
X94361000Y-99187000D03*
X90932000Y-99568000D03*
X92202000Y-96266000D03*
X94615000Y-100330000D03*
X92202000Y-103124000D03*
X98552000Y-96484500D03*
X102362000Y-96139000D03*
X109982000Y-96647000D03*
X110109000Y-103378000D03*
X107271502Y-101473000D03*
X103977500Y-99637214D03*
X107569000Y-96520000D03*
X105072498Y-101064500D03*
X112368137Y-99968251D03*
D16*
X90932000Y-103708200D02*
X90932000Y-102342000D01*
D17*
X104775000Y-97282000D02*
X106152000Y-97282000D01*
X106152000Y-97282000D02*
X106172000Y-97302000D01*
D16*
X113284000Y-99568000D02*
X115951000Y-99568000D01*
X115951000Y-99568000D02*
X119507000Y-96012000D01*
X98552000Y-96484500D02*
X98552000Y-97302000D01*
X102255000Y-96139000D02*
X101092000Y-97302000D01*
X102362000Y-96139000D02*
X102255000Y-96139000D01*
X109601000Y-99822000D02*
X104902000Y-99822000D01*
X103632000Y-101092000D02*
X103632000Y-102342000D01*
X110236000Y-96901000D02*
X110236000Y-99187000D01*
X109982000Y-96647000D02*
X110236000Y-96901000D01*
X110236000Y-99187000D02*
X109601000Y-99822000D01*
X104902000Y-99822000D02*
X103632000Y-101092000D01*
X109538511Y-104168511D02*
X106708511Y-104168511D01*
X110109000Y-103598022D02*
X109538511Y-104168511D01*
X110109000Y-103378000D02*
X110109000Y-103598022D01*
X106172000Y-103632000D02*
X106172000Y-102342000D01*
X106708511Y-104168511D02*
X106172000Y-103632000D01*
X107271502Y-101473000D02*
X107843000Y-101473000D01*
X107843000Y-101473000D02*
X108712000Y-102342000D01*
X107930000Y-96520000D02*
X108712000Y-97302000D01*
X104427714Y-99187000D02*
X108712000Y-99187000D01*
X108712000Y-99187000D02*
X108712000Y-97302000D01*
X107569000Y-96520000D02*
X107930000Y-96520000D01*
X103977500Y-99637214D02*
X104427714Y-99187000D01*
X112368137Y-99968251D02*
X112006388Y-100330000D01*
X105530978Y-100330000D02*
X105072498Y-100788480D01*
X112006388Y-100330000D02*
X105530978Y-100330000D01*
X105072498Y-100788480D02*
X105072498Y-101064500D01*
G04 #@! TA.AperFunction,Conductor*
G36*
X94828191Y-95469407D02*
G01*
X94864155Y-95518907D01*
X94869000Y-95549500D01*
X94869000Y-99568000D01*
X95913000Y-99568000D01*
X95971191Y-99586907D01*
X96007155Y-99636407D01*
X96012000Y-99667000D01*
X96012000Y-100542500D01*
X95993093Y-100600691D01*
X95943593Y-100636655D01*
X95913000Y-100641500D01*
X95492252Y-100641500D01*
X95466005Y-100646721D01*
X95443334Y-100651230D01*
X95443332Y-100651231D01*
X95433769Y-100653133D01*
X95367448Y-100697448D01*
X95323133Y-100763769D01*
X95311500Y-100822252D01*
X95311500Y-103861748D01*
X95323133Y-103920231D01*
X95367448Y-103986552D01*
X95433769Y-104030867D01*
X95443332Y-104032769D01*
X95443334Y-104032770D01*
X95466005Y-104037279D01*
X95492252Y-104042500D01*
X95913000Y-104042500D01*
X95971191Y-104061407D01*
X96007155Y-104110907D01*
X96012000Y-104141500D01*
X96012000Y-104221500D01*
X95993093Y-104279691D01*
X95943593Y-104315655D01*
X95913000Y-104320500D01*
X91412109Y-104320500D01*
X91353918Y-104301593D01*
X91317954Y-104252093D01*
X91317954Y-104190907D01*
X91351842Y-104142958D01*
X91360282Y-104136482D01*
X91406228Y-104076604D01*
X91456652Y-104041948D01*
X91465455Y-104039774D01*
X91472940Y-104038285D01*
X91500666Y-104032770D01*
X91500668Y-104032769D01*
X91510231Y-104030867D01*
X91576552Y-103986552D01*
X91620867Y-103920231D01*
X91632500Y-103861748D01*
X92771500Y-103861748D01*
X92783133Y-103920231D01*
X92827448Y-103986552D01*
X92893769Y-104030867D01*
X92903332Y-104032769D01*
X92903334Y-104032770D01*
X92926005Y-104037279D01*
X92952252Y-104042500D01*
X93991748Y-104042500D01*
X94017995Y-104037279D01*
X94040666Y-104032770D01*
X94040668Y-104032769D01*
X94050231Y-104030867D01*
X94116552Y-103986552D01*
X94160867Y-103920231D01*
X94172500Y-103861748D01*
X94172500Y-100822252D01*
X94160867Y-100763769D01*
X94116552Y-100697448D01*
X94050231Y-100653133D01*
X94040668Y-100651231D01*
X94040666Y-100651230D01*
X94017995Y-100646721D01*
X93991748Y-100641500D01*
X92952252Y-100641500D01*
X92926005Y-100646721D01*
X92903334Y-100651230D01*
X92903332Y-100651231D01*
X92893769Y-100653133D01*
X92827448Y-100697448D01*
X92783133Y-100763769D01*
X92771500Y-100822252D01*
X92771500Y-103861748D01*
X91632500Y-103861748D01*
X91632500Y-100822252D01*
X91620867Y-100763769D01*
X91576552Y-100697448D01*
X91510231Y-100653133D01*
X91500668Y-100651231D01*
X91500666Y-100651230D01*
X91477995Y-100646721D01*
X91451748Y-100641500D01*
X90412252Y-100641500D01*
X90386005Y-100646721D01*
X90363334Y-100651230D01*
X90363332Y-100651231D01*
X90353769Y-100653133D01*
X90287448Y-100697448D01*
X90243133Y-100763769D01*
X90231500Y-100822252D01*
X90231500Y-103861748D01*
X90243133Y-103920231D01*
X90287448Y-103986552D01*
X90353769Y-104030867D01*
X90363332Y-104032769D01*
X90363334Y-104032770D01*
X90391060Y-104038285D01*
X90398543Y-104039773D01*
X90451927Y-104069669D01*
X90457771Y-104076603D01*
X90503718Y-104136482D01*
X90512158Y-104142958D01*
X90546814Y-104193381D01*
X90545213Y-104254545D01*
X90507967Y-104303087D01*
X90451891Y-104320500D01*
X89453500Y-104320500D01*
X89395309Y-104301593D01*
X89359345Y-104252093D01*
X89354500Y-104221500D01*
X89354500Y-95549500D01*
X89373407Y-95491309D01*
X89422907Y-95455345D01*
X89453500Y-95450500D01*
X94770000Y-95450500D01*
X94828191Y-95469407D01*
G37*
G04 #@! TD.AperFunction*
G04 #@! TA.AperFunction,Conductor*
G36*
X97948999Y-95469407D02*
G01*
X97984963Y-95518907D01*
X97984963Y-95580093D01*
X97945810Y-95631815D01*
X97907448Y-95657448D01*
X97863133Y-95723769D01*
X97861231Y-95733332D01*
X97861230Y-95733334D01*
X97858249Y-95748322D01*
X97851500Y-95782252D01*
X97851500Y-98821748D01*
X97863133Y-98880231D01*
X97907448Y-98946552D01*
X97973769Y-98990867D01*
X97983332Y-98992769D01*
X97983334Y-98992770D01*
X98006005Y-98997279D01*
X98032252Y-99002500D01*
X99071748Y-99002500D01*
X99097995Y-98997279D01*
X99120666Y-98992770D01*
X99120668Y-98992769D01*
X99130231Y-98990867D01*
X99196552Y-98946552D01*
X99240867Y-98880231D01*
X99252500Y-98821748D01*
X99252500Y-95782252D01*
X99245751Y-95748322D01*
X99242770Y-95733334D01*
X99242769Y-95733332D01*
X99240867Y-95723769D01*
X99196552Y-95657448D01*
X99158190Y-95631815D01*
X99120311Y-95583765D01*
X99117909Y-95522627D01*
X99151902Y-95471753D01*
X99213192Y-95450500D01*
X100430808Y-95450500D01*
X100488999Y-95469407D01*
X100524963Y-95518907D01*
X100524963Y-95580093D01*
X100485810Y-95631815D01*
X100447448Y-95657448D01*
X100403133Y-95723769D01*
X100401231Y-95733332D01*
X100401230Y-95733334D01*
X100398249Y-95748322D01*
X100391500Y-95782252D01*
X100391500Y-98821748D01*
X100403133Y-98880231D01*
X100447448Y-98946552D01*
X100513769Y-98990867D01*
X100523332Y-98992769D01*
X100523334Y-98992770D01*
X100546005Y-98997279D01*
X100572252Y-99002500D01*
X101611748Y-99002500D01*
X101637995Y-98997279D01*
X101660666Y-98992770D01*
X101660668Y-98992769D01*
X101670231Y-98990867D01*
X101736552Y-98946552D01*
X101780867Y-98880231D01*
X101792500Y-98821748D01*
X101792500Y-97105662D01*
X101811407Y-97047471D01*
X101821496Y-97035658D01*
X101938996Y-96918158D01*
X101993513Y-96890381D01*
X102053945Y-96899952D01*
X102097210Y-96943217D01*
X102108000Y-96988162D01*
X102108000Y-100457000D01*
X102517000Y-100457000D01*
X102575191Y-100475907D01*
X102611155Y-100525407D01*
X102616000Y-100556000D01*
X102616000Y-104169783D01*
X102597093Y-104227974D01*
X102547593Y-104263938D01*
X102518800Y-104268767D01*
X99674380Y-104320484D01*
X99672580Y-104320500D01*
X96316500Y-104320500D01*
X96258309Y-104301593D01*
X96222345Y-104252093D01*
X96217500Y-104221500D01*
X96217500Y-104141500D01*
X96236407Y-104083309D01*
X96285907Y-104047345D01*
X96316500Y-104042500D01*
X96531748Y-104042500D01*
X96557995Y-104037279D01*
X96580666Y-104032770D01*
X96580668Y-104032769D01*
X96590231Y-104030867D01*
X96656552Y-103986552D01*
X96700867Y-103920231D01*
X96712500Y-103861748D01*
X97851500Y-103861748D01*
X97863133Y-103920231D01*
X97907448Y-103986552D01*
X97973769Y-104030867D01*
X97983332Y-104032769D01*
X97983334Y-104032770D01*
X98006005Y-104037279D01*
X98032252Y-104042500D01*
X99071748Y-104042500D01*
X99097995Y-104037279D01*
X99120666Y-104032770D01*
X99120668Y-104032769D01*
X99130231Y-104030867D01*
X99196552Y-103986552D01*
X99240867Y-103920231D01*
X99252500Y-103861748D01*
X99252500Y-100822252D01*
X99240867Y-100763769D01*
X99196552Y-100697448D01*
X99130231Y-100653133D01*
X99120668Y-100651231D01*
X99120666Y-100651230D01*
X99097995Y-100646721D01*
X99071748Y-100641500D01*
X98032252Y-100641500D01*
X98006005Y-100646721D01*
X97983334Y-100651230D01*
X97983332Y-100651231D01*
X97973769Y-100653133D01*
X97907448Y-100697448D01*
X97863133Y-100763769D01*
X97851500Y-100822252D01*
X97851500Y-103861748D01*
X96712500Y-103861748D01*
X96712500Y-100822252D01*
X96700867Y-100763769D01*
X96656552Y-100697448D01*
X96590231Y-100653133D01*
X96580668Y-100651231D01*
X96580666Y-100651230D01*
X96557995Y-100646721D01*
X96531748Y-100641500D01*
X96316500Y-100641500D01*
X96258309Y-100622593D01*
X96222345Y-100573093D01*
X96217500Y-100542500D01*
X96217500Y-99667000D01*
X96214970Y-99634856D01*
X96210125Y-99604263D01*
X96173408Y-99515617D01*
X96137444Y-99466117D01*
X96113203Y-99438372D01*
X96034693Y-99391464D01*
X95976502Y-99372557D01*
X95972658Y-99371948D01*
X95972653Y-99371947D01*
X95916848Y-99363109D01*
X95916843Y-99363109D01*
X95913000Y-99362500D01*
X95852183Y-99362500D01*
X95793992Y-99343593D01*
X95758028Y-99294093D01*
X95753211Y-99261144D01*
X95757627Y-99075675D01*
X95757627Y-99075674D01*
X95758000Y-99060000D01*
X95173500Y-99060000D01*
X95115309Y-99041093D01*
X95079345Y-98991593D01*
X95074500Y-98961000D01*
X95074500Y-95549500D01*
X95093407Y-95491309D01*
X95142907Y-95455345D01*
X95173500Y-95450500D01*
X97890808Y-95450500D01*
X97948999Y-95469407D01*
G37*
G04 #@! TD.AperFunction*
M02*
