%!PS-Adobe-3.0
%%Creator: PCBNEW
%%CreationDate: Thu Mar 23 00:16:54 2023
%%Title: ()
%%Pages: 1
%%PageOrder: Ascend
%%BoundingBox: 0 0 596 842
%%DocumentMedia: A4 595 842 0 () ()
%%Orientation: Landscape
%%EndComments
%%BeginProlog
/line { newpath moveto lineto stroke } bind def
/cir0 { newpath 0 360 arc stroke } bind def
/cir1 { newpath 0 360 arc gsave fill grestore stroke } bind def
/cir2 { newpath 0 360 arc gsave fill grestore stroke } bind def
/arc0 { newpath arc stroke } bind def
/arc1 { newpath 4 index 4 index moveto arc closepath gsave fill
    grestore stroke } bind def
/arc2 { newpath 4 index 4 index moveto arc closepath gsave fill
    grestore stroke } bind def
/poly0 { stroke } bind def
/poly1 { closepath gsave fill grestore stroke } bind def
/poly2 { closepath gsave fill grestore stroke } bind def
/rect0 { rectstroke } bind def
/rect1 { rectfill } bind def
/rect2 { rectfill } bind def
/linemode0 { 0 setlinecap 0 setlinejoin 0 setlinewidth } bind def
/linemode1 { 1 setlinecap 1 setlinejoin } bind def
/dashedline { [200] 100 setdash } bind def
/solidline { [] 0 setdash } bind def
/phantomshow { moveto
    /KicadFont findfont 0.000001 scalefont setfont
    show } bind def
/textshow { gsave
    findfont exch scalefont setfont concat 1 scale 0 0 moveto show
    } bind def
/reencodefont {
  findfont dup length dict begin
  { 1 index /FID ne
    { def }
    { pop pop } ifelse
  } forall
  /Encoding ISOLatin1Encoding def
  currentdict
  end } bind def
/KicadFont /Helvetica reencodefont definefont pop
/KicadFont-Bold /Helvetica-Bold reencodefont definefont pop
/KicadFont-Oblique /Helvetica-Oblique reencodefont definefont pop
/KicadFont-BoldOblique /Helvetica-BoldOblique reencodefont definefont pop
%%EndProlog
%Page: (1) 1
%%BeginPageSetup
gsave
0.0072 0.0072 scale
linemode1
82680 0 translate 90 rotate
236.22 setlinewidth
%%EndPageSetup
0 0 0 setrgbcolor
118.11 setlinewidth
newpath
44365 52401 moveto
44365 63351 lineto
stroke
0 0 0 setrgbcolor
newpath
72565 52401 moveto
44365 52401 lineto
stroke
0 0 0 setrgbcolor
newpath
44365 63351 moveto
72565 63351 lineto
stroke
0 0 0 setrgbcolor
newpath
72565 52401 moveto
72565 63351 lineto
stroke
236.22 setlinewidth
47.2441 setlinewidth
newpath
46228.8 61637.2 moveto
46701.2 61164.8 lineto
stroke
newpath
46701.2 61637.2 moveto
46228.8 61164.8 lineto
stroke
newpath
46228.8 53987.2 moveto
46701.2 53514.8 lineto
stroke
newpath
46701.2 53987.2 moveto
46228.8 53514.8 lineto
stroke
newpath
47728.8 61487.2 moveto
48201.2 61014.8 lineto
stroke
newpath
48201.2 61487.2 moveto
47728.8 61014.8 lineto
stroke
newpath
47878.8 60287.2 moveto
48351.2 59814.8 lineto
stroke
newpath
48351.2 60287.2 moveto
47878.8 59814.8 lineto
stroke
newpath
47878.8 58787.2 moveto
48351.2 58314.8 lineto
stroke
newpath
48351.2 58787.2 moveto
47878.8 58314.8 lineto
stroke
newpath
47878.8 57287.2 moveto
48351.2 56814.8 lineto
stroke
newpath
48351.2 57287.2 moveto
47878.8 56814.8 lineto
stroke
newpath
47878.8 55787.2 moveto
48351.2 55314.8 lineto
stroke
newpath
48351.2 55787.2 moveto
47878.8 55314.8 lineto
stroke
newpath
49228.8 61138.2 moveto
49701.2 60665.8 lineto
stroke
newpath
49701.2 61138.2 moveto
49228.8 60665.8 lineto
stroke
newpath
50728.8 57287.2 moveto
51201.2 56814.8 lineto
stroke
newpath
51201.2 57287.2 moveto
50728.8 56814.8 lineto
stroke
newpath
50728.8 56087.2 moveto
51201.2 55614.8 lineto
stroke
newpath
51201.2 56087.2 moveto
50728.8 55614.8 lineto
stroke
newpath
53728.8 58637.2 moveto
54201.2 58164.8 lineto
stroke
newpath
54201.2 58637.2 moveto
53728.8 58164.8 lineto
stroke
newpath
53728.8 57437.2 moveto
54201.2 56964.8 lineto
stroke
newpath
54201.2 57437.2 moveto
53728.8 56964.8 lineto
stroke
newpath
56728.8 61787.2 moveto
57201.2 61314.8 lineto
stroke
newpath
57201.2 61787.2 moveto
56728.8 61314.8 lineto
stroke
newpath
56728.8 60287.2 moveto
57201.2 59814.8 lineto
stroke
newpath
57201.2 60287.2 moveto
56728.8 59814.8 lineto
stroke
newpath
65128.8 58487.2 moveto
65601.2 58014.8 lineto
stroke
newpath
65601.2 58487.2 moveto
65128.8 58014.8 lineto
stroke
newpath
67678.8 57437.2 moveto
68151.2 56964.8 lineto
stroke
newpath
68151.2 57437.2 moveto
67678.8 56964.8 lineto
stroke
newpath
69790.6 59125 moveto
70263 58652.6 lineto
stroke
newpath
70263 59125 moveto
69790.6 58652.6 lineto
stroke
newpath
70692.3 56873.1 moveto
71164.7 56400.6 lineto
stroke
newpath
71164.7 56873.1 moveto
70692.3 56400.6 lineto
stroke
236.22 setlinewidth
78.7406 setlinewidth
0 0 0 setrgbcolor
0 0 0 setrgbcolor
newpath
45280.8 51186.5 moveto
45280.8 51973.9 lineto
stroke
newpath
45280.8 51973.9 moveto
45468.3 51973.9 lineto
stroke
newpath
45468.3 51973.9 moveto
45580.8 51936.4 lineto
stroke
newpath
45580.8 51936.4 moveto
45655.8 51861.4 lineto
stroke
newpath
45655.8 51861.4 moveto
45693.3 51786.5 lineto
stroke
newpath
45693.3 51786.5 moveto
45730.8 51636.5 lineto
stroke
newpath
45730.8 51636.5 moveto
45730.8 51524 lineto
stroke
newpath
45730.8 51524 moveto
45693.3 51374 lineto
stroke
newpath
45693.3 51374 moveto
45655.8 51299 lineto
stroke
newpath
45655.8 51299 moveto
45580.8 51224 lineto
stroke
newpath
45580.8 51224 moveto
45468.3 51186.5 lineto
stroke
newpath
45468.3 51186.5 moveto
45280.8 51186.5 lineto
stroke
newpath
46068.2 51186.5 moveto
46068.2 51711.5 lineto
stroke
newpath
46068.2 51561.5 moveto
46105.7 51636.5 lineto
stroke
newpath
46105.7 51636.5 moveto
46143.2 51674 lineto
stroke
newpath
46143.2 51674 moveto
46218.2 51711.5 lineto
stroke
newpath
46218.2 51711.5 moveto
46293.2 51711.5 lineto
stroke
newpath
46555.7 51186.5 moveto
46555.7 51711.5 lineto
stroke
newpath
46555.7 51973.9 moveto
46518.2 51936.4 lineto
stroke
newpath
46518.2 51936.4 moveto
46555.7 51898.9 lineto
stroke
newpath
46555.7 51898.9 moveto
46593.2 51936.4 lineto
stroke
newpath
46593.2 51936.4 moveto
46555.7 51973.9 lineto
stroke
newpath
46555.7 51973.9 moveto
46555.7 51898.9 lineto
stroke
newpath
47043.1 51186.5 moveto
46968.1 51224 lineto
stroke
newpath
46968.1 51224 moveto
46930.6 51299 lineto
stroke
newpath
46930.6 51299 moveto
46930.6 51973.9 lineto
stroke
newpath
47455.6 51186.5 moveto
47380.6 51224 lineto
stroke
newpath
47380.6 51224 moveto
47343.1 51299 lineto
stroke
newpath
47343.1 51299 moveto
47343.1 51973.9 lineto
stroke
newpath
48228 51186.5 moveto
48228 51973.9 lineto
stroke
newpath
48228 51973.9 moveto
48490.4 51411.5 lineto
stroke
newpath
48490.4 51411.5 moveto
48752.9 51973.9 lineto
stroke
newpath
48752.9 51973.9 moveto
48752.9 51186.5 lineto
stroke
newpath
49465.3 51186.5 moveto
49465.3 51599 lineto
stroke
newpath
49465.3 51599 moveto
49427.8 51674 lineto
stroke
newpath
49427.8 51674 moveto
49352.8 51711.5 lineto
stroke
newpath
49352.8 51711.5 moveto
49202.8 51711.5 lineto
stroke
newpath
49202.8 51711.5 moveto
49127.8 51674 lineto
stroke
newpath
49465.3 51224 moveto
49390.3 51186.5 lineto
stroke
newpath
49390.3 51186.5 moveto
49202.8 51186.5 lineto
stroke
newpath
49202.8 51186.5 moveto
49127.8 51224 lineto
stroke
newpath
49127.8 51224 moveto
49090.3 51299 lineto
stroke
newpath
49090.3 51299 moveto
49090.3 51374 lineto
stroke
newpath
49090.3 51374 moveto
49127.8 51449 lineto
stroke
newpath
49127.8 51449 moveto
49202.8 51486.5 lineto
stroke
newpath
49202.8 51486.5 moveto
49390.3 51486.5 lineto
stroke
newpath
49390.3 51486.5 moveto
49465.3 51524 lineto
stroke
newpath
49840.3 51711.5 moveto
49840.3 50924.1 lineto
stroke
newpath
49840.3 51674 moveto
49915.2 51711.5 lineto
stroke
newpath
49915.2 51711.5 moveto
50065.2 51711.5 lineto
stroke
newpath
50065.2 51711.5 moveto
50140.2 51674 lineto
stroke
newpath
50140.2 51674 moveto
50177.7 51636.5 lineto
stroke
newpath
50177.7 51636.5 moveto
50215.2 51561.5 lineto
stroke
newpath
50215.2 51561.5 moveto
50215.2 51336.5 lineto
stroke
newpath
50215.2 51336.5 moveto
50177.7 51261.5 lineto
stroke
newpath
50177.7 51261.5 moveto
50140.2 51224 lineto
stroke
newpath
50140.2 51224 moveto
50065.2 51186.5 lineto
stroke
newpath
50065.2 51186.5 moveto
49915.2 51186.5 lineto
stroke
newpath
49915.2 51186.5 moveto
49840.3 51224 lineto
stroke
newpath
50552.7 51261.5 moveto
50590.2 51224 lineto
stroke
newpath
50590.2 51224 moveto
50552.7 51186.5 lineto
stroke
newpath
50552.7 51186.5 moveto
50515.2 51224 lineto
stroke
newpath
50515.2 51224 moveto
50552.7 51261.5 lineto
stroke
newpath
50552.7 51261.5 moveto
50552.7 51186.5 lineto
stroke
newpath
50552.7 51674 moveto
50590.2 51636.5 lineto
stroke
newpath
50590.2 51636.5 moveto
50552.7 51599 lineto
stroke
newpath
50552.7 51599 moveto
50515.2 51636.5 lineto
stroke
newpath
50515.2 51636.5 moveto
50552.7 51674 lineto
stroke
newpath
50552.7 51674 moveto
50552.7 51599 lineto
stroke
47.2441 setlinewidth
newpath
43833.5 50058.5 moveto
44305.9 49586 lineto
stroke
newpath
44305.9 50058.5 moveto
43833.5 49586 lineto
stroke
236.22 setlinewidth
78.7406 setlinewidth
0 0 0 setrgbcolor
0 0 0 setrgbcolor
newpath
45430.8 50320.4 moveto
45505.8 50320.4 lineto
stroke
newpath
45505.8 50320.4 moveto
45580.8 50282.9 lineto
stroke
newpath
45580.8 50282.9 moveto
45618.3 50245.4 lineto
stroke
newpath
45618.3 50245.4 moveto
45655.8 50170.4 lineto
stroke
newpath
45655.8 50170.4 moveto
45693.3 50020.4 lineto
stroke
newpath
45693.3 50020.4 moveto
45693.3 49832.9 lineto
stroke
newpath
45693.3 49832.9 moveto
45655.8 49683 lineto
stroke
newpath
45655.8 49683 moveto
45618.3 49608 lineto
stroke
newpath
45618.3 49608 moveto
45580.8 49570.5 lineto
stroke
newpath
45580.8 49570.5 moveto
45505.8 49533 lineto
stroke
newpath
45505.8 49533 moveto
45430.8 49533 lineto
stroke
newpath
45430.8 49533 moveto
45355.8 49570.5 lineto
stroke
newpath
45355.8 49570.5 moveto
45318.3 49608 lineto
stroke
newpath
45318.3 49608 moveto
45280.8 49683 lineto
stroke
newpath
45280.8 49683 moveto
45243.3 49832.9 lineto
stroke
newpath
45243.3 49832.9 moveto
45243.3 50020.4 lineto
stroke
newpath
45243.3 50020.4 moveto
45280.8 50170.4 lineto
stroke
newpath
45280.8 50170.4 moveto
45318.3 50245.4 lineto
stroke
newpath
45318.3 50245.4 moveto
45355.8 50282.9 lineto
stroke
newpath
45355.8 50282.9 moveto
45430.8 50320.4 lineto
stroke
newpath
46030.7 49608 moveto
46068.2 49570.5 lineto
stroke
newpath
46068.2 49570.5 moveto
46030.7 49533 lineto
stroke
newpath
46030.7 49533 moveto
45993.2 49570.5 lineto
stroke
newpath
45993.2 49570.5 moveto
46030.7 49608 lineto
stroke
newpath
46030.7 49608 moveto
46030.7 49533 lineto
stroke
newpath
46743.1 50057.9 moveto
46743.1 49533 lineto
stroke
newpath
46555.7 50357.9 moveto
46368.2 49795.4 lineto
stroke
newpath
46368.2 49795.4 moveto
46855.6 49795.4 lineto
stroke
newpath
47305.6 50320.4 moveto
47380.6 50320.4 lineto
stroke
newpath
47380.6 50320.4 moveto
47455.6 50282.9 lineto
stroke
newpath
47455.6 50282.9 moveto
47493 50245.4 lineto
stroke
newpath
47493 50245.4 moveto
47530.5 50170.4 lineto
stroke
newpath
47530.5 50170.4 moveto
47568 50020.4 lineto
stroke
newpath
47568 50020.4 moveto
47568 49832.9 lineto
stroke
newpath
47568 49832.9 moveto
47530.5 49683 lineto
stroke
newpath
47530.5 49683 moveto
47493 49608 lineto
stroke
newpath
47493 49608 moveto
47455.6 49570.5 lineto
stroke
newpath
47455.6 49570.5 moveto
47380.6 49533 lineto
stroke
newpath
47380.6 49533 moveto
47305.6 49533 lineto
stroke
newpath
47305.6 49533 moveto
47230.6 49570.5 lineto
stroke
newpath
47230.6 49570.5 moveto
47193.1 49608 lineto
stroke
newpath
47193.1 49608 moveto
47155.6 49683 lineto
stroke
newpath
47155.6 49683 moveto
47118.1 49832.9 lineto
stroke
newpath
47118.1 49832.9 moveto
47118.1 50020.4 lineto
stroke
newpath
47118.1 50020.4 moveto
47155.6 50170.4 lineto
stroke
newpath
47155.6 50170.4 moveto
47193.1 50245.4 lineto
stroke
newpath
47193.1 50245.4 moveto
47230.6 50282.9 lineto
stroke
newpath
47230.6 50282.9 moveto
47305.6 50320.4 lineto
stroke
newpath
48055.5 50320.4 moveto
48130.5 50320.4 lineto
stroke
newpath
48130.5 50320.4 moveto
48205.5 50282.9 lineto
stroke
newpath
48205.5 50282.9 moveto
48243 50245.4 lineto
stroke
newpath
48243 50245.4 moveto
48280.4 50170.4 lineto
stroke
newpath
48280.4 50170.4 moveto
48317.9 50020.4 lineto
stroke
newpath
48317.9 50020.4 moveto
48317.9 49832.9 lineto
stroke
newpath
48317.9 49832.9 moveto
48280.4 49683 lineto
stroke
newpath
48280.4 49683 moveto
48243 49608 lineto
stroke
newpath
48243 49608 moveto
48205.5 49570.5 lineto
stroke
newpath
48205.5 49570.5 moveto
48130.5 49533 lineto
stroke
newpath
48130.5 49533 moveto
48055.5 49533 lineto
stroke
newpath
48055.5 49533 moveto
47980.5 49570.5 lineto
stroke
newpath
47980.5 49570.5 moveto
47943 49608 lineto
stroke
newpath
47943 49608 moveto
47905.5 49683 lineto
stroke
newpath
47905.5 49683 moveto
47868 49832.9 lineto
stroke
newpath
47868 49832.9 moveto
47868 50020.4 lineto
stroke
newpath
47868 50020.4 moveto
47905.5 50170.4 lineto
stroke
newpath
47905.5 50170.4 moveto
47943 50245.4 lineto
stroke
newpath
47943 50245.4 moveto
47980.5 50282.9 lineto
stroke
newpath
47980.5 50282.9 moveto
48055.5 50320.4 lineto
stroke
newpath
48655.4 49533 moveto
48655.4 50057.9 lineto
stroke
newpath
48655.4 49982.9 moveto
48692.9 50020.4 lineto
stroke
newpath
48692.9 50020.4 moveto
48767.9 50057.9 lineto
stroke
newpath
48767.9 50057.9 moveto
48880.4 50057.9 lineto
stroke
newpath
48880.4 50057.9 moveto
48955.4 50020.4 lineto
stroke
newpath
48955.4 50020.4 moveto
48992.9 49945.4 lineto
stroke
newpath
48992.9 49945.4 moveto
48992.9 49533 lineto
stroke
newpath
48992.9 49945.4 moveto
49030.4 50020.4 lineto
stroke
newpath
49030.4 50020.4 moveto
49105.3 50057.9 lineto
stroke
newpath
49105.3 50057.9 moveto
49217.8 50057.9 lineto
stroke
newpath
49217.8 50057.9 moveto
49292.8 50020.4 lineto
stroke
newpath
49292.8 50020.4 moveto
49330.3 49945.4 lineto
stroke
newpath
49330.3 49945.4 moveto
49330.3 49533 lineto
stroke
newpath
49705.3 49533 moveto
49705.3 50057.9 lineto
stroke
newpath
49705.3 49982.9 moveto
49742.8 50020.4 lineto
stroke
newpath
49742.8 50020.4 moveto
49817.8 50057.9 lineto
stroke
newpath
49817.8 50057.9 moveto
49930.2 50057.9 lineto
stroke
newpath
49930.2 50057.9 moveto
50005.2 50020.4 lineto
stroke
newpath
50005.2 50020.4 moveto
50042.7 49945.4 lineto
stroke
newpath
50042.7 49945.4 moveto
50042.7 49533 lineto
stroke
newpath
50042.7 49945.4 moveto
50080.2 50020.4 lineto
stroke
newpath
50080.2 50020.4 moveto
50155.2 50057.9 lineto
stroke
newpath
50155.2 50057.9 moveto
50267.7 50057.9 lineto
stroke
newpath
50267.7 50057.9 moveto
50342.7 50020.4 lineto
stroke
newpath
50342.7 50020.4 moveto
50380.2 49945.4 lineto
stroke
newpath
50380.2 49945.4 moveto
50380.2 49533 lineto
stroke
newpath
51790 50357.9 moveto
51115.1 49345.5 lineto
stroke
newpath
52674.9 50320.4 moveto
52749.9 50320.4 lineto
stroke
newpath
52749.9 50320.4 moveto
52824.9 50282.9 lineto
stroke
newpath
52824.9 50282.9 moveto
52862.4 50245.4 lineto
stroke
newpath
52862.4 50245.4 moveto
52899.9 50170.4 lineto
stroke
newpath
52899.9 50170.4 moveto
52937.4 50020.4 lineto
stroke
newpath
52937.4 50020.4 moveto
52937.4 49832.9 lineto
stroke
newpath
52937.4 49832.9 moveto
52899.9 49683 lineto
stroke
newpath
52899.9 49683 moveto
52862.4 49608 lineto
stroke
newpath
52862.4 49608 moveto
52824.9 49570.5 lineto
stroke
newpath
52824.9 49570.5 moveto
52749.9 49533 lineto
stroke
newpath
52749.9 49533 moveto
52674.9 49533 lineto
stroke
newpath
52674.9 49533 moveto
52599.9 49570.5 lineto
stroke
newpath
52599.9 49570.5 moveto
52562.4 49608 lineto
stroke
newpath
52562.4 49608 moveto
52524.9 49683 lineto
stroke
newpath
52524.9 49683 moveto
52487.4 49832.9 lineto
stroke
newpath
52487.4 49832.9 moveto
52487.4 50020.4 lineto
stroke
newpath
52487.4 50020.4 moveto
52524.9 50170.4 lineto
stroke
newpath
52524.9 50170.4 moveto
52562.4 50245.4 lineto
stroke
newpath
52562.4 50245.4 moveto
52599.9 50282.9 lineto
stroke
newpath
52599.9 50282.9 moveto
52674.9 50320.4 lineto
stroke
newpath
53274.8 49608 moveto
53312.3 49570.5 lineto
stroke
newpath
53312.3 49570.5 moveto
53274.8 49533 lineto
stroke
newpath
53274.8 49533 moveto
53237.3 49570.5 lineto
stroke
newpath
53237.3 49570.5 moveto
53274.8 49608 lineto
stroke
newpath
53274.8 49608 moveto
53274.8 49533 lineto
stroke
newpath
53799.8 50320.4 moveto
53874.8 50320.4 lineto
stroke
newpath
53874.8 50320.4 moveto
53949.7 50282.9 lineto
stroke
newpath
53949.7 50282.9 moveto
53987.2 50245.4 lineto
stroke
newpath
53987.2 50245.4 moveto
54024.7 50170.4 lineto
stroke
newpath
54024.7 50170.4 moveto
54062.2 50020.4 lineto
stroke
newpath
54062.2 50020.4 moveto
54062.2 49832.9 lineto
stroke
newpath
54062.2 49832.9 moveto
54024.7 49683 lineto
stroke
newpath
54024.7 49683 moveto
53987.2 49608 lineto
stroke
newpath
53987.2 49608 moveto
53949.7 49570.5 lineto
stroke
newpath
53949.7 49570.5 moveto
53874.8 49533 lineto
stroke
newpath
53874.8 49533 moveto
53799.8 49533 lineto
stroke
newpath
53799.8 49533 moveto
53724.8 49570.5 lineto
stroke
newpath
53724.8 49570.5 moveto
53687.3 49608 lineto
stroke
newpath
53687.3 49608 moveto
53649.8 49683 lineto
stroke
newpath
53649.8 49683 moveto
53612.3 49832.9 lineto
stroke
newpath
53612.3 49832.9 moveto
53612.3 50020.4 lineto
stroke
newpath
53612.3 50020.4 moveto
53649.8 50170.4 lineto
stroke
newpath
53649.8 50170.4 moveto
53687.3 50245.4 lineto
stroke
newpath
53687.3 50245.4 moveto
53724.8 50282.9 lineto
stroke
newpath
53724.8 50282.9 moveto
53799.8 50320.4 lineto
stroke
newpath
54812.1 49533 moveto
54362.2 49533 lineto
stroke
newpath
54587.2 49533 moveto
54587.2 50320.4 lineto
stroke
newpath
54587.2 50320.4 moveto
54512.2 50207.9 lineto
stroke
newpath
54512.2 50207.9 moveto
54437.2 50132.9 lineto
stroke
newpath
54437.2 50132.9 moveto
54362.2 50095.4 lineto
stroke
newpath
55524.5 50320.4 moveto
55149.6 50320.4 lineto
stroke
newpath
55149.6 50320.4 moveto
55112.1 49945.4 lineto
stroke
newpath
55112.1 49945.4 moveto
55149.6 49982.9 lineto
stroke
newpath
55149.6 49982.9 moveto
55224.6 50020.4 lineto
stroke
newpath
55224.6 50020.4 moveto
55412.1 50020.4 lineto
stroke
newpath
55412.1 50020.4 moveto
55487.1 49982.9 lineto
stroke
newpath
55487.1 49982.9 moveto
55524.5 49945.4 lineto
stroke
newpath
55524.5 49945.4 moveto
55562 49870.4 lineto
stroke
newpath
55562 49870.4 moveto
55562 49683 lineto
stroke
newpath
55562 49683 moveto
55524.5 49608 lineto
stroke
newpath
55524.5 49608 moveto
55487.1 49570.5 lineto
stroke
newpath
55487.1 49570.5 moveto
55412.1 49533 lineto
stroke
newpath
55412.1 49533 moveto
55224.6 49533 lineto
stroke
newpath
55224.6 49533 moveto
55149.6 49570.5 lineto
stroke
newpath
55149.6 49570.5 moveto
55112.1 49608 lineto
stroke
newpath
55824.5 50320.4 moveto
56349.4 50320.4 lineto
stroke
newpath
56349.4 50320.4 moveto
56012 49533 lineto
stroke
newpath
56611.9 50320.4 moveto
56611.9 50170.4 lineto
stroke
newpath
56911.9 50320.4 moveto
56911.9 50170.4 lineto
stroke
newpath
57946.7 49233 moveto
57909.2 49270.5 lineto
stroke
newpath
57909.2 49270.5 moveto
57834.3 49383 lineto
stroke
newpath
57834.3 49383 moveto
57796.8 49458 lineto
stroke
newpath
57796.8 49458 moveto
57759.3 49570.5 lineto
stroke
newpath
57759.3 49570.5 moveto
57721.8 49758 lineto
stroke
newpath
57721.8 49758 moveto
57721.8 49907.9 lineto
stroke
newpath
57721.8 49907.9 moveto
57759.3 50095.4 lineto
stroke
newpath
57759.3 50095.4 moveto
57796.8 50207.9 lineto
stroke
newpath
57796.8 50207.9 moveto
57834.3 50282.9 lineto
stroke
newpath
57834.3 50282.9 moveto
57909.2 50395.4 lineto
stroke
newpath
57909.2 50395.4 moveto
57946.7 50432.9 lineto
stroke
newpath
58659.2 49533 moveto
58209.2 49533 lineto
stroke
newpath
58434.2 49533 moveto
58434.2 50320.4 lineto
stroke
newpath
58434.2 50320.4 moveto
58359.2 50207.9 lineto
stroke
newpath
58359.2 50207.9 moveto
58284.2 50132.9 lineto
stroke
newpath
58284.2 50132.9 moveto
58209.2 50095.4 lineto
stroke
newpath
59109.1 49982.9 moveto
59034.1 50020.4 lineto
stroke
newpath
59034.1 50020.4 moveto
58996.6 50057.9 lineto
stroke
newpath
58996.6 50057.9 moveto
58959.1 50132.9 lineto
stroke
newpath
58959.1 50132.9 moveto
58959.1 50170.4 lineto
stroke
newpath
58959.1 50170.4 moveto
58996.6 50245.4 lineto
stroke
newpath
58996.6 50245.4 moveto
59034.1 50282.9 lineto
stroke
newpath
59034.1 50282.9 moveto
59109.1 50320.4 lineto
stroke
newpath
59109.1 50320.4 moveto
59259.1 50320.4 lineto
stroke
newpath
59259.1 50320.4 moveto
59334.1 50282.9 lineto
stroke
newpath
59334.1 50282.9 moveto
59371.6 50245.4 lineto
stroke
newpath
59371.6 50245.4 moveto
59409.1 50170.4 lineto
stroke
newpath
59409.1 50170.4 moveto
59409.1 50132.9 lineto
stroke
newpath
59409.1 50132.9 moveto
59371.6 50057.9 lineto
stroke
newpath
59371.6 50057.9 moveto
59334.1 50020.4 lineto
stroke
newpath
59334.1 50020.4 moveto
59259.1 49982.9 lineto
stroke
newpath
59259.1 49982.9 moveto
59109.1 49982.9 lineto
stroke
newpath
59109.1 49982.9 moveto
59034.1 49945.4 lineto
stroke
newpath
59034.1 49945.4 moveto
58996.6 49907.9 lineto
stroke
newpath
58996.6 49907.9 moveto
58959.1 49832.9 lineto
stroke
newpath
58959.1 49832.9 moveto
58959.1 49683 lineto
stroke
newpath
58959.1 49683 moveto
58996.6 49608 lineto
stroke
newpath
58996.6 49608 moveto
59034.1 49570.5 lineto
stroke
newpath
59034.1 49570.5 moveto
59109.1 49533 lineto
stroke
newpath
59109.1 49533 moveto
59259.1 49533 lineto
stroke
newpath
59259.1 49533 moveto
59334.1 49570.5 lineto
stroke
newpath
59334.1 49570.5 moveto
59371.6 49608 lineto
stroke
newpath
59371.6 49608 moveto
59409.1 49683 lineto
stroke
newpath
59409.1 49683 moveto
59409.1 49832.9 lineto
stroke
newpath
59409.1 49832.9 moveto
59371.6 49907.9 lineto
stroke
newpath
59371.6 49907.9 moveto
59334.1 49945.4 lineto
stroke
newpath
59334.1 49945.4 moveto
59259.1 49982.9 lineto
stroke
newpath
60219 49533 moveto
60219 50320.4 lineto
stroke
newpath
60556.4 49533 moveto
60556.4 49945.4 lineto
stroke
newpath
60556.4 49945.4 moveto
60518.9 50020.4 lineto
stroke
newpath
60518.9 50020.4 moveto
60443.9 50057.9 lineto
stroke
newpath
60443.9 50057.9 moveto
60331.4 50057.9 lineto
stroke
newpath
60331.4 50057.9 moveto
60256.5 50020.4 lineto
stroke
newpath
60256.5 50020.4 moveto
60219 49982.9 lineto
stroke
newpath
61043.9 49533 moveto
60968.9 49570.5 lineto
stroke
newpath
60968.9 49570.5 moveto
60931.4 49608 lineto
stroke
newpath
60931.4 49608 moveto
60893.9 49683 lineto
stroke
newpath
60893.9 49683 moveto
60893.9 49907.9 lineto
stroke
newpath
60893.9 49907.9 moveto
60931.4 49982.9 lineto
stroke
newpath
60931.4 49982.9 moveto
60968.9 50020.4 lineto
stroke
newpath
60968.9 50020.4 moveto
61043.9 50057.9 lineto
stroke
newpath
61043.9 50057.9 moveto
61156.3 50057.9 lineto
stroke
newpath
61156.3 50057.9 moveto
61231.3 50020.4 lineto
stroke
newpath
61231.3 50020.4 moveto
61268.8 49982.9 lineto
stroke
newpath
61268.8 49982.9 moveto
61306.3 49907.9 lineto
stroke
newpath
61306.3 49907.9 moveto
61306.3 49683 lineto
stroke
newpath
61306.3 49683 moveto
61268.8 49608 lineto
stroke
newpath
61268.8 49608 moveto
61231.3 49570.5 lineto
stroke
newpath
61231.3 49570.5 moveto
61156.3 49533 lineto
stroke
newpath
61156.3 49533 moveto
61043.9 49533 lineto
stroke
newpath
61756.3 49533 moveto
61681.3 49570.5 lineto
stroke
newpath
61681.3 49570.5 moveto
61643.8 49645.5 lineto
stroke
newpath
61643.8 49645.5 moveto
61643.8 50320.4 lineto
stroke
newpath
62356.2 49570.5 moveto
62281.2 49533 lineto
stroke
newpath
62281.2 49533 moveto
62131.2 49533 lineto
stroke
newpath
62131.2 49533 moveto
62056.2 49570.5 lineto
stroke
newpath
62056.2 49570.5 moveto
62018.7 49645.5 lineto
stroke
newpath
62018.7 49645.5 moveto
62018.7 49945.4 lineto
stroke
newpath
62018.7 49945.4 moveto
62056.2 50020.4 lineto
stroke
newpath
62056.2 50020.4 moveto
62131.2 50057.9 lineto
stroke
newpath
62131.2 50057.9 moveto
62281.2 50057.9 lineto
stroke
newpath
62281.2 50057.9 moveto
62356.2 50020.4 lineto
stroke
newpath
62356.2 50020.4 moveto
62393.7 49945.4 lineto
stroke
newpath
62393.7 49945.4 moveto
62393.7 49870.4 lineto
stroke
newpath
62393.7 49870.4 moveto
62018.7 49795.4 lineto
stroke
newpath
62693.7 49570.5 moveto
62768.6 49533 lineto
stroke
newpath
62768.6 49533 moveto
62918.6 49533 lineto
stroke
newpath
62918.6 49533 moveto
62993.6 49570.5 lineto
stroke
newpath
62993.6 49570.5 moveto
63031.1 49645.5 lineto
stroke
newpath
63031.1 49645.5 moveto
63031.1 49683 lineto
stroke
newpath
63031.1 49683 moveto
62993.6 49758 lineto
stroke
newpath
62993.6 49758 moveto
62918.6 49795.4 lineto
stroke
newpath
62918.6 49795.4 moveto
62806.1 49795.4 lineto
stroke
newpath
62806.1 49795.4 moveto
62731.2 49832.9 lineto
stroke
newpath
62731.2 49832.9 moveto
62693.7 49907.9 lineto
stroke
newpath
62693.7 49907.9 moveto
62693.7 49945.4 lineto
stroke
newpath
62693.7 49945.4 moveto
62731.2 50020.4 lineto
stroke
newpath
62731.2 50020.4 moveto
62806.1 50057.9 lineto
stroke
newpath
62806.1 50057.9 moveto
62918.6 50057.9 lineto
stroke
newpath
62918.6 50057.9 moveto
62993.6 50020.4 lineto
stroke
newpath
63293.6 49233 moveto
63331.1 49270.5 lineto
stroke
newpath
63331.1 49270.5 moveto
63406.1 49383 lineto
stroke
newpath
63406.1 49383 moveto
63443.6 49458 lineto
stroke
newpath
63443.6 49458 moveto
63481.1 49570.5 lineto
stroke
newpath
63481.1 49570.5 moveto
63518.6 49758 lineto
stroke
newpath
63518.6 49758 moveto
63518.6 49907.9 lineto
stroke
newpath
63518.6 49907.9 moveto
63481.1 50095.4 lineto
stroke
newpath
63481.1 50095.4 moveto
63443.6 50207.9 lineto
stroke
newpath
63443.6 50207.9 moveto
63406.1 50282.9 lineto
stroke
newpath
63406.1 50282.9 moveto
63331.1 50395.4 lineto
stroke
newpath
63331.1 50395.4 moveto
63293.6 50432.9 lineto
stroke
showpage
grestore
%%EOF
