(kicad_sch (version 20230221) (generator eeschema)

  (uuid e63e39d7-6ac0-4ffd-8aa3-1841a4541b55)

  (paper "A4")

  (title_block
    (title "RPi-Sensor-HAT")
    (date "2022/12")
    (rev "${VERSION}")
    (company "SearchWing")
  )

  (lib_symbols
    (symbol "10KOhm-0603-1%_1" (pin_numbers hide) (pin_names (offset 0)) (in_bom yes) (on_board yes)
      (property "Reference" "R105" (at 2.54 0.635 0)
        (effects (font (size 1.27 1.27)) (justify left))
      )
      (property "Value" "10KOhm-0603-1%" (at -12.7 -3.81 90)
        (effects (font (size 1.27 1.27)) (justify left) hide)
      )
      (property "Footprint" "searchwing_components:C_0603_1608Metric" (at -1.778 0 90)
        (effects (font (size 1.27 1.27)) hide)
      )
      (property "Datasheet" "~" (at 0 0 0)
        (effects (font (size 1.27 1.27)) hide)
      )
      (property "MANUFACTURER" "ROHM Semiconductor" (at -11.43 -6.35 0)
        (effects (font (size 1.27 1.27)) hide)
      )
      (property "MFG_PART_NUMBER" "ESR03EZPJ103" (at -13.97 -2.54 0)
        (effects (font (size 1.27 1.27)) hide)
      )
      (property "FOOTPRINT_FORMATED" "0603" (at 2.54 -3.175 0)
        (effects (font (size 1.27 1.27)) (justify left))
      )
      (property "LCSC" "C25804" (at 6.35 -5.08 0)
        (effects (font (size 1.27 1.27)) hide)
      )
      (property "Digikey" "RHM10KDCT-ND" (at -13.97 -2.54 0)
        (effects (font (size 1.27 1.27)) hide)
      )
      (property "Mouser" "ESR03EZPJ103" (at -13.97 -2.54 0)
        (effects (font (size 1.27 1.27)) hide)
      )
      (property "RESISTANCE" "10K" (at 2.54 -1.27 0)
        (effects (font (size 1.27 1.27)) (justify left))
      )
      (property "TOLERANCE" "1%" (at 8.255 -1.27 0)
        (effects (font (size 1.27 1.27)))
      )
      (property "ki_keywords" "R res resistor" (at 0 0 0)
        (effects (font (size 1.27 1.27)) hide)
      )
      (property "ki_description" "Resistor" (at 0 0 0)
        (effects (font (size 1.27 1.27)) hide)
      )
      (property "ki_fp_filters" "R_*" (at 0 0 0)
        (effects (font (size 1.27 1.27)) hide)
      )
      (symbol "10KOhm-0603-1%_1_0_1"
        (rectangle (start -1.016 2.54) (end 1.016 -2.54)
          (stroke (width 0.254) (type default))
          (fill (type none))
        )
      )
      (symbol "10KOhm-0603-1%_1_1_1"
        (pin passive line (at 0 3.81 270) (length 1.27)
          (name "~" (effects (font (size 1.27 1.27))))
          (number "1" (effects (font (size 1.27 1.27))))
        )
        (pin passive line (at 0 -3.81 90) (length 1.27)
          (name "~" (effects (font (size 1.27 1.27))))
          (number "2" (effects (font (size 1.27 1.27))))
        )
      )
    )
    (symbol "power:GND" (power) (pin_names (offset 0)) (in_bom yes) (on_board yes)
      (property "Reference" "#PWR" (at 0 -6.35 0)
        (effects (font (size 1.27 1.27)) hide)
      )
      (property "Value" "GND" (at 0 -3.81 0)
        (effects (font (size 1.27 1.27)))
      )
      (property "Footprint" "" (at 0 0 0)
        (effects (font (size 1.27 1.27)) hide)
      )
      (property "Datasheet" "" (at 0 0 0)
        (effects (font (size 1.27 1.27)) hide)
      )
      (property "ki_keywords" "global power" (at 0 0 0)
        (effects (font (size 1.27 1.27)) hide)
      )
      (property "ki_description" "Power symbol creates a global label with name \"GND\" , ground" (at 0 0 0)
        (effects (font (size 1.27 1.27)) hide)
      )
      (symbol "GND_0_1"
        (polyline
          (pts
            (xy 0 0)
            (xy 0 -1.27)
            (xy 1.27 -1.27)
            (xy 0 -2.54)
            (xy -1.27 -1.27)
            (xy 0 -1.27)
          )
          (stroke (width 0) (type default))
          (fill (type none))
        )
      )
      (symbol "GND_1_1"
        (pin power_in line (at 0 0 270) (length 0) hide
          (name "GND" (effects (font (size 1.27 1.27))))
          (number "1" (effects (font (size 1.27 1.27))))
        )
      )
    )
    (symbol "power:PWR_FLAG" (power) (pin_numbers hide) (pin_names (offset 0) hide) (in_bom yes) (on_board yes)
      (property "Reference" "#FLG" (at 0 1.905 0)
        (effects (font (size 1.27 1.27)) hide)
      )
      (property "Value" "PWR_FLAG" (at 0 3.81 0)
        (effects (font (size 1.27 1.27)))
      )
      (property "Footprint" "" (at 0 0 0)
        (effects (font (size 1.27 1.27)) hide)
      )
      (property "Datasheet" "~" (at 0 0 0)
        (effects (font (size 1.27 1.27)) hide)
      )
      (property "ki_keywords" "flag power" (at 0 0 0)
        (effects (font (size 1.27 1.27)) hide)
      )
      (property "ki_description" "Special symbol for telling ERC where power comes from" (at 0 0 0)
        (effects (font (size 1.27 1.27)) hide)
      )
      (symbol "PWR_FLAG_0_0"
        (pin power_out line (at 0 0 90) (length 0)
          (name "pwr" (effects (font (size 1.27 1.27))))
          (number "1" (effects (font (size 1.27 1.27))))
        )
      )
      (symbol "PWR_FLAG_0_1"
        (polyline
          (pts
            (xy 0 0)
            (xy 0 1.27)
            (xy -1.016 1.905)
            (xy 0 2.54)
            (xy 1.016 1.905)
            (xy 0 1.27)
          )
          (stroke (width 0) (type default))
          (fill (type none))
        )
      )
    )
    (symbol "searchwing_components:100nF-0603-50V-X7R" (pin_numbers hide) (pin_names (offset 0.254)) (in_bom yes) (on_board yes)
      (property "Reference" "C?" (at 4.445 1.27 0)
        (effects (font (size 1.27 1.27)) (justify left))
      )
      (property "Value" "100nF-0603-50V-X7R" (at 5.715 15.875 0)
        (effects (font (size 1.27 1.27)) (justify left) hide)
      )
      (property "Footprint" "searchwing_components:C_0603_1608Metric" (at 22.225 13.97 0)
        (effects (font (size 1.27 1.27)) hide)
      )
      (property "Datasheet" "~" (at 0 0 0)
        (effects (font (size 1.27 1.27)) hide)
      )
      (property "FOOTPRINT_FORMATED" "0603" (at 6.985 -2.54 0)
        (effects (font (size 1.27 1.27)))
      )
      (property "MANUFACTURER" "Samsung Electro-Mechanics" (at 19.685 12.065 0)
        (effects (font (size 1.27 1.27)) hide)
      )
      (property "MFG_PART_NUMBER" "CL10B104KB8NNNC" (at 15.24 8.255 0)
        (effects (font (size 1.27 1.27)) hide)
      )
      (property "LCSC" "C14663" (at 8.89 17.78 0)
        (effects (font (size 1.27 1.27)) hide)
      )
      (property "Mouser" "187-CL10B104KB8NNNC" (at 17.78 10.16 0)
        (effects (font (size 1.27 1.27)) hide)
      )
      (property "Digikey" "1276-1000-1-ND" (at 15.24 6.35 0)
        (effects (font (size 1.27 1.27)) hide)
      )
      (property "CAPACITY" "100nF" (at 7.62 -0.635 0)
        (effects (font (size 1.27 1.27)))
      )
      (property "RATING" "50V" (at 6.35 -4.445 0)
        (effects (font (size 1.27 1.27)))
      )
      (property "TYPE" "X7R" (at 10.795 -4.445 0)
        (effects (font (size 1.27 1.27)))
      )
      (property "ki_keywords" "cap capacitor" (at 0 0 0)
        (effects (font (size 1.27 1.27)) hide)
      )
      (property "ki_description" "Unpolarized capacitor" (at 0 0 0)
        (effects (font (size 1.27 1.27)) hide)
      )
      (property "ki_fp_filters" "C_*" (at 0 0 0)
        (effects (font (size 1.27 1.27)) hide)
      )
      (symbol "100nF-0603-50V-X7R_0_1"
        (polyline
          (pts
            (xy -2.032 -0.762)
            (xy 2.032 -0.762)
          )
          (stroke (width 0.508) (type default))
          (fill (type none))
        )
        (polyline
          (pts
            (xy -2.032 0.762)
            (xy 2.032 0.762)
          )
          (stroke (width 0.508) (type default))
          (fill (type none))
        )
      )
      (symbol "100nF-0603-50V-X7R_1_1"
        (pin passive line (at 0 3.81 270) (length 2.794)
          (name "~" (effects (font (size 1.27 1.27))))
          (number "1" (effects (font (size 1.27 1.27))))
        )
        (pin passive line (at 0 -3.81 90) (length 2.794)
          (name "~" (effects (font (size 1.27 1.27))))
          (number "2" (effects (font (size 1.27 1.27))))
        )
      )
    )
    (symbol "searchwing_components:10KOhm-0603-1%" (pin_numbers hide) (pin_names (offset 0)) (in_bom yes) (on_board yes)
      (property "Reference" "R105" (at 2.54 0.635 0)
        (effects (font (size 1.27 1.27)) (justify left))
      )
      (property "Value" "10KOhm-0603-1%" (at -12.7 -3.81 90)
        (effects (font (size 1.27 1.27)) (justify left) hide)
      )
      (property "Footprint" "searchwing_components:C_0603_1608Metric" (at -1.778 0 90)
        (effects (font (size 1.27 1.27)) hide)
      )
      (property "Datasheet" "~" (at 0 0 0)
        (effects (font (size 1.27 1.27)) hide)
      )
      (property "MANUFACTURER" "ROHM Semiconductor" (at -11.43 -6.35 0)
        (effects (font (size 1.27 1.27)) hide)
      )
      (property "MFG_PART_NUMBER" "ESR03EZPJ103" (at -13.97 -2.54 0)
        (effects (font (size 1.27 1.27)) hide)
      )
      (property "FOOTPRINT_FORMATED" "0603" (at 2.54 -3.175 0)
        (effects (font (size 1.27 1.27)) (justify left))
      )
      (property "LCSC" "C25804" (at 6.35 -5.08 0)
        (effects (font (size 1.27 1.27)) hide)
      )
      (property "Digikey" "RHM10KDCT-ND" (at -13.97 -2.54 0)
        (effects (font (size 1.27 1.27)) hide)
      )
      (property "Mouser" "ESR03EZPJ103" (at -13.97 -2.54 0)
        (effects (font (size 1.27 1.27)) hide)
      )
      (property "RESISTANCE" "10K" (at 2.54 -1.27 0)
        (effects (font (size 1.27 1.27)) (justify left))
      )
      (property "TOLERANCE" "1%" (at 8.255 -1.27 0)
        (effects (font (size 1.27 1.27)))
      )
      (property "ki_keywords" "R res resistor" (at 0 0 0)
        (effects (font (size 1.27 1.27)) hide)
      )
      (property "ki_description" "Resistor" (at 0 0 0)
        (effects (font (size 1.27 1.27)) hide)
      )
      (property "ki_fp_filters" "R_*" (at 0 0 0)
        (effects (font (size 1.27 1.27)) hide)
      )
      (symbol "10KOhm-0603-1%_0_1"
        (rectangle (start -1.016 2.54) (end 1.016 -2.54)
          (stroke (width 0.254) (type default))
          (fill (type none))
        )
      )
      (symbol "10KOhm-0603-1%_1_1"
        (pin passive line (at 0 3.81 270) (length 1.27)
          (name "~" (effects (font (size 1.27 1.27))))
          (number "1" (effects (font (size 1.27 1.27))))
        )
        (pin passive line (at 0 -3.81 90) (length 1.27)
          (name "~" (effects (font (size 1.27 1.27))))
          (number "2" (effects (font (size 1.27 1.27))))
        )
      )
    )
    (symbol "searchwing_components:254_02x08_SMD" (pin_names (offset 1.016) hide) (in_bom yes) (on_board yes)
      (property "Reference" "J101" (at 1.27 13.97 0)
        (effects (font (size 1.27 1.27)))
      )
      (property "Value" "254_02x08_SMD" (at 1.27 11.43 0)
        (effects (font (size 1.27 1.27)))
      )
      (property "Footprint" "Connector_PinSocket_2.54mm:PinSocket_2x08_P2.54mm_Vertical_SMD" (at 0 0 0)
        (effects (font (size 1.27 1.27)) hide)
      )
      (property "Datasheet" "~" (at 0 0 0)
        (effects (font (size 1.27 1.27)) hide)
      )
      (property "MANUFACTURER" "HCTL" (at 0 0 0)
        (effects (font (size 1.27 1.27)) hide)
      )
      (property "MFG_PART_NUMBER" "PM254-2-08-S-8.5" (at 0 0 0)
        (effects (font (size 1.27 1.27)) hide)
      )
      (property "FOOTPRINT_FORMATED" "SMD-Connector-16Pads" (at 0 0 0)
        (effects (font (size 1.27 1.27)) hide)
      )
      (property "MANUFACTURER_2" "Harwin" (at 0 0 0)
        (effects (font (size 1.27 1.27)) hide)
      )
      (property "MFG_PART_NUMBER_2" "M20-7810845" (at 0 0 0)
        (effects (font (size 1.27 1.27)) hide)
      )
      (property "LCSC" "C3975153" (at 0 0 0)
        (effects (font (size 1.27 1.27)) hide)
      )
      (property "Digikey_2" "952-3213-ND" (at 0 0 0)
        (effects (font (size 1.27 1.27)) hide)
      )
      (property "Mouser_2" "855-M20-7810845" (at 0 0 0)
        (effects (font (size 1.27 1.27)) hide)
      )
      (property "ki_keywords" "connector" (at 0 0 0)
        (effects (font (size 1.27 1.27)) hide)
      )
      (property "ki_description" "Generic connector, double row, 02x08, odd/even pin numbering scheme (row 1 odd numbers, row 2 even numbers), script generated (kicad-library-utils/schlib/autogen/connector/)" (at 0 0 0)
        (effects (font (size 1.27 1.27)) hide)
      )
      (property "ki_fp_filters" "Connector*:*_2x??_*" (at 0 0 0)
        (effects (font (size 1.27 1.27)) hide)
      )
      (symbol "254_02x08_SMD_1_1"
        (rectangle (start -1.27 -10.033) (end 0 -10.287)
          (stroke (width 0.1524) (type default))
          (fill (type none))
        )
        (rectangle (start -1.27 -7.493) (end 0 -7.747)
          (stroke (width 0.1524) (type default))
          (fill (type none))
        )
        (rectangle (start -1.27 -4.953) (end 0 -5.207)
          (stroke (width 0.1524) (type default))
          (fill (type none))
        )
        (rectangle (start -1.27 -2.413) (end 0 -2.667)
          (stroke (width 0.1524) (type default))
          (fill (type none))
        )
        (rectangle (start -1.27 0.127) (end 0 -0.127)
          (stroke (width 0.1524) (type default))
          (fill (type none))
        )
        (rectangle (start -1.27 2.667) (end 0 2.413)
          (stroke (width 0.1524) (type default))
          (fill (type none))
        )
        (rectangle (start -1.27 5.207) (end 0 4.953)
          (stroke (width 0.1524) (type default))
          (fill (type none))
        )
        (rectangle (start -1.27 7.747) (end 0 7.493)
          (stroke (width 0.1524) (type default))
          (fill (type none))
        )
        (rectangle (start -1.27 8.89) (end 3.81 -11.43)
          (stroke (width 0.254) (type default))
          (fill (type background))
        )
        (rectangle (start 3.81 -10.033) (end 2.54 -10.287)
          (stroke (width 0.1524) (type default))
          (fill (type none))
        )
        (rectangle (start 3.81 -7.493) (end 2.54 -7.747)
          (stroke (width 0.1524) (type default))
          (fill (type none))
        )
        (rectangle (start 3.81 -4.953) (end 2.54 -5.207)
          (stroke (width 0.1524) (type default))
          (fill (type none))
        )
        (rectangle (start 3.81 -2.413) (end 2.54 -2.667)
          (stroke (width 0.1524) (type default))
          (fill (type none))
        )
        (rectangle (start 3.81 0.127) (end 2.54 -0.127)
          (stroke (width 0.1524) (type default))
          (fill (type none))
        )
        (rectangle (start 3.81 2.667) (end 2.54 2.413)
          (stroke (width 0.1524) (type default))
          (fill (type none))
        )
        (rectangle (start 3.81 5.207) (end 2.54 4.953)
          (stroke (width 0.1524) (type default))
          (fill (type none))
        )
        (rectangle (start 3.81 7.747) (end 2.54 7.493)
          (stroke (width 0.1524) (type default))
          (fill (type none))
        )
        (pin passive line (at -5.08 7.62 0) (length 3.81)
          (name "Pin_1" (effects (font (size 1.27 1.27))))
          (number "1" (effects (font (size 1.27 1.27))))
        )
        (pin passive line (at 7.62 -2.54 180) (length 3.81)
          (name "Pin_10" (effects (font (size 1.27 1.27))))
          (number "10" (effects (font (size 1.27 1.27))))
        )
        (pin passive line (at -5.08 -5.08 0) (length 3.81)
          (name "Pin_11" (effects (font (size 1.27 1.27))))
          (number "11" (effects (font (size 1.27 1.27))))
        )
        (pin passive line (at 7.62 -5.08 180) (length 3.81)
          (name "Pin_12" (effects (font (size 1.27 1.27))))
          (number "12" (effects (font (size 1.27 1.27))))
        )
        (pin passive line (at -5.08 -7.62 0) (length 3.81)
          (name "Pin_13" (effects (font (size 1.27 1.27))))
          (number "13" (effects (font (size 1.27 1.27))))
        )
        (pin passive line (at 7.62 -7.62 180) (length 3.81)
          (name "Pin_14" (effects (font (size 1.27 1.27))))
          (number "14" (effects (font (size 1.27 1.27))))
        )
        (pin passive line (at -5.08 -10.16 0) (length 3.81)
          (name "Pin_15" (effects (font (size 1.27 1.27))))
          (number "15" (effects (font (size 1.27 1.27))))
        )
        (pin passive line (at 7.62 -10.16 180) (length 3.81)
          (name "Pin_16" (effects (font (size 1.27 1.27))))
          (number "16" (effects (font (size 1.27 1.27))))
        )
        (pin passive line (at 7.62 7.62 180) (length 3.81)
          (name "Pin_2" (effects (font (size 1.27 1.27))))
          (number "2" (effects (font (size 1.27 1.27))))
        )
        (pin passive line (at -5.08 5.08 0) (length 3.81)
          (name "Pin_3" (effects (font (size 1.27 1.27))))
          (number "3" (effects (font (size 1.27 1.27))))
        )
        (pin passive line (at 7.62 5.08 180) (length 3.81)
          (name "Pin_4" (effects (font (size 1.27 1.27))))
          (number "4" (effects (font (size 1.27 1.27))))
        )
        (pin passive line (at -5.08 2.54 0) (length 3.81)
          (name "Pin_5" (effects (font (size 1.27 1.27))))
          (number "5" (effects (font (size 1.27 1.27))))
        )
        (pin passive line (at 7.62 2.54 180) (length 3.81)
          (name "Pin_6" (effects (font (size 1.27 1.27))))
          (number "6" (effects (font (size 1.27 1.27))))
        )
        (pin passive line (at -5.08 0 0) (length 3.81)
          (name "Pin_7" (effects (font (size 1.27 1.27))))
          (number "7" (effects (font (size 1.27 1.27))))
        )
        (pin passive line (at 7.62 0 180) (length 3.81)
          (name "Pin_8" (effects (font (size 1.27 1.27))))
          (number "8" (effects (font (size 1.27 1.27))))
        )
        (pin passive line (at -5.08 -2.54 0) (length 3.81)
          (name "Pin_9" (effects (font (size 1.27 1.27))))
          (number "9" (effects (font (size 1.27 1.27))))
        )
      )
    )
    (symbol "searchwing_components:BM04B-GHS-TBT(LF)(SN)(N)" (pin_names (offset 1.016)) (in_bom yes) (on_board yes)
      (property "Reference" "J" (at -5.08 7.62 0)
        (effects (font (size 1.27 1.27)) (justify left bottom))
      )
      (property "Value" "BM04B-GHS-TBT" (at -8.255 -12.7 0)
        (effects (font (size 1.27 1.27)) (justify left bottom))
      )
      (property "Footprint" "searchwing_components:JST_BM04B-GHS-TBT(LF)(SN)(N)" (at -1.905 15.875 0)
        (effects (font (size 1.27 1.27)) (justify bottom) hide)
      )
      (property "Datasheet" "" (at 0 0 0)
        (effects (font (size 1.27 1.27)) hide)
      )
      (property "STANDARD" "Manufacturer Recommendations" (at 0 18.415 0)
        (effects (font (size 1.27 1.27)) (justify bottom) hide)
      )
      (property "MAXIMUM_PACKAGE_HEIGHT" "4.05mm" (at 17.145 -2.54 0)
        (effects (font (size 1.27 1.27)) (justify bottom) hide)
      )
      (property "PARTREV" "N/A" (at 15.24 3.81 0)
        (effects (font (size 1.27 1.27)) (justify bottom) hide)
      )
      (property "MANUFACTURER" "JST" (at 0 -19.685 0)
        (effects (font (size 1.27 1.27)) (justify bottom) hide)
      )
      (property "MFG_PART_NUMBER" "BM04B-GHS-TBT(LF)(SN)(N)" (at 1.27 14.605 0)
        (effects (font (size 1.27 1.27)) hide)
      )
      (property "FOOTPRINT_FORMATED" "SMD Connector 4Pin/6Pad" (at 1.27 12.065 0)
        (effects (font (size 1.27 1.27)) hide)
      )
      (property "SUPPLIER" "JLCPCB" (at 16.51 0.635 0)
        (effects (font (size 1.27 1.27)) hide)
      )
      (property "SUPPLIER_NUMBER" "C161692" (at 17.145 2.54 0)
        (effects (font (size 1.27 1.27)) hide)
      )
      (property "ORIENTATION" "Vertical" (at 0 -13.97 0)
        (effects (font (size 1.27 1.27)))
      )
      (property "TYPE" "JST-GH" (at 0 -16.51 0)
        (effects (font (size 1.27 1.27)))
      )
      (symbol "BM04B-GHS-TBT(LF)(SN)(N)_0_0"
        (rectangle (start -5.08 7.62) (end 5.08 -10.16)
          (stroke (width 0.254) (type default))
          (fill (type background))
        )
        (pin passive line (at -10.16 5.08 0) (length 5.08)
          (name "1" (effects (font (size 1.016 1.016))))
          (number "1" (effects (font (size 1.016 1.016))))
        )
        (pin passive line (at -10.16 2.54 0) (length 5.08)
          (name "2" (effects (font (size 1.016 1.016))))
          (number "2" (effects (font (size 1.016 1.016))))
        )
        (pin passive line (at -10.16 0 0) (length 5.08)
          (name "3" (effects (font (size 1.016 1.016))))
          (number "3" (effects (font (size 1.016 1.016))))
        )
        (pin passive line (at -10.16 -2.54 0) (length 5.08)
          (name "4" (effects (font (size 1.016 1.016))))
          (number "4" (effects (font (size 1.016 1.016))))
        )
        (pin passive line (at -10.16 -5.08 0) (length 5.08)
          (name "SHIELD" (effects (font (size 1.016 1.016))))
          (number "S1" (effects (font (size 1.016 1.016))))
        )
        (pin passive line (at -10.16 -7.62 0) (length 5.08)
          (name "SHIELD" (effects (font (size 1.016 1.016))))
          (number "S2" (effects (font (size 1.016 1.016))))
        )
      )
    )
    (symbol "searchwing_components:BM06B-GHS-TBT(LF)(SN)(N)" (pin_names (offset 1.016)) (in_bom yes) (on_board yes)
      (property "Reference" "J?" (at 5.715 1.905 0)
        (effects (font (size 1.27 1.27)) (justify left bottom))
      )
      (property "Value" "BM06B-GHS-TBT" (at 5.715 0 0)
        (effects (font (size 1.27 1.27)) (justify left bottom))
      )
      (property "Footprint" "searchwing_components:JST_BM06B-GHS-TBT(LF)(SN)(N)" (at 0.635 19.685 0)
        (effects (font (size 1.27 1.27)) (justify bottom) hide)
      )
      (property "Datasheet" "" (at 0 0 0)
        (effects (font (size 1.27 1.27)) hide)
      )
      (property "MANUFACTURER" "JST" (at 0 12.065 0)
        (effects (font (size 1.27 1.27)) (justify bottom) hide)
      )
      (property "MAXIMUM_PACKAGE_HEIGHT" "4.05mm" (at 0.635 27.305 0)
        (effects (font (size 1.27 1.27)) (justify bottom) hide)
      )
      (property "STANDARD" "Manufacturer Recommendations" (at 1.905 15.875 0)
        (effects (font (size 1.27 1.27)) (justify bottom) hide)
      )
      (property "PARTREV" "N/A" (at 0 13.97 0)
        (effects (font (size 1.27 1.27)) (justify bottom) hide)
      )
      (property "FOOTPRINT_FORMATED" "6-Pin/8-Pad SMD Connector" (at 1.27 18.415 0)
        (effects (font (size 1.27 1.27)) hide)
      )
      (property "Digikey" "455-1582-1-ND" (at 0.635 22.86 0)
        (effects (font (size 1.27 1.27)) hide)
      )
      (property "LCSC" "C189892" (at 0.635 25.4 0)
        (effects (font (size 1.27 1.27)) hide)
      )
      (property "ORIENTATION" "Vertical" (at 9.525 -1.27 0)
        (effects (font (size 1.27 1.27)))
      )
      (property "TYPE" "JST-GH" (at 9.525 -3.175 0)
        (effects (font (size 1.27 1.27)))
      )
      (property "MFG_PART_NUMBER" "BM06B-GHS-TBT" (at 0.762 30.988 0)
        (effects (font (size 1.27 1.27)) hide)
      )
      (symbol "BM06B-GHS-TBT(LF)(SN)(N)_0_0"
        (rectangle (start -5.08 -12.7) (end 5.08 10.16)
          (stroke (width 0.254) (type default))
          (fill (type background))
        )
        (pin passive line (at -10.16 7.62 0) (length 5.08)
          (name "1" (effects (font (size 1.016 1.016))))
          (number "1" (effects (font (size 1.016 1.016))))
        )
        (pin passive line (at -10.16 5.08 0) (length 5.08)
          (name "2" (effects (font (size 1.016 1.016))))
          (number "2" (effects (font (size 1.016 1.016))))
        )
        (pin passive line (at -10.16 2.54 0) (length 5.08)
          (name "3" (effects (font (size 1.016 1.016))))
          (number "3" (effects (font (size 1.016 1.016))))
        )
        (pin passive line (at -10.16 0 0) (length 5.08)
          (name "4" (effects (font (size 1.016 1.016))))
          (number "4" (effects (font (size 1.016 1.016))))
        )
        (pin passive line (at -10.16 -2.54 0) (length 5.08)
          (name "5" (effects (font (size 1.016 1.016))))
          (number "5" (effects (font (size 1.016 1.016))))
        )
        (pin passive line (at -10.16 -5.08 0) (length 5.08)
          (name "6" (effects (font (size 1.016 1.016))))
          (number "6" (effects (font (size 1.016 1.016))))
        )
        (pin passive line (at -10.16 -10.16 0) (length 5.08)
          (name "SHIELD" (effects (font (size 1.016 1.016))))
          (number "S1" (effects (font (size 1.016 1.016))))
        )
        (pin passive line (at -10.16 -7.62 0) (length 5.08)
          (name "SHIELD" (effects (font (size 1.016 1.016))))
          (number "S2" (effects (font (size 1.016 1.016))))
        )
      )
    )
    (symbol "searchwing_components:SHT31-DIS" (in_bom yes) (on_board yes)
      (property "Reference" "U102" (at 2.0194 10.16 0)
        (effects (font (size 1.27 1.27)) (justify left))
      )
      (property "Value" "SHT31" (at 2.0194 7.62 0)
        (effects (font (size 1.27 1.27)) (justify left))
      )
      (property "Footprint" "searchwing_components:Sensirion_DFN-8-1EP" (at 1.27 25.4 0)
        (effects (font (size 1.27 1.27)) hide)
      )
      (property "Datasheet" "https://www.sensirion.com/fileadmin/user_upload/customers/sensirion/Dokumente/2_Humidity_Sensors/Datasheets/Sensirion_Humidity_Sensors_SHT3x_Datasheet_digital.pdf" (at -1.905 28.575 0)
        (effects (font (size 1.27 1.27)) hide)
      )
      (property "MANUFACTURER" "Sensirion AG" (at 0.635 22.225 0)
        (effects (font (size 1.27 1.27)) hide)
      )
      (property "MFG_PART_NUMBER" "SHT31-DIS-B2.5KS" (at 0 20.32 0)
        (effects (font (size 1.27 1.27)) hide)
      )
      (property "FOOTPRINT_FORMATED" "SMD IC 9Pad" (at 0.635 31.75 0)
        (effects (font (size 1.27 1.27)) hide)
      )
      (property "LCSC" "C80862" (at -18.415 -7.62 0)
        (effects (font (size 1.27 1.27)) hide)
      )
      (property "Mouser" "403-SHT31-DIS-B" (at -19.685 -13.335 0)
        (effects (font (size 1.27 1.27)) hide)
      )
      (property "Digikey" "1649-1011-1-ND" (at -17.78 -10.795 0)
        (effects (font (size 1.27 1.27)) hide)
      )
      (property "ki_keywords" "digital temperature humidity i2c" (at 0 0 0)
        (effects (font (size 1.27 1.27)) hide)
      )
      (property "ki_description" "I²C humidity and temperature sensor, ±2%RH, ±0.2°C, DFN-8" (at 0 0 0)
        (effects (font (size 1.27 1.27)) hide)
      )
      (property "ki_fp_filters" "Sensirion*DFN*1EP*2.5x2.5mm*P0.5mm*" (at 0 0 0)
        (effects (font (size 1.27 1.27)) hide)
      )
      (symbol "SHT31-DIS_0_1"
        (rectangle (start -7.62 5.08) (end 7.62 -5.08)
          (stroke (width 0.254) (type default))
          (fill (type background))
        )
      )
      (symbol "SHT31-DIS_1_1"
        (pin bidirectional line (at 10.16 2.54 180) (length 2.54)
          (name "SDA" (effects (font (size 1.27 1.27))))
          (number "1" (effects (font (size 1.27 1.27))))
        )
        (pin input line (at -10.16 2.54 0) (length 2.54)
          (name "ADDR" (effects (font (size 1.27 1.27))))
          (number "2" (effects (font (size 1.27 1.27))))
        )
        (pin output line (at 10.16 -2.54 180) (length 2.54)
          (name "ALERT" (effects (font (size 1.27 1.27))))
          (number "3" (effects (font (size 1.27 1.27))))
        )
        (pin input line (at 10.16 0 180) (length 2.54)
          (name "SCL" (effects (font (size 1.27 1.27))))
          (number "4" (effects (font (size 1.27 1.27))))
        )
        (pin power_in line (at 0 7.62 270) (length 2.54)
          (name "VDD" (effects (font (size 1.27 1.27))))
          (number "5" (effects (font (size 1.27 1.27))))
        )
        (pin input line (at -10.16 0 0) (length 2.54)
          (name "~{RESET}" (effects (font (size 1.27 1.27))))
          (number "6" (effects (font (size 1.27 1.27))))
        )
        (pin passive line (at -10.16 -2.54 0) (length 2.54)
          (name "R" (effects (font (size 1.27 1.27))))
          (number "7" (effects (font (size 1.27 1.27))))
        )
        (pin power_in line (at 0 -7.62 90) (length 2.54)
          (name "VSS" (effects (font (size 1.27 1.27))))
          (number "8" (effects (font (size 1.27 1.27))))
        )
        (pin passive line (at 0 -7.62 90) (length 2.54) hide
          (name "VSS" (effects (font (size 1.27 1.27))))
          (number "9" (effects (font (size 1.27 1.27))))
        )
      )
    )
  )

  (junction (at 149.86 82.55) (diameter 0) (color 0 0 0 0)
    (uuid 1b51980d-374c-4a30-b729-52bc01a26665)
  )
  (junction (at 58.42 142.24) (diameter 0) (color 0 0 0 0)
    (uuid 1f67138b-5573-44bb-b879-95d3b5ef1f55)
  )
  (junction (at 97.79 115.57) (diameter 0) (color 0 0 0 0)
    (uuid 5934e068-0527-4ee7-b2e6-cdf43d4ba5e7)
  )
  (junction (at 214.63 71.12) (diameter 0) (color 0 0 0 0)
    (uuid 5a33c176-ce57-4ba3-826b-28408aa21a9f)
  )
  (junction (at 97.79 137.16) (diameter 0) (color 0 0 0 0)
    (uuid 61dbdd80-442d-4533-9d92-5d249d82c9c2)
  )
  (junction (at 220.98 63.5) (diameter 0) (color 0 0 0 0)
    (uuid 863911e2-b5d6-4885-b89d-12749cacca38)
  )
  (junction (at 168.91 95.25) (diameter 0) (color 0 0 0 0)
    (uuid a527d286-9d25-4a7e-8741-ad3ea6eaf81e)
  )
  (junction (at 58.42 137.16) (diameter 0) (color 0 0 0 0)
    (uuid c8d3fab9-3bee-4adc-b983-09ef3f6cd156)
  )
  (junction (at 107.95 139.7) (diameter 0) (color 0 0 0 0)
    (uuid d692083a-5454-4c56-9f8b-149fec5009cd)
  )
  (junction (at 220.98 71.12) (diameter 0) (color 0 0 0 0)
    (uuid ecea530d-92d8-4813-aa8e-0746a2751846)
  )
  (junction (at 71.12 115.57) (diameter 0) (color 0 0 0 0)
    (uuid ef2648fa-bae5-4ab9-a8db-94ee819723ea)
  )

  (no_connect (at 220.98 82.55) (uuid 09d80e2b-72ac-4825-9a02-58afba092e3c))
  (no_connect (at 137.16 82.55) (uuid 12f4673c-6bc7-4dcb-b640-097ed3d849ba))
  (no_connect (at 137.16 85.09) (uuid 12f4673c-6bc7-4dcb-b640-097ed3d849bb))
  (no_connect (at 137.16 87.63) (uuid 12f4673c-6bc7-4dcb-b640-097ed3d849bc))
  (no_connect (at 149.86 92.71) (uuid 12f4673c-6bc7-4dcb-b640-097ed3d849bd))
  (no_connect (at 220.98 76.2) (uuid 134e0e67-8f9c-416e-b840-58b33755e072))
  (no_connect (at 220.98 97.79) (uuid 30f02311-5ccd-4bf8-9bd7-2c6f5e9cde21))
  (no_connect (at 220.98 90.17) (uuid 41cad7de-c0d8-466f-8618-312a8d815cf0))
  (no_connect (at 220.98 95.25) (uuid 55cb65e3-880d-427f-82d7-f74a921579f7))
  (no_connect (at 220.98 92.71) (uuid 5c26c86c-2076-4894-b4d9-412a718cb27a))
  (no_connect (at 60.96 139.7) (uuid 73b64ac4-4ead-470e-ad62-99fc3848cbd0))
  (no_connect (at 220.98 73.66) (uuid a40b27f0-67af-4cee-aeb2-eac9c649e794))
  (no_connect (at 220.98 100.33) (uuid b1b41e8f-8b3c-4445-81a6-5b7f761c1f17))
  (no_connect (at 137.16 95.25) (uuid c435fd66-db8e-43bd-a4e4-f38924e92bb1))
  (no_connect (at 81.28 142.24) (uuid d145ed44-80d8-49c9-a23a-a731f6bc5c51))
  (no_connect (at 137.16 92.71) (uuid f6d22353-e997-4fd8-b86f-ed2a14941d54))

  (wire (pts (xy 168.91 95.25) (xy 168.91 85.09))
    (stroke (width 0) (type default))
    (uuid 00f8a3d6-cdbe-4347-bfd0-95863f6ab0d1)
  )
  (wire (pts (xy 214.63 71.12) (xy 220.98 71.12))
    (stroke (width 0) (type default))
    (uuid 0d327247-9634-43e1-99c9-ef08669e8e8d)
  )
  (polyline (pts (xy 33.02 110.49) (xy 120.65 110.49))
    (stroke (width 0) (type default))
    (uuid 0d8b13f2-a580-4642-9231-b9d564713e07)
  )

  (wire (pts (xy 107.95 115.57) (xy 97.79 115.57))
    (stroke (width 0) (type default))
    (uuid 11b00c46-06aa-400f-a4f2-9685fe473682)
  )
  (wire (pts (xy 137.16 90.17) (xy 127 90.17))
    (stroke (width 0) (type default))
    (uuid 11e199ab-9731-4723-83cc-26f76fa02f3c)
  )
  (wire (pts (xy 212.09 87.63) (xy 220.98 87.63))
    (stroke (width 0) (type default))
    (uuid 16aa03b5-8991-48e7-ba05-42fca738314e)
  )
  (wire (pts (xy 58.42 124.46) (xy 58.42 115.57))
    (stroke (width 0) (type default))
    (uuid 1975e9c4-1eda-40f3-9795-e9af7abcfeac)
  )
  (wire (pts (xy 60.96 142.24) (xy 58.42 142.24))
    (stroke (width 0) (type default))
    (uuid 1b930175-7f4d-4bfd-9d5a-19df0b30b6db)
  )
  (wire (pts (xy 81.28 137.16) (xy 97.79 137.16))
    (stroke (width 0) (type default))
    (uuid 20af7416-03a5-43ad-ac72-75d0309597a1)
  )
  (wire (pts (xy 205.74 73.66) (xy 205.74 71.12))
    (stroke (width 0) (type default))
    (uuid 214adde8-c58a-424c-bd04-67f39089c651)
  )
  (polyline (pts (xy 270.51 113.03) (xy 270.51 58.42))
    (stroke (width 0) (type default))
    (uuid 2181cba7-bde8-42d5-9ad6-88598eb1ced1)
  )

  (wire (pts (xy 58.42 115.57) (xy 71.12 115.57))
    (stroke (width 0) (type default))
    (uuid 269c4eaf-400c-4b5e-aff1-e7339e1947e2)
  )
  (wire (pts (xy 127 90.17) (xy 127 99.06))
    (stroke (width 0) (type default))
    (uuid 305411ec-02b1-4eca-b317-b6bb87d9fbde)
  )
  (wire (pts (xy 58.42 137.16) (xy 60.96 137.16))
    (stroke (width 0) (type default))
    (uuid 33970c63-f931-486c-9740-29ed26af6d58)
  )
  (polyline (pts (xy 123.19 58.42) (xy 180.34 58.42))
    (stroke (width 0) (type default))
    (uuid 34a3b4b9-63a6-4f84-90b1-d54029ce9591)
  )

  (wire (pts (xy 168.91 102.87) (xy 168.91 95.25))
    (stroke (width 0) (type default))
    (uuid 353fc1e6-95fa-4638-ab17-c32578b5035f)
  )
  (polyline (pts (xy 191.77 113.03) (xy 270.51 113.03))
    (stroke (width 0) (type default))
    (uuid 38a7b57d-0c7b-4b4b-a8ba-71b35f7174de)
  )
  (polyline (pts (xy 33.02 110.49) (xy 33.02 171.45))
    (stroke (width 0) (type default))
    (uuid 40435474-bf95-4b83-a7ad-0a90b6db0f88)
  )

  (wire (pts (xy 157.48 87.63) (xy 149.86 87.63))
    (stroke (width 0) (type default))
    (uuid 45a58c23-3e6d-4df0-af01-6d5948b0075c)
  )
  (wire (pts (xy 71.12 115.57) (xy 97.79 115.57))
    (stroke (width 0) (type default))
    (uuid 4b56f95a-12ce-48ff-b437-32154075d748)
  )
  (wire (pts (xy 149.86 85.09) (xy 168.91 85.09))
    (stroke (width 0) (type default))
    (uuid 4cd71948-3a88-43f2-872e-bf7b6c7ee212)
  )
  (polyline (pts (xy 33.02 171.45) (xy 120.65 171.45))
    (stroke (width 0) (type default))
    (uuid 55be8435-3714-468a-ba2c-04e95843cb7e)
  )

  (wire (pts (xy 149.86 80.01) (xy 149.86 82.55))
    (stroke (width 0) (type default))
    (uuid 578883b2-f42c-493b-85c9-30e212238a8a)
  )
  (wire (pts (xy 107.95 139.7) (xy 153.67 139.7))
    (stroke (width 0) (type default))
    (uuid 5d077459-1e6b-49a9-bda1-96efd53cd476)
  )
  (wire (pts (xy 149.86 82.55) (xy 168.91 82.55))
    (stroke (width 0) (type default))
    (uuid 6478c38c-0e84-4884-97aa-7bb212e26e5e)
  )
  (wire (pts (xy 58.42 142.24) (xy 58.42 148.59))
    (stroke (width 0) (type default))
    (uuid 64a6d5b5-76d2-4d9b-a265-715b8a053eb7)
  )
  (polyline (pts (xy 180.34 113.03) (xy 180.34 58.42))
    (stroke (width 0) (type default))
    (uuid 667c63a4-9ddb-46d4-93f5-a1de3299728e)
  )

  (wire (pts (xy 107.95 125.73) (xy 107.95 115.57))
    (stroke (width 0) (type default))
    (uuid 7348d41d-94a5-476e-a61d-dfefc4fcdc29)
  )
  (wire (pts (xy 137.16 80.01) (xy 127 80.01))
    (stroke (width 0) (type default))
    (uuid 7cd4f7d7-4ba0-4f45-84b7-2d0a2537c69a)
  )
  (wire (pts (xy 212.09 85.09) (xy 220.98 85.09))
    (stroke (width 0) (type default))
    (uuid 83fd859e-07da-4674-8753-2841aefdafeb)
  )
  (polyline (pts (xy 120.65 171.45) (xy 120.65 110.49))
    (stroke (width 0) (type default))
    (uuid 89f22e10-c2b5-4ffd-b517-0b343ed2df46)
  )

  (wire (pts (xy 149.86 97.79) (xy 153.67 97.79))
    (stroke (width 0) (type default))
    (uuid 8af58757-2782-4337-8618-d6ba06e3d5a1)
  )
  (wire (pts (xy 153.67 97.79) (xy 153.67 139.7))
    (stroke (width 0) (type default))
    (uuid 8d4b5b66-e120-4f3e-9333-104a17012346)
  )
  (wire (pts (xy 205.74 71.12) (xy 214.63 71.12))
    (stroke (width 0) (type default))
    (uuid 9eca3d4c-fb42-4924-8c3d-ceeff38ec5ff)
  )
  (wire (pts (xy 157.48 90.17) (xy 149.86 90.17))
    (stroke (width 0) (type default))
    (uuid a43ae97f-ff8c-43dd-8d6d-82a22f1be9b5)
  )
  (wire (pts (xy 71.12 147.32) (xy 71.12 148.59))
    (stroke (width 0) (type default))
    (uuid a4728609-65b5-4c9f-9f41-38d57108fed2)
  )
  (wire (pts (xy 71.12 115.57) (xy 71.12 132.08))
    (stroke (width 0) (type default))
    (uuid a7b95916-2ab2-46cb-96e3-9e12abb68a40)
  )
  (wire (pts (xy 58.42 132.08) (xy 58.42 137.16))
    (stroke (width 0) (type default))
    (uuid adc010d5-f259-4c12-9b68-9cf935c96caa)
  )
  (wire (pts (xy 97.79 133.35) (xy 97.79 137.16))
    (stroke (width 0) (type default))
    (uuid bfee63d6-b97f-41d1-bd6b-82cb10cfe609)
  )
  (wire (pts (xy 220.98 63.5) (xy 220.98 66.04))
    (stroke (width 0) (type default))
    (uuid c01e238f-0ad0-4ba3-9cba-76eb8a63f92e)
  )
  (wire (pts (xy 149.86 95.25) (xy 168.91 95.25))
    (stroke (width 0) (type default))
    (uuid c39ffbd7-3e51-47d1-b7bf-50e41c82f512)
  )
  (wire (pts (xy 81.28 139.7) (xy 107.95 139.7))
    (stroke (width 0) (type default))
    (uuid c5d7689c-b512-442c-8295-8272192b8e9c)
  )
  (wire (pts (xy 97.79 115.57) (xy 97.79 125.73))
    (stroke (width 0) (type default))
    (uuid c7cc77fd-9e3a-4928-906c-6c105f5ad118)
  )
  (polyline (pts (xy 123.19 58.42) (xy 123.19 113.03))
    (stroke (width 0) (type default))
    (uuid cc6524eb-94f3-4dfa-bdaa-99b0ca25d5ec)
  )

  (wire (pts (xy 200.66 63.5) (xy 220.98 63.5))
    (stroke (width 0) (type default))
    (uuid d7bcefca-8bab-43c8-a26d-9adba433bdfb)
  )
  (polyline (pts (xy 191.77 58.42) (xy 191.77 113.03))
    (stroke (width 0) (type default))
    (uuid d8c37761-fa27-403c-9bac-e5aaaecbe590)
  )
  (polyline (pts (xy 123.19 113.03) (xy 180.34 113.03))
    (stroke (width 0) (type default))
    (uuid d9c84e27-331d-433e-8a49-d689c8695a52)
  )

  (wire (pts (xy 58.42 137.16) (xy 58.42 142.24))
    (stroke (width 0) (type default))
    (uuid de39b133-b780-4e34-9f7f-5e2d2130d0be)
  )
  (wire (pts (xy 137.16 137.16) (xy 137.16 97.79))
    (stroke (width 0) (type default))
    (uuid dfe5f01b-bb5a-49aa-8007-968a7b68ee8d)
  )
  (wire (pts (xy 97.79 137.16) (xy 137.16 137.16))
    (stroke (width 0) (type default))
    (uuid e099eca2-8012-46a9-8378-a5f3a1ae99c9)
  )
  (wire (pts (xy 214.63 71.12) (xy 214.63 73.66))
    (stroke (width 0) (type default))
    (uuid e7bb0474-864d-4bb6-bf25-a1ad4fd963e0)
  )
  (wire (pts (xy 107.95 133.35) (xy 107.95 139.7))
    (stroke (width 0) (type default))
    (uuid f694227b-08c2-44f2-841f-9b91006aa5e9)
  )
  (wire (pts (xy 220.98 68.58) (xy 220.98 71.12))
    (stroke (width 0) (type default))
    (uuid f9dabe7f-66ee-4f34-9541-963a23143aad)
  )
  (polyline (pts (xy 191.77 58.42) (xy 270.51 58.42))
    (stroke (width 0) (type default))
    (uuid fba85bd1-4209-4fd3-ad3b-ceaf6d7ac8b7)
  )

  (text "Raspberry Pi" (at 123.19 57.15 0)
    (effects (font (size 1.27 1.27)) (justify left bottom))
    (uuid 1ff4032c-21cc-4034-9c19-95dd40208caf)
  )
  (text "SHT31" (at 33.02 109.22 0)
    (effects (font (size 1.27 1.27)) (justify left bottom))
    (uuid df75648e-d7fe-477d-a8ff-d64405842c35)
  )
  (text "I2C address: 0x44" (at 63.5 157.48 0)
    (effects (font (size 1.27 1.27)) (justify left bottom))
    (uuid ef762614-7cbe-41eb-8f6b-8b14230133e7)
  )
  (text "Telemetry" (at 191.77 57.15 0)
    (effects (font (size 1.27 1.27)) (justify left bottom))
    (uuid fe57f73f-85f5-4b11-b1c9-a6a9ecb010cb)
  )

  (label "pi_rx" (at 212.09 85.09 0) (fields_autoplaced)
    (effects (font (size 1.27 1.27)) (justify left bottom))
    (uuid 20dad0f1-149f-4061-a24b-6db4a7236988)
  )
  (label "companion_power" (at 200.66 63.5 0) (fields_autoplaced)
    (effects (font (size 1.27 1.27)) (justify left bottom))
    (uuid 52428b54-a365-484f-8d2c-89cb752ea3f3)
  )
  (label "pi_3.3V" (at 71.12 115.57 0) (fields_autoplaced)
    (effects (font (size 1.27 1.27)) (justify left bottom))
    (uuid 6509d0ba-a9d1-4322-8c68-bd58ff839ebd)
  )
  (label "pi_tx" (at 212.09 87.63 0) (fields_autoplaced)
    (effects (font (size 1.27 1.27)) (justify left bottom))
    (uuid b530d021-7909-47cf-95ce-788a3c8a8128)
  )
  (label "companion_power" (at 168.91 82.55 180) (fields_autoplaced)
    (effects (font (size 1.27 1.27)) (justify right bottom))
    (uuid c521f26b-8e1f-4ca0-b3be-e4f77b6fce04)
  )
  (label "pi_rx" (at 157.48 90.17 180) (fields_autoplaced)
    (effects (font (size 1.27 1.27)) (justify right bottom))
    (uuid d875da09-775c-45a3-be03-ee257d013433)
  )
  (label "pi_3.3V" (at 129.54 80.01 0) (fields_autoplaced)
    (effects (font (size 1.27 1.27)) (justify left bottom))
    (uuid ec067646-bde1-4368-b9d5-c35eebefff84)
  )
  (label "pi_tx" (at 157.48 87.63 180) (fields_autoplaced)
    (effects (font (size 1.27 1.27)) (justify right bottom))
    (uuid fbb5e77c-4b41-4796-ad13-1b9e2bbc3c81)
  )

  (symbol (lib_id "searchwing_components:10KOhm-0603-1%") (at 107.95 129.54 0) (unit 1)
    (in_bom yes) (on_board yes) (dnp yes)
    (uuid 0a6bc122-62de-40b8-9519-0f23fed66aa9)
    (property "Reference" "R106" (at 110.49 128.2699 0)
      (effects (font (size 1.27 1.27)) (justify left))
    )
    (property "Value" "10KOhm-0603-1%" (at 95.25 133.35 90)
      (effects (font (size 1.27 1.27)) (justify left) hide)
    )
    (property "Footprint" "searchwing_components:C_0603_1608Metric" (at 106.172 129.54 90)
      (effects (font (size 1.27 1.27)) hide)
    )
    (property "Datasheet" "~" (at 107.95 129.54 0)
      (effects (font (size 1.27 1.27)) hide)
    )
    (property "MANUFACTURER" "ROHM Semiconductor" (at 96.52 135.89 0)
      (effects (font (size 1.27 1.27)) hide)
    )
    (property "MFG_PART_NUMBER" "ESR03EZPJ103" (at 93.98 132.08 0)
      (effects (font (size 1.27 1.27)) hide)
    )
    (property "FOOTPRINT_FORMATED" "0603" (at 110.49 132.715 0)
      (effects (font (size 1.27 1.27)) (justify left))
    )
    (property "LCSC" "C25804" (at 114.3 134.62 0)
      (effects (font (size 1.27 1.27)) hide)
    )
    (property "Digikey" "RHM10KDCT-ND" (at 93.98 132.08 0)
      (effects (font (size 1.27 1.27)) hide)
    )
    (property "Mouser" "ESR03EZPJ103" (at 93.98 132.08 0)
      (effects (font (size 1.27 1.27)) hide)
    )
    (property "RESISTANCE" "10K" (at 110.49 130.81 0)
      (effects (font (size 1.27 1.27)) (justify left))
    )
    (property "TOLERANCE" "1%" (at 116.205 130.81 0)
      (effects (font (size 1.27 1.27)))
    )
    (pin "1" (uuid fd7c8db2-a6ec-4e66-87a9-48917b98034b))
    (pin "2" (uuid 5d34a59b-8563-49eb-a789-61b260146f2b))
    (instances
      (project "rpi-hat"
        (path "/e63e39d7-6ac0-4ffd-8aa3-1841a4541b55"
          (reference "R106") (unit 1)
        )
      )
    )
  )

  (symbol (lib_id "power:GND") (at 214.63 73.66 0) (unit 1)
    (in_bom yes) (on_board yes) (dnp no) (fields_autoplaced)
    (uuid 15bdf75c-317f-4ad5-8c75-59d4a3878d11)
    (property "Reference" "#PWR01" (at 214.63 80.01 0)
      (effects (font (size 1.27 1.27)) hide)
    )
    (property "Value" "GND" (at 214.63 77.47 0)
      (effects (font (size 1.27 1.27)))
    )
    (property "Footprint" "" (at 214.63 73.66 0)
      (effects (font (size 1.27 1.27)) hide)
    )
    (property "Datasheet" "" (at 214.63 73.66 0)
      (effects (font (size 1.27 1.27)) hide)
    )
    (pin "1" (uuid 77420982-4b75-4887-a0bc-d06717d3fe57))
    (instances
      (project "rpi-hat"
        (path "/e63e39d7-6ac0-4ffd-8aa3-1841a4541b55"
          (reference "#PWR01") (unit 1)
        )
      )
    )
  )

  (symbol (lib_id "power:PWR_FLAG") (at 200.66 63.5 180) (unit 1)
    (in_bom yes) (on_board yes) (dnp no)
    (uuid 1916abe1-e9a2-4c38-8dd1-38f07d3b6d06)
    (property "Reference" "#FLG01" (at 200.66 65.405 0)
      (effects (font (size 1.27 1.27)) hide)
    )
    (property "Value" "PWR_FLAG" (at 200.66 67.31 0)
      (effects (font (size 1.27 1.27)))
    )
    (property "Footprint" "" (at 200.66 63.5 0)
      (effects (font (size 1.27 1.27)) hide)
    )
    (property "Datasheet" "~" (at 200.66 63.5 0)
      (effects (font (size 1.27 1.27)) hide)
    )
    (pin "1" (uuid fe406e00-3923-463f-9ab8-8291b0f8f0ec))
    (instances
      (project "rpi-hat"
        (path "/e63e39d7-6ac0-4ffd-8aa3-1841a4541b55"
          (reference "#FLG01") (unit 1)
        )
      )
    )
  )

  (symbol (lib_id "searchwing_components:100nF-0603-50V-X7R") (at 58.42 128.27 0) (unit 1)
    (in_bom yes) (on_board yes) (dnp no)
    (uuid 408acb8a-2986-4235-b729-2c13424aaaac)
    (property "Reference" "C1" (at 62.23 128.27 0)
      (effects (font (size 1.27 1.27)) (justify left))
    )
    (property "Value" "100nF-0603-50V-X7R" (at 64.135 112.395 0)
      (effects (font (size 1.27 1.27)) (justify left) hide)
    )
    (property "Footprint" "searchwing_components:C_0603_1608Metric" (at 80.645 114.3 0)
      (effects (font (size 1.27 1.27)) hide)
    )
    (property "Datasheet" "~" (at 58.42 128.27 0)
      (effects (font (size 1.27 1.27)) hide)
    )
    (property "FOOTPRINT_FORMATED" "0603" (at 51.435 130.175 0)
      (effects (font (size 1.27 1.27)))
    )
    (property "MANUFACTURER" "Samsung Electro-Mechanics" (at 78.105 116.205 0)
      (effects (font (size 1.27 1.27)) hide)
    )
    (property "MFG_PART_NUMBER" "CL10B104KB8NNNC" (at 73.66 120.015 0)
      (effects (font (size 1.27 1.27)) hide)
    )
    (property "LCSC" "C14663" (at 67.31 110.49 0)
      (effects (font (size 1.27 1.27)) hide)
    )
    (property "Mouser" "187-CL10B104KB8NNNC" (at 76.2 118.11 0)
      (effects (font (size 1.27 1.27)) hide)
    )
    (property "Digikey" "1276-1000-1-ND" (at 73.66 121.92 0)
      (effects (font (size 1.27 1.27)) hide)
    )
    (property "CAPACITY" "100nF" (at 52.07 128.27 0)
      (effects (font (size 1.27 1.27)))
    )
    (property "RATING" "50V" (at 50.8 132.08 0)
      (effects (font (size 1.27 1.27)))
    )
    (property "TYPE" "X7R" (at 55.245 132.08 0)
      (effects (font (size 1.27 1.27)))
    )
    (pin "1" (uuid a1151a9f-f9d3-44ce-8f7c-3165b993acae))
    (pin "2" (uuid 2abfb8a4-2d1b-4c53-bf7e-a8fed272b463))
    (instances
      (project "rpi-hat"
        (path "/e63e39d7-6ac0-4ffd-8aa3-1841a4541b55"
          (reference "C1") (unit 1)
        )
      )
    )
  )

  (symbol (lib_id "searchwing_components:254_02x08_SMD") (at 142.24 87.63 0) (unit 1)
    (in_bom yes) (on_board yes) (dnp no) (fields_autoplaced)
    (uuid 593b8647-0095-46cc-ba23-3cf2a86edb5e)
    (property "Reference" "J101" (at 143.51 74.93 0)
      (effects (font (size 1.27 1.27)))
    )
    (property "Value" "254_02x08_SMD" (at 143.51 77.47 0)
      (effects (font (size 1.27 1.27)))
    )
    (property "Footprint" "Connector_PinSocket_2.54mm:PinSocket_2x08_P2.54mm_Vertical_SMD" (at 142.24 87.63 0)
      (effects (font (size 1.27 1.27)) hide)
    )
    (property "Datasheet" "~" (at 142.24 87.63 0)
      (effects (font (size 1.27 1.27)) hide)
    )
    (property "MANUFACTURER" "HCTL" (at 142.24 87.63 0)
      (effects (font (size 1.27 1.27)) hide)
    )
    (property "MFG_PART_NUMBER" "PM254-2-08-S-8.5" (at 142.24 87.63 0)
      (effects (font (size 1.27 1.27)) hide)
    )
    (property "FOOTPRINT_FORMATED" "SMD-Connector-16Pads" (at 142.24 87.63 0)
      (effects (font (size 1.27 1.27)) hide)
    )
    (property "MANUFACTURER_2" "Harwin" (at 142.24 87.63 0)
      (effects (font (size 1.27 1.27)) hide)
    )
    (property "MFG_PART_NUMBER_2" "M20-7810845" (at 142.24 87.63 0)
      (effects (font (size 1.27 1.27)) hide)
    )
    (property "LCSC" "C3975153" (at 142.24 87.63 0)
      (effects (font (size 1.27 1.27)) hide)
    )
    (property "Digikey_2" "952-3213-ND" (at 142.24 87.63 0)
      (effects (font (size 1.27 1.27)) hide)
    )
    (property "Mouser_2" "855-M20-7810845" (at 142.24 87.63 0)
      (effects (font (size 1.27 1.27)) hide)
    )
    (pin "1" (uuid ba6fc20e-7eff-4d5f-81e4-d1fad93be155))
    (pin "10" (uuid 2035ea48-3ef5-4d7f-8c3c-50981b30c89a))
    (pin "11" (uuid 7a2f50f6-0c99-4e8d-9c2a-8f2f961d2e6d))
    (pin "12" (uuid ae0e6b31-27d7-4383-a4fc-7557b0a19382))
    (pin "13" (uuid 9565d2ee-a4f1-4d08-b2c9-0264233a0d2b))
    (pin "14" (uuid b287f145-851e-45cc-b200-e62677b551d5))
    (pin "15" (uuid d1eca865-05c5-48a4-96cf-ed5f8a640e25))
    (pin "16" (uuid cebb9021-66d3-4116-98d4-5e6f3c1552be))
    (pin "2" (uuid 3b686d17-1000-4762-ba31-589d599a3edf))
    (pin "3" (uuid 9286cf02-1563-41d2-9931-c192c33bab31))
    (pin "4" (uuid 66bc2bca-dab7-4947-a0ff-403cdaf9fb89))
    (pin "5" (uuid 9b6bb172-1ac4-440a-ac75-c1917d9d59c7))
    (pin "6" (uuid 5701b80f-f006-4814-81c9-0c7f006088a9))
    (pin "7" (uuid 63c56ea4-91a3-4172-b9de-a4388cc8f894))
    (pin "8" (uuid c25449d6-d734-4953-b762-98f82a830248))
    (pin "9" (uuid d7e4abd8-69f5-4706-b12e-898194e5bf56))
    (instances
      (project "rpi-hat"
        (path "/e63e39d7-6ac0-4ffd-8aa3-1841a4541b55"
          (reference "J101") (unit 1)
        )
      )
    )
  )

  (symbol (lib_id "power:PWR_FLAG") (at 127 80.01 0) (unit 1)
    (in_bom yes) (on_board yes) (dnp no)
    (uuid 6c5a1053-2043-486c-a106-1d429bd469c2)
    (property "Reference" "#FLG0103" (at 127 78.105 0)
      (effects (font (size 1.27 1.27)) hide)
    )
    (property "Value" "PWR_FLAG" (at 128.27 76.2 0)
      (effects (font (size 1.27 1.27)))
    )
    (property "Footprint" "" (at 127 80.01 0)
      (effects (font (size 1.27 1.27)) hide)
    )
    (property "Datasheet" "~" (at 127 80.01 0)
      (effects (font (size 1.27 1.27)) hide)
    )
    (pin "1" (uuid e10f3142-e3b4-4905-9849-e221efc6a372))
    (instances
      (project "rpi-hat"
        (path "/e63e39d7-6ac0-4ffd-8aa3-1841a4541b55"
          (reference "#FLG0103") (unit 1)
        )
      )
    )
  )

  (symbol (lib_id "searchwing_components:BM06B-GHS-TBT(LF)(SN)(N)") (at 231.14 90.17 0) (unit 1)
    (in_bom yes) (on_board yes) (dnp no) (fields_autoplaced)
    (uuid 79454bc9-5d9e-4917-b692-19772cb709a3)
    (property "Reference" "J102" (at 237.49 88.265 0)
      (effects (font (size 1.27 1.27)) (justify left))
    )
    (property "Value" "BM06B-GHS-TBT" (at 237.49 90.805 0)
      (effects (font (size 1.27 1.27)) (justify left))
    )
    (property "Footprint" "searchwing_components:JST_BM06B-GHS-TBT(LF)(SN)(N)" (at 231.775 70.485 0)
      (effects (font (size 1.27 1.27)) (justify bottom) hide)
    )
    (property "Datasheet" "" (at 231.14 90.17 0)
      (effects (font (size 1.27 1.27)) hide)
    )
    (property "MANUFACTURER" "JST" (at 231.14 78.105 0)
      (effects (font (size 1.27 1.27)) (justify bottom) hide)
    )
    (property "FOOTPRINT_FORMATED" "6-Pin/8-Pad SMD Connector" (at 232.41 71.755 0)
      (effects (font (size 1.27 1.27)) hide)
    )
    (property "Digikey" "455-1582-1-ND" (at 231.775 67.31 0)
      (effects (font (size 1.27 1.27)) hide)
    )
    (property "LCSC" "C189892" (at 231.775 64.77 0)
      (effects (font (size 1.27 1.27)) hide)
    )
    (property "MAXIMUM_PACKAGE_HEIGHT" "4.05mm" (at 231.775 62.865 0)
      (effects (font (size 1.27 1.27)) (justify bottom) hide)
    )
    (property "STANDARD" "Manufacturer Recommendations" (at 233.045 74.295 0)
      (effects (font (size 1.27 1.27)) (justify bottom) hide)
    )
    (property "PARTREV" "N/A" (at 231.14 76.2 0)
      (effects (font (size 1.27 1.27)) (justify bottom) hide)
    )
    (property "ORIENTATION" "Vertical" (at 237.49 93.345 0)
      (effects (font (size 1.27 1.27)) (justify left))
    )
    (property "TYPE" "JST-GH" (at 237.49 95.885 0)
      (effects (font (size 1.27 1.27)) (justify left))
    )
    (property "MFG_PART_NUMBER" "BM06B-GHS-TBT" (at 231.902 59.182 0)
      (effects (font (size 1.27 1.27)) hide)
    )
    (pin "1" (uuid 97b3e184-7b12-4d1e-8c58-4f789b197708))
    (pin "2" (uuid 87e8c076-b588-4dd2-9c6b-78b8fa232028))
    (pin "3" (uuid 4b4c8ecb-e751-4abc-94c5-af16d9c42c70))
    (pin "4" (uuid f8db365c-261f-4748-a1c1-67f1347874dd))
    (pin "5" (uuid 4edb63b2-0c13-41c4-bb44-548af3740a27))
    (pin "6" (uuid 50b1fe55-8229-4fcc-a089-d4552b7fca4a))
    (pin "S1" (uuid 710b5765-1469-4395-82d3-76160fd90917))
    (pin "S2" (uuid 94564e90-7046-48de-aec3-62748cdc6dc2))
    (instances
      (project "rpi-hat"
        (path "/e63e39d7-6ac0-4ffd-8aa3-1841a4541b55"
          (reference "J102") (unit 1)
        )
      )
    )
  )

  (symbol (lib_name "10KOhm-0603-1%_1") (lib_id "searchwing_components:10KOhm-0603-1%") (at 97.79 129.54 0) (unit 1)
    (in_bom yes) (on_board yes) (dnp yes)
    (uuid 88d3dcb9-d70f-4bfd-a98c-2a01849b9d28)
    (property "Reference" "R105" (at 100.33 128.905 0)
      (effects (font (size 1.27 1.27)) (justify left))
    )
    (property "Value" "10KOhm-0603-1%" (at 85.09 133.35 90)
      (effects (font (size 1.27 1.27)) (justify left) hide)
    )
    (property "Footprint" "searchwing_components:C_0603_1608Metric" (at 96.012 129.54 90)
      (effects (font (size 1.27 1.27)) hide)
    )
    (property "Datasheet" "~" (at 97.79 129.54 0)
      (effects (font (size 1.27 1.27)) hide)
    )
    (property "MANUFACTURER" "ROHM Semiconductor" (at 86.36 135.89 0)
      (effects (font (size 1.27 1.27)) hide)
    )
    (property "MFG_PART_NUMBER" "ESR03EZPJ103" (at 83.82 132.08 0)
      (effects (font (size 1.27 1.27)) hide)
    )
    (property "FOOTPRINT_FORMATED" "0603" (at 100.33 132.715 0)
      (effects (font (size 1.27 1.27)) (justify left))
    )
    (property "LCSC" "C25804" (at 104.14 134.62 0)
      (effects (font (size 1.27 1.27)) hide)
    )
    (property "Digikey" "RHM10KDCT-ND" (at 83.82 132.08 0)
      (effects (font (size 1.27 1.27)) hide)
    )
    (property "Mouser" "ESR03EZPJ103" (at 83.82 132.08 0)
      (effects (font (size 1.27 1.27)) hide)
    )
    (property "RESISTANCE" "10K" (at 100.33 130.81 0)
      (effects (font (size 1.27 1.27)) (justify left))
    )
    (property "TOLERANCE" "1%" (at 106.045 130.81 0)
      (effects (font (size 1.27 1.27)))
    )
    (pin "1" (uuid 0f89095f-4a3a-488e-addd-13d4f359a560))
    (pin "2" (uuid 2ecd48df-6bac-4a73-a295-21a3b9f2d3be))
    (instances
      (project "rpi-hat"
        (path "/e63e39d7-6ac0-4ffd-8aa3-1841a4541b55"
          (reference "R105") (unit 1)
        )
      )
    )
  )

  (symbol (lib_id "power:GND") (at 168.91 102.87 0) (unit 1)
    (in_bom yes) (on_board yes) (dnp no) (fields_autoplaced)
    (uuid 8d02fa1c-04e8-40b7-b8bd-02877e0e49cd)
    (property "Reference" "#PWR0105" (at 168.91 109.22 0)
      (effects (font (size 1.27 1.27)) hide)
    )
    (property "Value" "GND" (at 168.91 106.68 0)
      (effects (font (size 1.27 1.27)))
    )
    (property "Footprint" "" (at 168.91 102.87 0)
      (effects (font (size 1.27 1.27)) hide)
    )
    (property "Datasheet" "" (at 168.91 102.87 0)
      (effects (font (size 1.27 1.27)) hide)
    )
    (pin "1" (uuid 3f25bec9-5e7a-4437-8587-a02e359fc612))
    (instances
      (project "rpi-hat"
        (path "/e63e39d7-6ac0-4ffd-8aa3-1841a4541b55"
          (reference "#PWR0105") (unit 1)
        )
      )
    )
  )

  (symbol (lib_id "power:GND") (at 127 99.06 0) (unit 1)
    (in_bom yes) (on_board yes) (dnp no) (fields_autoplaced)
    (uuid aa708c47-ba54-4afd-8cdf-785b76c60425)
    (property "Reference" "#PWR0104" (at 127 105.41 0)
      (effects (font (size 1.27 1.27)) hide)
    )
    (property "Value" "GND" (at 127 102.87 0)
      (effects (font (size 1.27 1.27)))
    )
    (property "Footprint" "" (at 127 99.06 0)
      (effects (font (size 1.27 1.27)) hide)
    )
    (property "Datasheet" "" (at 127 99.06 0)
      (effects (font (size 1.27 1.27)) hide)
    )
    (pin "1" (uuid e4abe846-cd9e-4d79-a2fb-ca1da7378476))
    (instances
      (project "rpi-hat"
        (path "/e63e39d7-6ac0-4ffd-8aa3-1841a4541b55"
          (reference "#PWR0104") (unit 1)
        )
      )
    )
  )

  (symbol (lib_id "power:GND") (at 58.42 148.59 0) (unit 1)
    (in_bom yes) (on_board yes) (dnp no) (fields_autoplaced)
    (uuid aa74dd76-f216-4001-a059-557858b86366)
    (property "Reference" "#PWR0102" (at 58.42 154.94 0)
      (effects (font (size 1.27 1.27)) hide)
    )
    (property "Value" "GND" (at 58.42 152.4 0)
      (effects (font (size 1.27 1.27)))
    )
    (property "Footprint" "" (at 58.42 148.59 0)
      (effects (font (size 1.27 1.27)) hide)
    )
    (property "Datasheet" "" (at 58.42 148.59 0)
      (effects (font (size 1.27 1.27)) hide)
    )
    (pin "1" (uuid 56c4ce81-8461-4e76-8928-367406ebe151))
    (instances
      (project "rpi-hat"
        (path "/e63e39d7-6ac0-4ffd-8aa3-1841a4541b55"
          (reference "#PWR0102") (unit 1)
        )
      )
    )
  )

  (symbol (lib_id "searchwing_components:SHT31-DIS") (at 71.12 139.7 0) (unit 1)
    (in_bom yes) (on_board yes) (dnp no) (fields_autoplaced)
    (uuid b35399d9-f02c-49c0-bb18-9415d166763d)
    (property "Reference" "U102" (at 73.0759 130.81 0)
      (effects (font (size 1.27 1.27)) (justify left))
    )
    (property "Value" "SHT31" (at 73.0759 133.35 0)
      (effects (font (size 1.27 1.27)) (justify left))
    )
    (property "Footprint" "searchwing_components:Sensirion_DFN-8-1EP" (at 72.39 114.3 0)
      (effects (font (size 1.27 1.27)) hide)
    )
    (property "Datasheet" "https://www.sensirion.com/fileadmin/user_upload/customers/sensirion/Dokumente/2_Humidity_Sensors/Datasheets/Sensirion_Humidity_Sensors_SHT3x_Datasheet_digital.pdf" (at 69.215 111.125 0)
      (effects (font (size 1.27 1.27)) hide)
    )
    (property "MANUFACTURER" "Sensirion AG" (at 71.755 117.475 0)
      (effects (font (size 1.27 1.27)) hide)
    )
    (property "MFG_PART_NUMBER" "SHT31-DIS-B2.5KS" (at 71.12 119.38 0)
      (effects (font (size 1.27 1.27)) hide)
    )
    (property "FOOTPRINT_FORMATED" "SMD IC 9Pad" (at 71.755 107.95 0)
      (effects (font (size 1.27 1.27)) hide)
    )
    (property "LCSC" "C80862" (at 52.705 147.32 0)
      (effects (font (size 1.27 1.27)) hide)
    )
    (property "Mouser" "403-SHT31-DIS-B" (at 51.435 153.035 0)
      (effects (font (size 1.27 1.27)) hide)
    )
    (property "Digikey" "1649-1011-1-ND" (at 53.34 150.495 0)
      (effects (font (size 1.27 1.27)) hide)
    )
    (pin "1" (uuid 6edb8840-2063-44a2-95bc-dd4c04d23d16))
    (pin "2" (uuid 5e837fe8-5817-4643-9fa0-674b119e328b))
    (pin "3" (uuid 9ef12348-f26a-4e76-b044-1595de63c33c))
    (pin "4" (uuid bc088809-aa57-4aa9-bffe-7806b67478ac))
    (pin "5" (uuid 8c46b8a7-d3f9-4b28-b6c5-db93b43a94af))
    (pin "6" (uuid bdc575dd-b2fc-4e97-bdf4-bc1340ca2a71))
    (pin "7" (uuid 00e203a5-0e18-4f3e-9e5d-49fb44374c3d))
    (pin "8" (uuid 1c7b7123-ce70-417e-a5e4-b30130312439))
    (pin "9" (uuid aea80dfb-22c3-4525-9ff0-2afa56ef1e79))
    (instances
      (project "rpi-hat"
        (path "/e63e39d7-6ac0-4ffd-8aa3-1841a4541b55"
          (reference "U102") (unit 1)
        )
      )
    )
  )

  (symbol (lib_id "power:GND") (at 71.12 148.59 0) (unit 1)
    (in_bom yes) (on_board yes) (dnp no) (fields_autoplaced)
    (uuid c7b6d8a3-4782-4241-ba00-babb140bb786)
    (property "Reference" "#PWR0103" (at 71.12 154.94 0)
      (effects (font (size 1.27 1.27)) hide)
    )
    (property "Value" "GND" (at 71.12 152.4 0)
      (effects (font (size 1.27 1.27)))
    )
    (property "Footprint" "" (at 71.12 148.59 0)
      (effects (font (size 1.27 1.27)) hide)
    )
    (property "Datasheet" "" (at 71.12 148.59 0)
      (effects (font (size 1.27 1.27)) hide)
    )
    (pin "1" (uuid 5f399eea-53f1-4fda-8b68-fea11dcddb98))
    (instances
      (project "rpi-hat"
        (path "/e63e39d7-6ac0-4ffd-8aa3-1841a4541b55"
          (reference "#PWR0103") (unit 1)
        )
      )
    )
  )

  (symbol (lib_id "searchwing_components:BM04B-GHS-TBT(LF)(SN)(N)") (at 231.14 68.58 0) (unit 1)
    (in_bom yes) (on_board yes) (dnp no) (fields_autoplaced)
    (uuid ce19dcda-5782-453a-9501-a206422f383f)
    (property "Reference" "J103" (at 237.49 66.675 0)
      (effects (font (size 1.27 1.27)) (justify left))
    )
    (property "Value" "BM04B-GHS-TBT" (at 237.49 69.215 0)
      (effects (font (size 1.27 1.27)) (justify left))
    )
    (property "Footprint" "searchwing_components:JST_BM04B-GHS-TBT(LF)(SN)(N)" (at 229.235 52.705 0)
      (effects (font (size 1.27 1.27)) (justify bottom) hide)
    )
    (property "Datasheet" "" (at 231.14 68.58 0)
      (effects (font (size 1.27 1.27)) hide)
    )
    (property "STANDARD" "Manufacturer Recommendations" (at 231.14 50.165 0)
      (effects (font (size 1.27 1.27)) (justify bottom) hide)
    )
    (property "MAXIMUM_PACKAGE_HEIGHT" "4.05mm" (at 248.285 71.12 0)
      (effects (font (size 1.27 1.27)) (justify bottom) hide)
    )
    (property "PARTREV" "N/A" (at 246.38 64.77 0)
      (effects (font (size 1.27 1.27)) (justify bottom) hide)
    )
    (property "MANUFACTURER" "JST" (at 231.14 88.265 0)
      (effects (font (size 1.27 1.27)) (justify bottom) hide)
    )
    (property "MFG_PART_NUMBER" "BM04B-GHS-TBT(LF)(SN)(N)" (at 232.41 53.975 0)
      (effects (font (size 1.27 1.27)) hide)
    )
    (property "FOOTPRINT_FORMATED" "SMD Connector 4Pin/6Pad" (at 232.41 56.515 0)
      (effects (font (size 1.27 1.27)) hide)
    )
    (property "SUPPLIER" "JLCPCB" (at 247.65 67.945 0)
      (effects (font (size 1.27 1.27)) hide)
    )
    (property "SUPPLIER_NUMBER" "C161692" (at 248.285 66.04 0)
      (effects (font (size 1.27 1.27)) hide)
    )
    (property "ORIENTATION" "Vertical" (at 237.49 71.755 0)
      (effects (font (size 1.27 1.27)) (justify left))
    )
    (property "TYPE" "JST-GH" (at 237.49 74.295 0)
      (effects (font (size 1.27 1.27)) (justify left))
    )
    (pin "1" (uuid 13c02e6e-a38c-4c0a-b85d-6b2559caad3e))
    (pin "2" (uuid 641390af-d358-48e3-bc7d-588eb94b6315))
    (pin "3" (uuid c6dab3b2-68e2-4769-91f9-1c39ec6ee9f6))
    (pin "4" (uuid 8456e5d4-dbda-4001-aab4-39cf5eff69ac))
    (pin "S1" (uuid 96163aa5-332b-44da-92cd-510aafad9f54))
    (pin "S2" (uuid 7062c81b-2a08-4786-b77d-03908e507df7))
    (instances
      (project "rpi-hat"
        (path "/e63e39d7-6ac0-4ffd-8aa3-1841a4541b55"
          (reference "J103") (unit 1)
        )
      )
    )
  )

  (symbol (lib_id "power:PWR_FLAG") (at 205.74 73.66 180) (unit 1)
    (in_bom yes) (on_board yes) (dnp no)
    (uuid fcf2b939-3079-42f0-a612-76bda7c412ce)
    (property "Reference" "#FLG02" (at 205.74 75.565 0)
      (effects (font (size 1.27 1.27)) hide)
    )
    (property "Value" "PWR_FLAG" (at 205.74 77.47 0)
      (effects (font (size 1.27 1.27)))
    )
    (property "Footprint" "" (at 205.74 73.66 0)
      (effects (font (size 1.27 1.27)) hide)
    )
    (property "Datasheet" "~" (at 205.74 73.66 0)
      (effects (font (size 1.27 1.27)) hide)
    )
    (pin "1" (uuid fbd69e30-6e6b-47a9-8708-0cd6241f34d7))
    (instances
      (project "rpi-hat"
        (path "/e63e39d7-6ac0-4ffd-8aa3-1841a4541b55"
          (reference "#FLG02") (unit 1)
        )
      )
    )
  )

  (sheet_instances
    (path "/" (page "1"))
  )
)
