(footprint "IHLP2020CZER1R0M8A" (version 20221018) (generator pcbnew)
  (layer "F.Cu")
  (attr smd)
  (fp_text reference "REF**" (at 0.254 4.826) (layer "F.SilkS") hide
      (effects (font (size 1 1) (thickness 0.15)))
    (tstamp 55769b5b-093a-40cc-92cb-1a40440ebd26)
  )
  (fp_text value "IND_IHLP-2020CZ-8A_VIS" (at 0.762 -4.572) (layer "F.SilkS") hide
      (effects (font (size 1 1) (thickness 0.15)))
    (tstamp e925a42c-cf60-4902-940a-ecd6ab9743a2)
  )
  (fp_text user "REF**" (at 0 0) (layer "F.Fab")
      (effects (font (size 1 1) (thickness 0.15)))
    (tstamp 0e74db31-5a63-4c6b-8462-9f1916ba0c46)
  )
  (fp_line (start -2.9972 -2.8448) (end -2.9972 -1.72974)
    (stroke (width 0.12) (type solid)) (layer "F.SilkS") (tstamp 37b10a54-1933-4673-b918-2b0302ac4470))
  (fp_line (start -2.9972 1.72974) (end -2.9972 2.8448)
    (stroke (width 0.12) (type solid)) (layer "F.SilkS") (tstamp c8ca09c4-3864-43ce-949c-ef7e8a8f9575))
  (fp_line (start -2.9972 2.8448) (end 2.9972 2.8448)
    (stroke (width 0.12) (type solid)) (layer "F.SilkS") (tstamp 10bca99a-9783-4bab-9a0d-22da2c8443bf))
  (fp_line (start 2.9972 -2.8448) (end -2.9972 -2.8448)
    (stroke (width 0.12) (type solid)) (layer "F.SilkS") (tstamp 3dd7ba6d-58d0-4668-bf89-3ae2dc7e4cfb))
  (fp_line (start 2.9972 -1.72974) (end 2.9972 -2.8448)
    (stroke (width 0.12) (type solid)) (layer "F.SilkS") (tstamp d9c48155-d6b2-476b-99ba-ae1111eacf7d))
  (fp_line (start 2.9972 2.8448) (end 2.9972 1.72974)
    (stroke (width 0.12) (type solid)) (layer "F.SilkS") (tstamp 7cecc63c-48fa-4634-8c97-d56136d96d15))
  (fp_line (start -3.2766 -1.651) (end -3.1242 -1.651)
    (stroke (width 0.05) (type solid)) (layer "F.CrtYd") (tstamp 11de41de-d9a9-4e86-940d-99a1567042a3))
  (fp_line (start -3.2766 1.651) (end -3.2766 -1.651)
    (stroke (width 0.05) (type solid)) (layer "F.CrtYd") (tstamp a09218ab-59d9-429f-aaf6-8474e61073da))
  (fp_line (start -3.1242 -2.9718) (end 3.1242 -2.9718)
    (stroke (width 0.05) (type solid)) (layer "F.CrtYd") (tstamp 68d56830-5948-491b-9668-8360717c16bd))
  (fp_line (start -3.1242 -1.651) (end -3.1242 -2.9718)
    (stroke (width 0.05) (type solid)) (layer "F.CrtYd") (tstamp faa0e78a-f154-4f49-b418-16d9122e70cb))
  (fp_line (start -3.1242 1.651) (end -3.2766 1.651)
    (stroke (width 0.05) (type solid)) (layer "F.CrtYd") (tstamp dbb26299-96da-4f8e-80e9-62a513b64fd3))
  (fp_line (start -3.1242 2.9718) (end -3.1242 1.651)
    (stroke (width 0.05) (type solid)) (layer "F.CrtYd") (tstamp 94b43586-8936-44b2-a4c2-d7e2f3070afb))
  (fp_line (start 3.1242 -2.9718) (end 3.1242 -1.651)
    (stroke (width 0.05) (type solid)) (layer "F.CrtYd") (tstamp 63ea53ac-05a8-4a46-9570-149e01f1cbc3))
  (fp_line (start 3.1242 -1.651) (end 3.2766 -1.651)
    (stroke (width 0.05) (type solid)) (layer "F.CrtYd") (tstamp 64c3b56e-9893-49f5-8367-6228bbe40788))
  (fp_line (start 3.1242 1.651) (end 3.1242 2.9718)
    (stroke (width 0.05) (type solid)) (layer "F.CrtYd") (tstamp 8c8940ff-6009-4f74-90e6-62f8102eed91))
  (fp_line (start 3.1242 2.9718) (end -3.1242 2.9718)
    (stroke (width 0.05) (type solid)) (layer "F.CrtYd") (tstamp f6a1ce86-747d-4346-8cbe-ed71c52ec825))
  (fp_line (start 3.2766 -1.651) (end 3.2766 1.651)
    (stroke (width 0.05) (type solid)) (layer "F.CrtYd") (tstamp cdd5f992-704a-4275-b34b-d59a09f96eeb))
  (fp_line (start 3.2766 1.651) (end 3.1242 1.651)
    (stroke (width 0.05) (type solid)) (layer "F.CrtYd") (tstamp 7c2a009d-85e4-4154-8a02-5ed6fd51921d))
  (fp_line (start -2.8702 -2.7178) (end -2.8702 2.7178)
    (stroke (width 0.1) (type solid)) (layer "F.Fab") (tstamp 172d6b03-a4be-4cff-ac34-9b84e4b169a9))
  (fp_line (start -2.8702 2.7178) (end 2.8702 2.7178)
    (stroke (width 0.1) (type solid)) (layer "F.Fab") (tstamp 1dc50773-83cc-465b-9401-fabf0c40c0d9))
  (fp_line (start 2.8702 -2.7178) (end -2.8702 -2.7178)
    (stroke (width 0.1) (type solid)) (layer "F.Fab") (tstamp b4281b35-de41-4fca-89f2-f4ae5132491f))
  (fp_line (start 2.8702 2.7178) (end 2.8702 -2.7178)
    (stroke (width 0.1) (type solid)) (layer "F.Fab") (tstamp ada643fb-3f48-4600-99c1-827569ec2e88))
  (fp_circle (center -2.6162 0) (end -2.6162 0)
    (stroke (width 0.1) (type solid)) (fill none) (layer "F.Fab") (tstamp 57252f9a-43d2-40ac-ac6f-0a32208dd743))
  (pad "1" smd rect (at -2.032 0 90) (size 2.794 1.9812) (layers "F.Cu" "F.Paste" "F.Mask") (tstamp cc35a772-bde8-4d78-a9ae-b0d5dc36a3f2))
  (pad "2" smd rect (at 2.032 0 90) (size 2.794 1.9812) (layers "F.Cu" "F.Paste" "F.Mask") (tstamp e5a35611-9515-4321-b8bf-bd5285de2550))
  (model "${KIPRJMOD}/kicad-components-library/IHLP2020CZER1R0M8A/IND_IHLP-2020CZ-8A_VIS.step"
    (offset (xyz 0 0 0))
    (scale (xyz 1 1 1))
    (rotate (xyz 0 0 0))
  )
)
