PCBNEW-LibModule-V1  2022-12-03 17:14:20
# encoding utf-8
Units mm
$INDEX
BLM41PG102SH1L
$EndINDEX
$MODULE BLM41PG102SH1L
Po 0 0 0 15 638b83ec 00000000 ~~
Li BLM41PG102SH1L
Cd BLM41 L=4.5 W=1.6 T=1.6
Kw Ferrite Bead
Sc 0
At SMD
AR 
Op 0 0 0
T0 0.000 -0 1.27 1.27 0 0.254 N V 21 N "FB**"
T1 0.000 -0 1.27 1.27 0 0.254 N I 21 N "BLM41PG102SH1L"
DS -2.25 -0.8 2.25 -0.8 0.1 24
DS 2.25 -0.8 2.25 0.8 0.1 24
DS 2.25 0.8 -2.25 0.8 0.1 24
DS -2.25 0.8 -2.25 -0.8 0.1 24
DS -4 -1.8 4 -1.8 0.1 24
DS 4 -1.8 4 1.8 0.1 24
DS 4 1.8 -4 1.8 0.1 24
DS -4 1.8 -4 -1.8 0.1 24
DS 0 -0.7 0 0.7 0.2 21
$PAD
Po -2.250 -0
Sh "1" R 1.200 1.500 0 0 900
At SMD N 00888000
Ne 0 ""
$EndPAD
$PAD
Po 2.250 -0
Sh "2" R 1.200 1.500 0 0 900
At SMD N 00888000
Ne 0 ""
$EndPAD
$EndMODULE BLM41PG102SH1L
$EndLIBRARY
