
(kicad_symbol_lib (version 20211014) (generator kicad_symbol_editor)
  (symbol "TSW-105-08-G-T-RA" (pin_names (offset 1.016)) (in_bom yes) (on_board yes)
    (property "Reference" "J" (id 0) (at -8.12 15.24 0)
      (effects (font (size 1.27 1.27)) (justify bottom left))
    )
    (property "Value" "TSW-105-08-G-T-RA" (id 1) (at -7.62 -17.78 0)
      (effects (font (size 1.27 1.27)) (justify bottom left))
    )
    (property "Footprint" "SAMTEC_TSW-105-08-G-T-RA" (id 2) (at 0 0 0)
      (effects (font (size 1.27 1.27)) (justify bottom) hide)
    )
    (property "MANUFACTURER" "Samtec" (id 4) (at 0 0 0)
      (effects (font (size 1.27 1.27)) (justify bottom) hide)
    )
    (property "PARTREV" "R" (id 5) (at 0 0 0)
      (effects (font (size 1.27 1.27)) (justify bottom) hide)
    )
    (property "STANDARD" "Manufacturer Recommendations" (id 6) (at 0 0 0)
      (effects (font (size 1.27 1.27)) (justify bottom) hide)
    )
    (symbol "TSW-105-08-G-T-RA_0_0"
      (rectangle (start -7.62 -15.24) (end 7.62 15.24)
        (stroke (width 0.254)) (fill (type background))
      )
      (pin passive line (at -12.7 12.7 0) (length 5.08)
        (name "01"
          (effects (font (size 1.016 1.016)))
        )
        (number "01"
          (effects (font (size 1.016 1.016)))
        )
      )
      (pin passive line (at -12.7 10.16 0) (length 5.08)
        (name "04"
          (effects (font (size 1.016 1.016)))
        )
        (number "04"
          (effects (font (size 1.016 1.016)))
        )
      )
      (pin passive line (at -12.7 7.62 0) (length 5.08)
        (name "07"
          (effects (font (size 1.016 1.016)))
        )
        (number "07"
          (effects (font (size 1.016 1.016)))
        )
      )
      (pin passive line (at -12.7 5.08 0) (length 5.08)
        (name "10"
          (effects (font (size 1.016 1.016)))
        )
        (number "10"
          (effects (font (size 1.016 1.016)))
        )
      )
      (pin passive line (at -12.7 2.54 0) (length 5.08)
        (name "13"
          (effects (font (size 1.016 1.016)))
        )
        (number "13"
          (effects (font (size 1.016 1.016)))
        )
      )
      (pin passive line (at 12.7 12.7 180.0) (length 5.08)
        (name "02"
          (effects (font (size 1.016 1.016)))
        )
        (number "02"
          (effects (font (size 1.016 1.016)))
        )
      )
      (pin passive line (at 12.7 10.16 180.0) (length 5.08)
        (name "05"
          (effects (font (size 1.016 1.016)))
        )
        (number "05"
          (effects (font (size 1.016 1.016)))
        )
      )
      (pin passive line (at 12.7 7.62 180.0) (length 5.08)
        (name "08"
          (effects (font (size 1.016 1.016)))
        )
        (number "08"
          (effects (font (size 1.016 1.016)))
        )
      )
      (pin passive line (at 12.7 5.08 180.0) (length 5.08)
        (name "11"
          (effects (font (size 1.016 1.016)))
        )
        (number "11"
          (effects (font (size 1.016 1.016)))
        )
      )
      (pin passive line (at 12.7 2.54 180.0) (length 5.08)
        (name "14"
          (effects (font (size 1.016 1.016)))
        )
        (number "14"
          (effects (font (size 1.016 1.016)))
        )
      )
      (pin passive line (at -12.7 -2.54 0) (length 5.08)
        (name "03"
          (effects (font (size 1.016 1.016)))
        )
        (number "03"
          (effects (font (size 1.016 1.016)))
        )
      )
      (pin passive line (at -12.7 -5.08 0) (length 5.08)
        (name "06"
          (effects (font (size 1.016 1.016)))
        )
        (number "06"
          (effects (font (size 1.016 1.016)))
        )
      )
      (pin passive line (at -12.7 -7.62 0) (length 5.08)
        (name "09"
          (effects (font (size 1.016 1.016)))
        )
        (number "09"
          (effects (font (size 1.016 1.016)))
        )
      )
      (pin passive line (at -12.7 -10.16 0) (length 5.08)
        (name "12"
          (effects (font (size 1.016 1.016)))
        )
        (number "12"
          (effects (font (size 1.016 1.016)))
        )
      )
      (pin passive line (at -12.7 -12.7 0) (length 5.08)
        (name "15"
          (effects (font (size 1.016 1.016)))
        )
        (number "15"
          (effects (font (size 1.016 1.016)))
        )
      )
    )
  )
)