(footprint "SAMTEC_TSW-105-08-G-T-RA" (version 20221018) (generator pcbnew)
  (layer "F.Cu")
  (attr through_hole)
  (fp_text reference "REF**" (at -4.175 -10.42) (layer "F.SilkS") hide
      (effects (font (size 1 1) (thickness 0.15)))
    (tstamp 5b9c1516-a41e-4cd0-bb05-c9fda9bcf892)
  )
  (fp_text value "SAMTEC_TSW-105-08-G-T-RA" (at 7.89 8.975) (layer "F.Fab") hide
      (effects (font (size 1 1) (thickness 0.15)))
    (tstamp f0c0e68d-1d76-49b5-9c7f-32da5a2c7dc0)
  )
  (fp_text user "${REFERENCE}" (at 0 0) (layer "F.Fab")
      (effects (font (size 1 1) (thickness 0.15)))
    (tstamp cdd17145-d32e-4f8b-879e-4413c42df60e)
  )
  (fp_circle (center -7 -2.77) (end -6.9 -2.77)
    (stroke (width 0.2) (type solid)) (fill none) (layer "F.SilkS") (tstamp 5406e4ba-19b9-4429-97ee-7f574ba44a8b))
  (fp_line (start -6.6 -8.785) (end 6.6 -8.785)
    (stroke (width 0.05) (type solid)) (layer "F.CrtYd") (tstamp 9f233f77-196b-4097-a89f-56973ef5f629))
  (fp_line (start -6.6 7.36) (end -6.6 -8.785)
    (stroke (width 0.05) (type solid)) (layer "F.CrtYd") (tstamp f465fe03-d805-494f-8645-a4a89f36761b))
  (fp_line (start 6.6 -8.785) (end 6.6 7.36)
    (stroke (width 0.05) (type solid)) (layer "F.CrtYd") (tstamp 9207a037-7b14-4c65-9911-2e3b3b1d2420))
  (fp_line (start 6.6 7.36) (end -6.6 7.36)
    (stroke (width 0.05) (type solid)) (layer "F.CrtYd") (tstamp f261ff61-533b-4474-9ec8-15015bf9bbeb))
  (fp_line (start -6.35 -1.27) (end 6.35 -1.27)
    (stroke (width 0.1) (type solid)) (layer "F.Fab") (tstamp 239cf4a7-b4ed-43a4-a671-dd43d10b2b47))
  (fp_line (start -6.35 1.27) (end -6.35 -1.27)
    (stroke (width 0.1) (type solid)) (layer "F.Fab") (tstamp 0bc748ee-f209-47d2-a5b7-5726df61f0bd))
  (fp_line (start -6.35 1.27) (end -6.35 7.11)
    (stroke (width 0.1) (type solid)) (layer "F.Fab") (tstamp f48bd119-35e5-4c9e-8519-2e8b01ceccdd))
  (fp_line (start -6.35 7.11) (end 6.35 7.11)
    (stroke (width 0.1) (type solid)) (layer "F.Fab") (tstamp c17afa02-de82-4916-bb72-1092bdc07f4a))
  (fp_line (start 6.35 -1.27) (end 6.35 1.27)
    (stroke (width 0.1) (type solid)) (layer "F.Fab") (tstamp 198ba8ee-f79a-480e-b775-2a42e52685d4))
  (fp_line (start 6.35 1.27) (end -6.35 1.27)
    (stroke (width 0.1) (type solid)) (layer "F.Fab") (tstamp f734d7fc-750e-4666-947d-f209c1e864bd))
  (fp_line (start 6.35 7.11) (end 6.35 1.27)
    (stroke (width 0.1) (type solid)) (layer "F.Fab") (tstamp 6b93590c-d585-46eb-beb9-636778e86fcb))
  (fp_circle (center -7 -2.77) (end -6.9 -2.77)
    (stroke (width 0.2) (type solid)) (fill none) (layer "F.Fab") (tstamp 0fd287ec-03d2-4d9e-a66e-18dab7d5cd1b))
  (pad "01" thru_hole rect (at -5.08 -2.77) (size 1.37 1.37) (drill 1.02) (layers "*.Cu" "*.Mask") (tstamp 1186f326-3287-48af-b551-beb5f3ba7d7d))
  (pad "02" thru_hole circle (at -5.08 -5.31) (size 1.37 1.37) (drill 1.02) (layers "*.Cu" "*.Mask") (tstamp 7c1e8d88-3b6c-4cbb-87e1-8cc62b3539cd))
  (pad "03" thru_hole circle (at -5.08 -7.85) (size 1.37 1.37) (drill 1.02) (layers "*.Cu" "*.Mask") (tstamp fb811eff-d2c2-4094-9bb9-9159e922c8dc))
  (pad "04" thru_hole circle (at -2.54 -2.77) (size 1.37 1.37) (drill 1.02) (layers "*.Cu" "*.Mask") (tstamp d9968f27-6b87-4f7f-9a09-e32d2d0ba89c))
  (pad "05" thru_hole circle (at -2.54 -5.31) (size 1.37 1.37) (drill 1.02) (layers "*.Cu" "*.Mask") (tstamp 0443d10d-0b7b-4ba3-a752-87a747f7a7ba))
  (pad "06" thru_hole circle (at -2.54 -7.85) (size 1.37 1.37) (drill 1.02) (layers "*.Cu" "*.Mask") (tstamp 2d870785-33e0-4076-8670-e6069fb538eb))
  (pad "07" thru_hole circle (at 0 -2.77) (size 1.37 1.37) (drill 1.02) (layers "*.Cu" "*.Mask") (tstamp 840f78f4-ed70-457c-96fd-018bf26ef890))
  (pad "08" thru_hole circle (at 0 -5.31) (size 1.37 1.37) (drill 1.02) (layers "*.Cu" "*.Mask") (tstamp 71878c98-183d-4c43-b2ff-8b672993e74e))
  (pad "09" thru_hole circle (at 0 -7.85) (size 1.37 1.37) (drill 1.02) (layers "*.Cu" "*.Mask") (tstamp 961caef0-7567-4211-9aa8-5783ed59f3dd))
  (pad "10" thru_hole circle (at 2.54 -2.77) (size 1.37 1.37) (drill 1.02) (layers "*.Cu" "*.Mask") (tstamp bccb27a2-c9a6-477d-8ebd-9c53ce10946f))
  (pad "11" thru_hole circle (at 2.54 -5.31) (size 1.37 1.37) (drill 1.02) (layers "*.Cu" "*.Mask") (tstamp 2f6df9c6-576a-42ef-b23d-06c84b7350ae))
  (pad "12" thru_hole circle (at 2.54 -7.85) (size 1.37 1.37) (drill 1.02) (layers "*.Cu" "*.Mask") (tstamp da904bc7-5b47-428d-9f48-06091ede82c9))
  (pad "13" thru_hole circle (at 5.08 -2.77) (size 1.37 1.37) (drill 1.02) (layers "*.Cu" "*.Mask") (tstamp 4d7368bc-18fa-4f7f-b5ab-ca93a56cef76))
  (pad "14" thru_hole circle (at 5.08 -5.31) (size 1.37 1.37) (drill 1.02) (layers "*.Cu" "*.Mask") (tstamp 42055cae-3302-4f54-9099-9e9a9fe5d2e3))
  (pad "15" thru_hole circle (at 5.08 -7.85) (size 1.37 1.37) (drill 1.02) (layers "*.Cu" "*.Mask") (tstamp d5b320da-422a-41f7-82f7-da0390bbcafa))
  (model "${KIPRJMOD}/kicad-components-library/TSW-q05-08-G-T-RA/TSW-105-08-G-T-RA.stp"
    (offset (xyz 0 1.254 4.25))
    (scale (xyz 1 1 1))
    (rotate (xyz 180 0 0))
  )
)
