(footprint "NRS8040" (version 20211014) (generator pcbnew)
  (layer "F.Cu")
  (tedit 6395E6FF)
  (attr smd)
  (fp_text reference "REF**" (at 0 -0.5 unlocked) (layer "F.SilkS")
    (effects (font (size 1 1) (thickness 0.15)))
    (tstamp f8d6fced-ff5a-4da1-9860-fd3eca713c5c)
  )
  (fp_text value "NRS8040" (at 0 1 unlocked) (layer "F.Fab")
    (effects (font (size 1 1) (thickness 0.15)))
    (tstamp be629f10-25ef-4689-a4c4-e8db5e13852f)
  )
  (fp_text user "${REFERENCE}" (at 0 2.5 unlocked) (layer "F.Fab")
    (effects (font (size 1 1) (thickness 0.15)))
    (tstamp b1874215-d48e-48f7-963d-8ea01e24690e)
  )
  (fp_rect (start -4 -4) (end 4 4) (layer "F.SilkS") (width 0.12) (fill none) (tstamp 71bd643c-7274-4012-afb7-c406e33045cf))
  (fp_rect (start -4.25 -4.25) (end 4.25 4.25) (layer "Margin") (width 0.12) (fill none) (tstamp 2520de5a-60d7-4535-96c1-1c396e289448))
  (pad "1" smd rect (at 0 2.8) (size 7.5 1.8) (layers "F.Cu" "F.Paste" "F.Mask") (tstamp 66a0e608-03cc-45b7-8b39-05fcf157603c))
  (pad "2" smd rect (at 0 -2.8) (size 7.5 1.8) (layers "F.Cu" "F.Paste" "F.Mask") (tstamp 22cb2e12-f5a1-485a-9ebb-e0b739ed58e4))
)
