(footprint "JST_SM06B-GHS-TB(LF)(SN)" (version 20221018) (generator pcbnew)
  (layer "F.Cu")
  (attr smd)
  (fp_text reference "REF**" (at -3.556 -3.78) (layer "F.SilkS")
      (effects (font (size 1 1) (thickness 0.15)))
    (tstamp c0ea6702-68b6-4369-b147-2a7bdc808de3)
  )
  (fp_text value "JST_SM06B-GHS-TB_LF__SN_" (at 9.525 3.84) (layer "F.Fab") hide
      (effects (font (size 1 1) (thickness 0.15)))
    (tstamp 2c7b4c8d-f933-4817-ba41-d1c439d69db9)
  )
  (fp_text user "${REFERENCE}" (at 0 1.016) (layer "F.Fab")
      (effects (font (size 1 1) (thickness 0.15)))
    (tstamp e4bf04ac-187f-42a8-af99-5b2f3b462e06)
  )
  (fp_line (start -5.375 -1.625) (end -5.375 -0.375)
    (stroke (width 0.127) (type solid)) (layer "F.SilkS") (tstamp 7e47f369-dc1a-4e66-b22a-2c099bf9fa1d))
  (fp_line (start -5.375 -1.625) (end -3.775 -1.625)
    (stroke (width 0.127) (type solid)) (layer "F.SilkS") (tstamp 65034e2b-7aa0-4ee9-a717-447e4d38bc29))
  (fp_line (start -4.125 2.425) (end 4.125 2.425)
    (stroke (width 0.127) (type solid)) (layer "F.SilkS") (tstamp 7df94f7a-676f-4ab8-9955-4a474c053de3))
  (fp_line (start 5.375 -1.625) (end 3.775 -1.625)
    (stroke (width 0.127) (type solid)) (layer "F.SilkS") (tstamp 57d383bc-9711-4610-be9f-ee623fd2809b))
  (fp_line (start 5.375 -1.625) (end 5.375 -0.375)
    (stroke (width 0.127) (type solid)) (layer "F.SilkS") (tstamp 314fbeec-fa04-442b-beec-e2c593649162))
  (fp_circle (center -6.0325 -1.875) (end -5.9325 -1.875)
    (stroke (width 0.2) (type solid)) (fill none) (layer "F.SilkS") (tstamp a5f90bef-a137-498d-948d-351928295469))
  (fp_line (start -5.725 -2.975) (end -5.725 2.925)
    (stroke (width 0.05) (type solid)) (layer "F.CrtYd") (tstamp afc44d7e-bfaa-4d6b-8f88-c5cd146f948c))
  (fp_line (start -5.725 2.925) (end 5.725 2.925)
    (stroke (width 0.05) (type solid)) (layer "F.CrtYd") (tstamp 164b5a99-30c5-44d3-a016-517233fae209))
  (fp_line (start 5.725 -2.975) (end -5.725 -2.975)
    (stroke (width 0.05) (type solid)) (layer "F.CrtYd") (tstamp 719fab75-2fbf-4aa1-997c-f7959a86e6a8))
  (fp_line (start 5.725 2.925) (end 5.725 -2.975)
    (stroke (width 0.05) (type solid)) (layer "F.CrtYd") (tstamp 8ab2e367-8443-4d3a-b215-808ec46e150d))
  (fp_line (start -5.375 -1.625) (end -5.375 2.425)
    (stroke (width 0.127) (type solid)) (layer "F.Fab") (tstamp 5b86defa-0111-47fa-96e7-e86439293437))
  (fp_line (start -5.375 2.425) (end 5.375 2.425)
    (stroke (width 0.127) (type solid)) (layer "F.Fab") (tstamp 53010a10-df2a-4804-8af8-2b29df7876e7))
  (fp_line (start 5.375 -1.625) (end -5.375 -1.625)
    (stroke (width 0.127) (type solid)) (layer "F.Fab") (tstamp 7f3051a5-ba9e-4bd3-a2d4-12e715b5ddb0))
  (fp_line (start 5.375 2.425) (end 5.375 -1.625)
    (stroke (width 0.127) (type solid)) (layer "F.Fab") (tstamp bbeadad3-c1bf-46db-8eb2-564b01291c45))
  (fp_circle (center -6.0325 -1.875) (end -5.9325 -1.875)
    (stroke (width 0.2) (type solid)) (fill none) (layer "F.Fab") (tstamp ac47976f-6411-4636-9bcf-42463f6b20f3))
  (pad "1" smd rect (at -3.125 -1.875 180) (size 0.6 1.7) (layers "F.Cu" "F.Paste" "F.Mask") (tstamp be5081f6-dc29-4724-995f-39db2d4b74e7))
  (pad "2" smd rect (at -1.875 -1.875 180) (size 0.6 1.7) (layers "F.Cu" "F.Paste" "F.Mask") (tstamp ccfb6b3a-24a4-4d7a-a60d-9d68758af8a0))
  (pad "3" smd rect (at -0.625 -1.875 180) (size 0.6 1.7) (layers "F.Cu" "F.Paste" "F.Mask") (tstamp 896392e0-4074-452d-a014-a15ee50eb391))
  (pad "4" smd rect (at 0.625 -1.875 180) (size 0.6 1.7) (layers "F.Cu" "F.Paste" "F.Mask") (tstamp efe17815-7763-4352-b8a5-44937d288951))
  (pad "5" smd rect (at 1.875 -1.875 180) (size 0.6 1.7) (layers "F.Cu" "F.Paste" "F.Mask") (tstamp 3e4c6900-3d66-4f02-8934-e16f6af6d102))
  (pad "6" smd rect (at 3.125 -1.875 180) (size 0.6 1.7) (layers "F.Cu" "F.Paste" "F.Mask") (tstamp b4503297-3892-454d-8ee1-583321ef069a))
  (pad "S1" smd rect (at -4.975 1.325 180) (size 1 2.7) (layers "F.Cu" "F.Paste" "F.Mask") (tstamp f9f4efd9-2994-416d-a13f-832e1919d570))
  (pad "S2" smd rect (at 4.975 1.325 180) (size 1 2.7) (layers "F.Cu" "F.Paste" "F.Mask") (tstamp 42b92570-2170-4656-8485-2f221aa401dd))
  (model "${KIPRJMOD}/kicad-components-library/JST_SM06B-GHS-TB(LF)(SN)/SM06B-GHS-TB_LF__SN_.step"
    (offset (xyz -5.4 -2.5 0))
    (scale (xyz 1 1 1))
    (rotate (xyz -90 0 0))
  )
)
