(footprint "L_Coilcraft_XxL4030" (version 20211014) (generator pcbnew)
  (layer "F.Cu")
  (tedit 638CF5EF)
  (descr "L_Coilcraft_XxL4030 https://www.coilcraft.com/pdfs/xfl4030.pdf")
  (tags "L Coilcraft XxL4030")
  (attr smd)
  (fp_text reference "REF**" (at 0 -3) (layer "F.SilkS")
    (effects (font (size 1 1) (thickness 0.15)))
    (tstamp 2d9940d9-90d2-4d08-84b3-68fee419064a)
  )
  (fp_text value "L_Coilcraft_XxL4030" (at 0 3) (layer "F.Fab")
    (effects (font (size 1 1) (thickness 0.15)))
    (tstamp 05bf1ba6-52e9-42aa-b3ea-3bfd4d5f7d67)
  )
  (fp_text user "${REFERENCE}" (at 0 0) (layer "F.Fab")
    (effects (font (size 1 1) (thickness 0.15)))
    (tstamp 587c639d-ff22-411f-8ae3-5ebcaf78a988)
  )
  (fp_line (start 2.154 2.154) (end -2.154 2.154) (layer "F.SilkS") (width 0.12) (tstamp cdd750cf-b953-4462-8d5d-9b46bbeb8386))
  (fp_line (start -2.154 -2.154) (end 2.154 -2.154) (layer "F.SilkS") (width 0.12) (tstamp d516643a-6ff4-4cbf-9c25-5a8609f6d2bf))
  (fp_line (start 2.26 -2.26) (end 2.26 2.26) (layer "F.CrtYd") (width 0.05) (tstamp 12d10f28-3108-4f59-adbd-5d77a6273598))
  (fp_line (start -2.26 -2.26) (end 2.26 -2.26) (layer "F.CrtYd") (width 0.05) (tstamp 15c543f0-f9aa-4448-87a6-f538ca7d207e))
  (fp_line (start -2.26 2.26) (end -2.26 -2.26) (layer "F.CrtYd") (width 0.05) (tstamp 1d66df9d-424c-48ab-bc8f-d0f983feac7f))
  (fp_line (start 2.26 2.26) (end -2.26 2.26) (layer "F.CrtYd") (width 0.05) (tstamp a4d0f65d-c528-4aee-a95f-4cbbe18556df))
  (fp_line (start 2 2) (end -2 2) (layer "F.Fab") (width 0.1) (tstamp 0c057ed2-1af6-41c9-aa25-9fa2eb1a3723))
  (fp_line (start 2 -2) (end 2 2) (layer "F.Fab") (width 0.1) (tstamp 1f2db4a5-705b-4adc-91c0-6b84ed44540c))
  (fp_line (start -2 -2) (end 2 -2) (layer "F.Fab") (width 0.1) (tstamp 8a6104d9-8f7c-40e5-b64e-e94bff0fb206))
  (fp_line (start -2 2) (end -2 -2) (layer "F.Fab") (width 0.1) (tstamp a433eb68-692f-4bde-8fd5-2508cf6bbded))
  (pad "1" smd rect (at -1.185 0) (size 0.98 3.4) (layers "F.Cu" "F.Paste" "F.Mask") (tstamp 03a2ecad-1847-4b80-ae5b-b758b4ad2d39))
  (pad "2" smd rect (at 1.185 0) (size 0.98 3.4) (layers "F.Cu" "F.Paste" "F.Mask") (tstamp 78451a64-5bdd-4900-9620-5e88b38a3630))
  (model "${KIPRJMOD}/kicad-components-library/XEL4030/IND_XEL4030-301MEC.step"
    (offset (xyz 0 0 0))
    (scale (xyz 1 1 1))
    (rotate (xyz 0 0 0))
  )
)
