PCBNEW-LibModule-V1  2022-11-27 15:25:11
# encoding utf-8
Units mm
$INDEX
MAX20405AFOAVY
$EndINDEX
$MODULE MAX20405AFOAVY
Po 0 0 0 15 63838157 00000000 ~~
Li MAX20405AFOAVY
Cd F173A3FY+6_2022-1
Kw Integrated Circuit
Sc 0
At SMD
AR 
Op 0 0 0
T0 -0.000 0.001 1.27 1.27 0 0.254 N V 21 N "IC**"
T1 -0.000 0.001 1.27 1.27 0 0.254 N I 21 N "MAX20405AFOAVY"
DS -1.75 -1.875 1.75 -1.875 0.1 24
DS 1.75 -1.875 1.75 1.875 0.1 24
DS 1.75 1.875 -1.75 1.875 0.1 24
DS -1.75 1.875 -1.75 -1.875 0.1 24
DS -3.05 -3.173 3.05 -3.173 0.1 24
DS 3.05 -3.173 3.05 3.176 0.1 24
DS 3.05 3.176 -3.05 3.176 0.1 24
DS -3.05 3.176 -3.05 -3.173 0.1 24
DS -2.6 -0.96 -2.6 -0.96 0.1 21
DS -2.5 -0.96 -2.5 -0.96 0.1 21
DA -2.55 -0.96 -2.600 -0.96 -1800 0.1 21
DA -2.55 -0.96 -2.500 -0.96 -1800 0.1 21
$PAD
Po -1.612 -0.949
Sh "1" R 0.300 0.875 0 0 900
At SMD N 00888000
Ne 0 ""
$EndPAD
$PAD
Po -1.612 -0.449
Sh "2" R 0.300 0.875 0 0 900
At SMD N 00888000
Ne 0 ""
$EndPAD
$PAD
Po -1.287 0.051
Sh "3" R 0.250 1.525 0 0 900
At SMD N 00888000
Ne 0 ""
$EndPAD
$PAD
Po -1.287 1.1
Sh "4" R 0.950 1.525 0 0 900
At SMD N 00888000
Ne 0 ""
$EndPAD
$PAD
Po 0.000 1.351
Sh "6" R 0.300 1.650 0 0 0
At SMD N 00888000
Ne 0 ""
$EndPAD
$PAD
Po 1.287 1.1
Sh "7" R 0.950 1.525 0 0 900
At SMD N 00888000
Ne 0 ""
$EndPAD
$PAD
Po 1.287 0.051
Sh "9" R 0.250 1.525 0 0 900
At SMD N 00888000
Ne 0 ""
$EndPAD
$PAD
Po 1.612 -0.449
Sh "10" R 0.300 0.875 0 0 900
At SMD N 00888000
Ne 0 ""
$EndPAD
$PAD
Po 1.612 -0.949
Sh "11" R 0.300 0.875 0 0 900
At SMD N 00888000
Ne 0 ""
$EndPAD
$PAD
Po 1.325 -1.736
Sh "12" R 0.450 0.875 0 0 0
At SMD N 00888000
Ne 0 ""
$EndPAD
$PAD
Po 0.750 -1.736
Sh "13" R 0.300 0.875 0 0 0
At SMD N 00888000
Ne 0 ""
$EndPAD
$PAD
Po 0.250 -1.736
Sh "14" R 0.300 0.875 0 0 0
At SMD N 00888000
Ne 0 ""
$EndPAD
$PAD
Po -0.250 -1.736
Sh "15" R 0.300 0.875 0 0 0
At SMD N 00888000
Ne 0 ""
$EndPAD
$PAD
Po -0.750 -1.736
Sh "16" R 0.300 0.875 0 0 0
At SMD N 00888000
Ne 0 ""
$EndPAD
$PAD
Po -1.325 -1.736
Sh "17" R 0.450 0.875 0 0 0
At SMD N 00888000
Ne 0 ""
$EndPAD
$PAD
Po -1.800 -1.474
Sh "18" R 0.350 0.500 0 0 900
At SMD N 00888000
Ne 0 ""
$EndPAD
$PAD
Po -1.325 1.876
Sh "19" R 0.450 0.600 0 0 0
At SMD N 00888000
Ne 0 ""
$EndPAD
$PAD
Po 0.000 0.401
Sh "20" R 0.250 0.600 0 0 900
At SMD N 00888000
Ne 0 ""
$EndPAD
$PAD
Po 1.325 1.876
Sh "21" R 0.450 0.600 0 0 0
At SMD N 00888000
Ne 0 ""
$EndPAD
$PAD
Po 1.800 -1.474
Sh "22" R 0.350 0.500 0 0 900
At SMD N 00888000
Ne 0 ""
$EndPAD
$EndMODULE MAX20405AFOAVY
$EndLIBRARY
