PCBNEW-LibModule-V1  2022-12-04 19:46:14
# encoding utf-8
Units mm
$INDEX
EEE0JA331XP
$EndINDEX
$MODULE EEE0JA331XP
Po 0 0 0 15 638cf906 00000000 ~~
Li EEE0JA331XP
Cd SMD_Lytic_D8
Kw Capacitor Polarised
Sc 0
At SMD
AR 
Op 0 0 0
T0 -0.425 -0 1.27 1.27 0 0.254 N V 21 N "C**"
T1 -0.425 -0 1.27 1.27 0 0.254 N I 21 N "EEE0JA331XP"
DS -5.75 -4.3 4.9 -4.3 0.05 24
DS 4.9 -4.3 4.9 4.3 0.05 24
DS 4.9 4.3 -5.75 4.3 0.05 24
DS -5.75 4.3 -5.75 -4.3 0.05 24
DS -4.875 -0 -4.875 -0 0.05000000000000071 21
DS -4.825 -0 -4.825 -0 0.05000000000000071 21
DS -3.3 -1.5 -1.5 -3.3 0.1 24
DS -1.5 -3.3 3.3 -3.3 0.1 24
DS 3.3 -3.3 3.3 3.3 0.1 24
DS 3.3 3.3 -1.5 3.3 0.1 24
DS -1.5 3.3 -3.3 1.5 0.1 24
DS -3.3 1.5 -3.3 -1.5 0.1 24
DS -3.3 -1.5 -1.5 -3.3 0.1 24
DS -3.3 -1.5 -1.5 -3.3 0.2 21
DS -1.5 -3.3 3.3 -3.3 0.2 21
DS 3.3 -3.3 3.3 -1.5 0.2 21
DS -3.3 1.5 -1.5 3.3 0.2 21
DS -1.5 3.3 3.3 3.3 0.2 21
DS 3.3 3.3 3.3 1.5 0.2 21
DA -4.85 -0 -4.875 -0 -1800 0.05000000000000071 21
DA -4.85 -0 -4.825 -0 -1800 0.05000000000000071 21
$PAD
Po -2.500 -0
Sh "1" R 1.600 3.200 0 0 900
At SMD N 00888000
Ne 0 ""
$EndPAD
$PAD
Po 2.500 -0
Sh "2" R 1.600 3.200 0 0 900
At SMD N 00888000
Ne 0 ""
$EndPAD
$EndMODULE EEE0JA331XP
$EndLIBRARY
