(footprint "SSQ-106-03-L-S" (version 20211014) (generator pcbnew)
  (layer "F.Cu")
  (tedit 637A9DF6)
  (descr "Through hole straight pin header, 1x06, 2.54mm pitch, single row")
  (tags "Through hole pin header THT 1x06 2.54mm single row")
  (attr through_hole)
  (fp_text reference "REF**" (at 0 -2.33) (layer "F.SilkS")
    (effects (font (size 1 1) (thickness 0.15)))
    (tstamp f50cd875-ad61-4c78-ac8d-eee39512d049)
  )
  (fp_text value "PinHeader_1x06_P2.54mm_Vertical" (at 0 15.03) (layer "F.Fab")
    (effects (font (size 1 1) (thickness 0.15)))
    (tstamp a0f6403e-976f-4af5-ba62-8ec7d1aa5e2d)
  )
  (fp_text user "${REFERENCE}" (at 0 6.35 90) (layer "F.Fab")
    (effects (font (size 1 1) (thickness 0.15)))
    (tstamp d3623428-dbf8-43d4-b612-2f58f5bb2b60)
  )
  (fp_line (start -1.33 1.27) (end -1.33 14.03) (layer "F.SilkS") (width 0.12) (tstamp 3a1001b8-c1e6-4fcb-9135-c1c0310a879f))
  (fp_line (start -1.33 0) (end -1.33 -1.33) (layer "F.SilkS") (width 0.12) (tstamp 6e9c7cc1-e9a0-41e2-bc38-6563eaec720c))
  (fp_line (start -1.33 -1.33) (end 0 -1.33) (layer "F.SilkS") (width 0.12) (tstamp d254e54c-2929-4933-821a-53081b9ae3cf))
  (fp_line (start -1.33 1.27) (end 1.33 1.27) (layer "F.SilkS") (width 0.12) (tstamp d3d5bb20-e845-4d85-adad-b79ea9e39827))
  (fp_line (start -1.33 14.03) (end 1.33 14.03) (layer "F.SilkS") (width 0.12) (tstamp e4b6d20a-3f18-453e-b00e-787d4e134e56))
  (fp_line (start 1.33 1.27) (end 1.33 14.03) (layer "F.SilkS") (width 0.12) (tstamp e655880d-3ea7-40b4-8589-b010ca372ef5))
  (fp_line (start 1.8 14.5) (end 1.8 -1.8) (layer "F.CrtYd") (width 0.05) (tstamp 1a8a7c24-9121-445b-aa55-b3ae90eef583))
  (fp_line (start 1.8 -1.8) (end -1.8 -1.8) (layer "F.CrtYd") (width 0.05) (tstamp 5502933d-b36d-4c62-b764-5a2d390b494d))
  (fp_line (start -1.8 14.5) (end 1.8 14.5) (layer "F.CrtYd") (width 0.05) (tstamp 75bddfb1-ae2f-472a-b1b7-6051f75df1ca))
  (fp_line (start -1.8 -1.8) (end -1.8 14.5) (layer "F.CrtYd") (width 0.05) (tstamp b9a48b47-1d8a-4730-b799-3c63b02654dd))
  (fp_line (start -0.635 -1.27) (end 1.27 -1.27) (layer "F.Fab") (width 0.1) (tstamp 54182105-4bfc-483e-b0b8-72fb0d9ae522))
  (fp_line (start 1.27 -1.27) (end 1.27 13.97) (layer "F.Fab") (width 0.1) (tstamp 883128b9-3d33-4a05-a840-4273cc89ded5))
  (fp_line (start -1.27 -0.635) (end -0.635 -1.27) (layer "F.Fab") (width 0.1) (tstamp c5b4dc85-54ea-4c46-ad89-45da8621e5ad))
  (fp_line (start 1.27 13.97) (end -1.27 13.97) (layer "F.Fab") (width 0.1) (tstamp d8e5351f-8092-40a9-8df4-4700f2edeb7f))
  (fp_line (start -1.27 13.97) (end -1.27 -0.635) (layer "F.Fab") (width 0.1) (tstamp fef1ddcf-17c1-44dd-81ee-7e43ec9bf7e5))
  (pad "1" thru_hole rect (at 0 0) (size 1.7 1.7) (drill 1) (layers *.Cu *.Mask) (tstamp a031e248-75c7-4b07-9f28-fc9c300b43f6))
  (pad "2" thru_hole oval (at 0 2.54) (size 1.7 1.7) (drill 1) (layers *.Cu *.Mask) (tstamp 40d62885-ceb8-4c17-8b34-716b386af5cb))
  (pad "3" thru_hole oval (at 0 5.08) (size 1.7 1.7) (drill 1) (layers *.Cu *.Mask) (tstamp 01ab6706-7706-4328-a6eb-ebc3eb410c3c))
  (pad "4" thru_hole oval (at 0 7.62) (size 1.7 1.7) (drill 1) (layers *.Cu *.Mask) (tstamp ed05ba03-1e59-4764-8823-f63056f52720))
  (pad "5" thru_hole oval (at 0 10.16) (size 1.7 1.7) (drill 1) (layers *.Cu *.Mask) (tstamp 3361c9a3-c4cc-47dc-ac72-a9c418921124))
  (pad "6" thru_hole oval (at 0 12.7) (size 1.7 1.7) (drill 1) (layers *.Cu *.Mask) (tstamp 30d686b6-b79d-4837-a792-ba6d6ea1579e))
  (model "${KIPRJMOD}/kicad-components-library/SSQ-106-03-L-S/SSQ-106-03-L-S.stp"
    (offset (xyz 0 -6.4 0))
    (scale (xyz 1 1 1))
    (rotate (xyz -90 0 90))
  )
)
