(footprint "Sensirion_DFN-8-1EP" (version 20211014) (generator pcbnew)
  (layer "F.Cu")
  (tedit 6395F664)
  (descr "Sensirion DFN-8 SHT3x-DIS (https://www.sensirion.com/fileadmin/user_upload/customers/sensirion/Dokumente/2_Humidity_Sensors/Datasheets/Sensirion_Humidity_Sensors_SHT3x_Datasheet_digital.pdf)")
  (tags "sensirion dfn nolead")
  (property "MANUFACTURER" "Sensirion AG")
  (property "MFG_PART_NUMBER" "SHT31-DIS-B2.5KS")
  (property "OOTPRINT_FORMATED" "SMD IC 9Pad")
  (property "SUPPLIER" "JLCPCB")
  (property "SUPPLIER 2" "MOUSER")
  (property "SUPPLIER_NUMBER" "C80862")
  (property "SUPPLIER_NUMBER_2" "403-SHT31-DIS-B")
  (property "Sheetfile" "rpi-hat.kicad_sch")
  (property "Sheetname" "")
  (attr smd)
  (fp_text reference "U102" (at 0 -2.25) (layer "F.SilkS") hide
    (effects (font (size 1 1) (thickness 0.15)))
    (tstamp e5309fbc-6e0a-408c-9d10-e24fa0cc63b8)
  )
  (fp_text value "SHT31-DIS" (at 0 2.5) (layer "F.Fab")
    (effects (font (size 1 1) (thickness 0.15)))
    (tstamp ab1405a0-5525-409f-a30d-6955c081ad96)
  )
  (fp_text user "${REFERENCE}" (at 0 0) (layer "F.Fab")
    (effects (font (size 0.4 0.4) (thickness 0.06)))
    (tstamp 2b3bba05-4963-4ffc-af86-5c55132c90f1)
  )
  (fp_line (start -1.09 -1.41) (end 0.65 -1.41) (layer "F.SilkS") (width 0.12) (tstamp 376b902c-61fd-46fb-82e9-32190bffd7ad))
  (fp_line (start -0.65 1.41) (end 0.65 1.41) (layer "F.SilkS") (width 0.12) (tstamp fef20625-d7dd-4dec-b623-3f725f5c36fe))
  (fp_line (start -1.7 -1.5) (end -1.7 1.5) (layer "F.CrtYd") (width 0.05) (tstamp 1240ab57-55e8-4861-9481-38993679f1f9))
  (fp_line (start 1.7 -1.5) (end 1.7 1.5) (layer "F.CrtYd") (width 0.05) (tstamp 36dbb037-30a4-485e-9326-8c5e80cfa46d))
  (fp_line (start -1.7 -1.5) (end 1.7 -1.5) (layer "F.CrtYd") (width 0.05) (tstamp 38804603-61c4-46c5-83a2-7b6adbe62feb))
  (fp_line (start -1.7 1.5) (end 1.7 1.5) (layer "F.CrtYd") (width 0.05) (tstamp 80c7edcf-6ab0-4f17-9413-b7d1f070ef70))
  (fp_line (start 1.25 1.25) (end -1.25 1.25) (layer "F.Fab") (width 0.1) (tstamp 28176608-3a73-4125-bc41-ff2cee79bc0c))
  (fp_line (start 1.25 -1.25) (end 1.25 1.25) (layer "F.Fab") (width 0.1) (tstamp 61b47361-24c6-4ee0-813a-51adbf40be19))
  (fp_line (start -1.25 1.25) (end -1.25 -0.75) (layer "F.Fab") (width 0.1) (tstamp 9a03f5cf-92d5-4c05-9af4-bfdc0d15f77e))
  (fp_line (start -1.25 -0.75) (end -0.75 -1.25) (layer "F.Fab") (width 0.1) (tstamp a2df62e2-d2a9-4cac-ad55-5f7c2e3df1fd))
  (fp_line (start -0.75 -1.25) (end 1.25 -1.25) (layer "F.Fab") (width 0.1) (tstamp bfa15232-0c10-40c7-a34b-757f1000a55a))
  (pad "" smd custom (at 0 0) (size 0.9 0.9) (layers "F.Paste")
    (zone_connect 0)
    (options (clearance outline) (anchor rect))
    (primitives
      (gr_poly (pts
          (xy 0.45 0.8)
          (xy -0.45 0.8)
          (xy -0.45 -0.53)
          (xy -0.18 -0.8)
          (xy 0.45 -0.8)
        ) (width 0) (fill yes))
    ) (tstamp 5314a85f-a0e7-4622-b813-bb3d355c329d))
  (pad "1" smd rect (at -1.175 -0.75) (size 0.55 0.25) (layers "F.Cu" "F.Paste" "F.Mask") (tstamp 87694fea-2467-4a5d-b2ac-1c432834aee3))
  (pad "2" smd rect (at -1.175 -0.25) (size 0.55 0.25) (layers "F.Cu" "F.Paste" "F.Mask") (tstamp 8554a89b-2dda-43ca-8f8e-1ef7cc53dd09))
  (pad "3" smd rect (at -1.175 0.25) (size 0.55 0.25) (layers "F.Cu" "F.Paste" "F.Mask") (tstamp d112ad77-1d86-4195-9ac5-c9fd7bdd4645))
  (pad "4" smd rect (at -1.175 0.75 180) (size 0.55 0.25) (layers "F.Cu" "F.Paste" "F.Mask") (tstamp 83525565-7bb7-4983-b805-3cd3755f4568))
  (pad "5" smd rect (at 1.175 0.75) (size 0.55 0.25) (layers "F.Cu" "F.Paste" "F.Mask") (tstamp 453ef71a-d9bf-47fd-bc55-e293468b8932))
  (pad "6" smd rect (at 1.175 0.25) (size 0.55 0.25) (layers "F.Cu" "F.Paste" "F.Mask") (tstamp a03288ab-a2dc-48f7-89a9-53a53b81d5bf))
  (pad "7" smd rect (at 1.175 -0.25) (size 0.55 0.25) (layers "F.Cu" "F.Paste" "F.Mask") (tstamp df1d8fec-d06e-4313-9791-37fd0bc0927d))
  (pad "8" smd rect (at 1.175 -0.75) (size 0.55 0.25) (layers "F.Cu" "F.Paste" "F.Mask") (tstamp b8aff69c-3391-4bc6-a563-f9464b47fb72))
  (pad "9" smd custom (at 0 0) (size 1 1) (layers "F.Cu" "F.Mask")
    (zone_connect 0)
    (options (clearance outline) (anchor circle))
    (primitives
      (gr_poly (pts
          (xy 0.5 0.85)
          (xy -0.5 0.85)
          (xy -0.5 -0.55)
          (xy -0.2 -0.85)
          (xy 0.5 -0.85)
        ) (width 0) (fill yes))
    ) (tstamp b5148629-93f0-40c6-bd53-814a2bec620b))
  (model "${KIPRJMOD}/kicad-components-library/SHT31/SHT31.STEP"
    (offset (xyz 0 0 0))
    (scale (xyz 1 1 1))
    (rotate (xyz -90 0 0))
  )
)
