PCBNEW-LibModule-V1  2022-12-01 13:53:41
# encoding utf-8
Units mm
$INDEX
T529P
$EndINDEX
$MODULE T529P
Po 0 0 0 15 6388b1e5 00000000 ~~
Li T529P
Cd T529P
Kw Capacitor Polarised
Sc 0
At SMD
AR 
Op 0 0 0
T0 0 0 1.27 1.27 0 0.254 N V 21 N "C**"
T1 0 0 1.27 1.27 0 0.254 N I 21 N "T529P"
DS -1 -0.625 1 -0.625 0.2 24
DS 1 -0.625 1 0.625 0.2 24
DS 1 0.625 -1 0.625 0.2 24
DS -1 0.625 -1 -0.625 0.2 24
DS -2 -1.625 2 -1.625 0.05 24
DS 2 -1.625 2 1.625 0.05 24
DS 2 1.625 -2 1.625 0.05 24
DS -2 1.625 -2 -1.625 0.05 24
DC -1.6125 0 -1.6625 0 0.254 21
$PAD
Po -0.7625 0
Sh "1" R 0.8 0.9 0 0 0
At SMD N 00888000
Ne 0 ""
$EndPAD
$PAD
Po 0.7625 0
Sh "2" R 0.8 0.9 0 0 0
At SMD N 00888000
Ne 0 ""
$EndPAD
$EndMODULE T529P
$EndLIBRARY
