PCBNEW-LibModule-V1  2022-11-08 20:22:09
# encoding utf-8
Units mm
$INDEX
BSC010N04LSATMA1
$EndINDEX
$MODULE BSC010N04LSATMA1
Po 0 0 0 15 636aba71 00000000 ~~
Li BSC010N04LSATMA1
Cd BSC010N04LSATMA1
Kw MOSFET (N-Channel)
Sc 0
At SMD
AR 
Op 0 0 0
T0 0.000 -0 1.27 1.27 0 0.254 N V 21 N "Q**"
T1 0.000 -0 1.27 1.27 0 0.254 N I 21 N "BSC010N04LSATMA1"
DS -2.538 2.95 2.538 2.95 0.1 24
DS 2.538 2.95 2.538 -2.95 0.1 24
DS 2.538 -2.95 -2.538 -2.95 0.1 24
DS -2.538 -2.95 -2.538 2.95 0.1 24
DS -3.538 -4.325 3.538 -4.325 0.1 24
DS 3.538 -4.325 3.538 4.325 0.1 24
DS 3.538 4.325 -3.538 4.325 0.1 24
DS -3.538 4.325 -3.538 -4.325 0.1 24
DS -2.4 -2.95 -2.538 -2.95 0.2 21
DS -2.538 -2.95 -2.538 2.95 0.2 21
DS -2.538 2.95 -2.4 2.95 0.2 21
DS 2.538 2.95 2.538 -2.925 0.2 21
DS -1.825 3.7 -1.825 3.7 0.1 21
DS -1.825 3.8 -1.825 3.8 0.1 21
DA -1.825 3.75 -1.825 3.7 -1800 0.1 21
DA -1.825 3.75 -1.825 3.8 -1800 0.1 21
$PAD
Po -1.825 3.075
Sh "1" R 0.500 0.500 0 0 900
At SMD N 00888000
Ne 0 ""
$EndPAD
$PAD
Po -0.555 3.075
Sh "2" R 0.500 0.500 0 0 900
At SMD N 00888000
Ne 0 ""
$EndPAD
$PAD
Po 0.715 3.075
Sh "3" R 0.500 0.500 0 0 900
At SMD N 00888000
Ne 0 ""
$EndPAD
$PAD
Po 1.985 2.775
Sh "4" R 0.500 1.100 0 0 0
At SMD N 00888000
Ne 0 ""
$EndPAD
$PAD
Po 1.905 -2.925
Sh "5" R 0.600 0.800 0 0 0
At SMD N 00888000
Ne 0 ""
$EndPAD
$PAD
Po 0.635 -2.925
Sh "6" R 0.600 0.800 0 0 0
At SMD N 00888000
Ne 0 ""
$EndPAD
$PAD
Po -0.635 -2.925
Sh "7" R 0.600 0.800 0 0 0
At SMD N 00888000
Ne 0 ""
$EndPAD
$PAD
Po -1.905 -2.925
Sh "8" R 0.600 0.800 0 0 0
At SMD N 00888000
Ne 0 ""
$EndPAD
$PAD
Po 0.000 -0.65
Sh "9" R 3.750 4.410 0 0 900
At SMD N 00888000
Ne 0 ""
$EndPAD
$PAD
Po -0.635 2.525
Sh "10" R 0.600 3.200 0 0 900
At SMD N 00888000
Ne 0 ""
$EndPAD
$EndMODULE BSC010N04LSATMA1
$EndLIBRARY
