(kicad_pcb (version 20230517) (generator pcbnew)

  (general
    (thickness 1.6)
  )

  (paper "A4")
  (layers
    (0 "F.Cu" signal)
    (31 "B.Cu" signal)
    (32 "B.Adhes" user "B.Adhesive")
    (33 "F.Adhes" user "F.Adhesive")
    (34 "B.Paste" user)
    (35 "F.Paste" user)
    (36 "B.SilkS" user "B.Silkscreen")
    (37 "F.SilkS" user "F.Silkscreen")
    (38 "B.Mask" user)
    (39 "F.Mask" user)
    (40 "Dwgs.User" user "User.Drawings")
    (41 "Cmts.User" user "User.Comments")
    (42 "Eco1.User" user "User.Eco1")
    (43 "Eco2.User" user "User.Eco2")
    (44 "Edge.Cuts" user)
    (45 "Margin" user)
    (46 "B.CrtYd" user "B.Courtyard")
    (47 "F.CrtYd" user "F.Courtyard")
    (48 "B.Fab" user)
    (49 "F.Fab" user)
    (50 "User.1" user)
    (51 "User.2" user)
    (52 "User.3" user)
    (53 "User.4" user)
    (54 "User.5" user)
    (55 "User.6" user)
    (56 "User.7" user)
    (57 "User.8" user)
    (58 "User.9" user)
  )

  (setup
    (stackup
      (layer "F.SilkS" (type "Top Silk Screen"))
      (layer "F.Paste" (type "Top Solder Paste"))
      (layer "F.Mask" (type "Top Solder Mask") (thickness 0.01))
      (layer "F.Cu" (type "copper") (thickness 0.035))
      (layer "dielectric 1" (type "core") (thickness 1.51) (material "FR4") (epsilon_r 4.5) (loss_tangent 0.02))
      (layer "B.Cu" (type "copper") (thickness 0.035))
      (layer "B.Mask" (type "Bottom Solder Mask") (thickness 0.01))
      (layer "B.Paste" (type "Bottom Solder Paste"))
      (layer "B.SilkS" (type "Bottom Silk Screen"))
      (copper_finish "None")
      (dielectric_constraints no)
    )
    (pad_to_mask_clearance 0)
    (aux_axis_origin 154.275 82.925)
    (pcbplotparams
      (layerselection 0x00010fc_ffffffff)
      (plot_on_all_layers_selection 0x0000000_00000000)
      (disableapertmacros false)
      (usegerberextensions false)
      (usegerberattributes true)
      (usegerberadvancedattributes true)
      (creategerberjobfile true)
      (dashed_line_dash_ratio 12.000000)
      (dashed_line_gap_ratio 3.000000)
      (svgprecision 4)
      (plotframeref false)
      (viasonmask false)
      (mode 1)
      (useauxorigin false)
      (hpglpennumber 1)
      (hpglpenspeed 20)
      (hpglpendiameter 15.000000)
      (pdf_front_fp_property_popups true)
      (pdf_back_fp_property_popups true)
      (dxfpolygonmode true)
      (dxfimperialunits true)
      (dxfusepcbnewfont true)
      (psnegative false)
      (psa4output false)
      (plotreference true)
      (plotvalue true)
      (plotinvisibletext false)
      (sketchpadsonfab false)
      (subtractmaskfromsilk false)
      (outputformat 1)
      (mirror false)
      (drillshape 1)
      (scaleselection 1)
      (outputdirectory "")
    )
  )

  (net 0 "")
  (net 1 "Net-(J1-Pad1)")
  (net 2 "GND")

  (footprint "searchwing_components:63012242121508" (layer "F.Cu")
    (tstamp 0c246a7f-1fb4-4956-aa1f-56b7141e0b6e)
    (at 150 70.125 180)
    (descr "<b>6.35SQ Flange Round Post Rear Mount Bulkhead for PCB 1.6mm")
    (property "DATASHEET-URL" "https://www.we-online.com/catalog/datasheet/63012242121508.pdf")
    (property "GENDER" "Jack")
    (property "INTERFACE" "MIL-STD-348")
    (property "MOUNT" "SMT")
    (property "ORIENTATION-TYPE" "End Launch")
    (property "PART-NUMBER" "63012242121508")
    (property "Sheetfile" "sma-epoxy-adapter-board.kicad_sch")
    (property "Sheetname" "")
    (property "VALUE" "63012242121508")
    (property "Z" "50Ohm")
    (path "/ed8373fe-6aea-447b-9086-e1956a7cded6")
    (attr smd)
    (fp_text reference "J2" (at 7.775 -0.935 180) (layer "F.SilkS") hide (tstamp 482360a3-ab80-4b9c-a417-8b52f4d87c13)
      (effects (font (size 1 1) (thickness 0.15)))
    )
    (fp_text value "63012242121508" (at 0 0 180) (layer "Dwgs.User") (tstamp 3fa3ca18-f844-4eff-96b0-3825fe331d80)
      (effects (font (size 0.7 0.7) (thickness 0.15)))
    )
    (fp_line (start -1.2 2.8) (end -1.5 2.8)
      (stroke (width 0.05) (type solid)) (layer "Dwgs.User") (tstamp 0448a4ee-9267-40ae-b51d-02492ae55b0e))
    (fp_line (start -1.5 2.8) (end -2.2 2.2)
      (stroke (width 0.05) (type solid)) (layer "Dwgs.User") (tstamp da4da777-f28c-4618-b966-f94a94630e09))
    (fp_line (start -2.2 2.2) (end -2 2.2)
      (stroke (width 0.05) (type solid)) (layer "Dwgs.User") (tstamp 9f848d38-1619-45a5-be8e-36fd7be9a569))
    (fp_line (start -2.2 2.2) (end -2.2 2.4)
      (stroke (width 0.05) (type solid)) (layer "Dwgs.User") (tstamp 60f1277b-2ce8-4d2a-9835-f2ea432864b8))
    (fp_poly
      (pts
        (xy -3.6 -2.3)
        (xy 3.6 -2.3)
        (xy 3.6 2.3)
        (xy -3.6 2.3)
      )
      (stroke (width 0.1) (type solid)) (fill solid) (layer "F.CrtYd") (tstamp 31ab5659-25eb-4315-a2a2-53c3d0cf8800))
    (fp_line (start 3.2 13.7) (end 2.9 14)
      (stroke (width 0.1) (type solid)) (layer "F.Fab") (tstamp 163bc87c-0b78-4ec2-b3ca-eec2b3e96591))
    (fp_line (start 3.2 5.3) (end 3.2 13.7)
      (stroke (width 0.1) (type solid)) (layer "F.Fab") (tstamp a32b4314-5352-4c36-9e18-84aab5da9227))
    (fp_line (start 3.175 3.7) (end 2.9 3.7)
      (stroke (width 0.1) (type solid)) (layer "F.Fab") (tstamp 20271bd1-d62c-476a-a02a-50ab4b567934))
    (fp_line (start 3.175 2.05) (end 3.175 3.7)
      (stroke (width 0.1) (type solid)) (layer "F.Fab") (tstamp 55d5e571-2e85-48ed-bdf4-a1961110f976))
    (fp_line (start 3.175 2.05) (end 3.175 -1.76)
      (stroke (width 0.1) (type solid)) (layer "F.Fab") (tstamp 641be36c-6f94-4945-b14f-1cdaa2e6cb38))
    (fp_line (start 3.175 -1.76) (end 2.365 -1.76)
      (stroke (width 0.1) (type solid)) (layer "F.Fab") (tstamp 8345ea65-236f-4ea4-bba8-cdfef86c5707))
    (fp_line (start 2.9 14) (end 2.9 14.75)
      (stroke (width 0.1) (type solid)) (layer "F.Fab") (tstamp 97d520b8-3b5f-41de-88e0-388e1e71451f))
    (fp_line (start 2.9 5.1) (end 3.2 5.3)
      (stroke (width 0.1) (type solid)) (layer "F.Fab") (tstamp 0745c3aa-c35f-4709-ae24-ff92f6a37ecf))
    (fp_line (start 2.9 3.7) (end 2.9 5.1)
      (stroke (width 0.1) (type solid)) (layer "F.Fab") (tstamp 6c6366ad-3cfc-4ee5-b417-c2409b60302a))
    (fp_line (start 2.365 -1.76) (end 2.365 2.05)
      (stroke (width 0.1) (type solid)) (layer "F.Fab") (tstamp 4e7b0e8b-6bc0-4109-90d3-8f57e5ad8a6e))
    (fp_line (start 0.38 2.05) (end 3.175 2.05)
      (stroke (width 0.1) (type solid)) (layer "F.Fab") (tstamp b1a23978-9218-43d9-8366-2a8b24a8c74a))
    (fp_line (start 0.38 -1.76) (end 0.38 2.05)
      (stroke (width 0.1) (type solid)) (layer "F.Fab") (tstamp d371bb9e-5f48-42cf-a84a-632363751476))
    (fp_line (start -0.38 2.05) (end 0.38 2.05)
      (stroke (width 0.1) (type solid)) (layer "F.Fab") (tstamp 6d0b16e3-cb6f-4943-ad77-4de19e5bbade))
    (fp_line (start -0.38 2.05) (end -0.38 -1.76)
      (stroke (width 0.1) (type solid)) (layer "F.Fab") (tstamp 2595f78b-e6ad-41af-835c-837ecb6b3737))
    (fp_line (start -0.38 -1.76) (end 0.38 -1.76)
      (stroke (width 0.1) (type solid)) (layer "F.Fab") (tstamp 4d0d9487-28ba-49ef-b2f3-7d0a5955d39d))
    (fp_line (start -2.365 2.05) (end -0.38 2.05)
      (stroke (width 0.1) (type solid)) (layer "F.Fab") (tstamp 5686c0af-83a8-4c4b-a2c5-61cfaae40a85))
    (fp_line (start -2.365 -1.76) (end -2.365 2.05)
      (stroke (width 0.1) (type solid)) (layer "F.Fab") (tstamp 86f85b1b-6943-4808-81c5-fce37b8d5afc))
    (fp_line (start -2.9 14.75) (end 2.9 14.75)
      (stroke (width 0.1) (type solid)) (layer "F.Fab") (tstamp 45eb2c25-356e-434c-8d0c-a6b396565013))
    (fp_line (start -2.9 14) (end -2.9 14.75)
      (stroke (width 0.1) (type solid)) (layer "F.Fab") (tstamp 63f27a07-905e-4ba1-afc7-7bb35b28cc04))
    (fp_line (start -2.9 5.1) (end -3.2 5.3)
      (stroke (width 0.1) (type solid)) (layer "F.Fab") (tstamp 2b1523e6-aba9-444b-8c17-d256b742e974))
    (fp_line (start -2.9 3.7) (end -2.9 5.1)
      (stroke (width 0.1) (type solid)) (layer "F.Fab") (tstamp 98713e04-aef8-460b-89d6-d3b4765939ba))
    (fp_line (start -3.175 3.7) (end -2.9 3.7)
      (stroke (width 0.1) (type solid)) (layer "F.Fab") (tstamp c2ef67b7-1612-4c34-abd1-6d3bcfe42558))
    (fp_line (start -3.175 2.05) (end -2.365 2.05)
      (stroke (width 0.1) (type solid)) (layer "F.Fab") (tstamp df4371ac-e019-41ab-af78-8afe926e933d))
    (fp_line (start -3.175 2.05) (end -3.175 3.7)
      (stroke (width 0.1) (type solid)) (layer "F.Fab") (tstamp 1a9b4971-fb17-45b4-a81c-c37f33000e44))
    (fp_line (start -3.175 2.05) (end -3.175 -1.76)
      (stroke (width 0.1) (type solid)) (layer "F.Fab") (tstamp d545ea7f-43fe-4c12-b348-dcc8f5d62c66))
    (fp_line (start -3.175 -1.76) (end -2.365 -1.76)
      (stroke (width 0.1) (type solid)) (layer "F.Fab") (tstamp 78883deb-6c42-4511-a6a4-6bc4468d024d))
    (fp_line (start -3.2 13.7) (end -2.9 14)
      (stroke (width 0.1) (type solid)) (layer "F.Fab") (tstamp be42ae0c-abdb-4d26-b006-bc6f2ff3b469))
    (fp_line (start -3.2 5.3) (end -3.2 13.7)
      (stroke (width 0.1) (type solid)) (layer "F.Fab") (tstamp 9688a20d-459a-4b28-8c00-64be84fee7b6))
    (fp_text user "PCB END" (at -1.1 3 180) (layer "Dwgs.User") (tstamp 4935e17f-a76a-4045-8cc8-28779b767d5a)
      (effects (font (size 0.32 0.32) (thickness 0.15)))
    )
    (fp_text user "PCB Thickness: 1.6mm" (at -2.1 3.8 180) (layer "Dwgs.User") (tstamp 74e08b71-e229-488f-ac8c-0544cd64839e)
      (effects (font (size 0.24 0.24) (thickness 0.15)))
    )
    (pad "1" smd rect (at 0 0 180) (size 0.9 4.1) (layers "F.Cu" "F.Paste" "F.Mask")
      (net 1 "Net-(J1-Pad1)") (pintype "passive") (tstamp b478d9d2-52b5-49bd-8f95-ed4a82732b22))
    (pad "2" smd rect (at -2.775 0 180) (size 1.25 4.1) (layers "F.Cu" "F.Paste" "F.Mask")
      (net 2 "GND") (pintype "passive") (tstamp 01b9373d-5647-4ec4-8f45-f29b0f26151d))
    (pad "3" smd rect (at 2.775 0 180) (size 1.25 4.1) (layers "F.Cu" "F.Paste" "F.Mask")
      (net 2 "GND") (pintype "passive") (tstamp ef652bb6-3a08-4768-93fd-23a21a5ef605))
    (pad "4" smd rect (at -2.775 0 180) (size 1.25 4.1) (layers "B.Cu" "B.Paste" "B.Mask")
      (net 2 "GND") (pintype "passive") (tstamp 59026135-b8d0-4b23-9acf-c3c0ba4ea7f0))
    (pad "5" smd rect (at 2.775 0 180) (size 1.25 4.1) (layers "B.Cu" "B.Paste" "B.Mask")
      (net 2 "GND") (pintype "passive") (tstamp 5da27202-33f2-4191-902f-2a474dd8d0eb))
    (model "${KIPRJMOD}/kicad-components-library/63012242121508/63012242121508.step"
      (offset (xyz 0 -2 0.5))
      (scale (xyz 1 1 1))
      (rotate (xyz -90 0 0))
    )
  )

  (footprint "searchwing_components:63012242121508" (layer "F.Cu")
    (tstamp 7ed37978-c649-41a2-affb-5e349ecc338d)
    (at 147.925 79.275 -90)
    (descr "<b>6.35SQ Flange Round Post Rear Mount Bulkhead for PCB 1.6mm")
    (property "DATASHEET-URL" "https://www.we-online.com/catalog/datasheet/63012242121508.pdf")
    (property "GENDER" "Jack")
    (property "INTERFACE" "MIL-STD-348")
    (property "MOUNT" "SMT")
    (property "ORIENTATION-TYPE" "End Launch")
    (property "PART-NUMBER" "63012242121508")
    (property "Sheetfile" "sma-epoxy-adapter-board.kicad_sch")
    (property "Sheetname" "")
    (property "VALUE" "63012242121508")
    (property "Z" "50Ohm")
    (path "/78c5a5de-8c34-4d5d-ae15-807ca0cc4a51")
    (attr smd)
    (fp_text reference "J1" (at 2.525 -3.675 90) (layer "F.SilkS") hide (tstamp 6f9c3092-8450-433b-b2f3-5c5b12437f08)
      (effects (font (size 1 1) (thickness 0.15)))
    )
    (fp_text value "63012242121508" (at 0 0 90) (layer "Dwgs.User") (tstamp 2e3f031a-a7a6-4814-917c-50f6b9dba8cd)
      (effects (font (size 0.7 0.7) (thickness 0.15)))
    )
    (fp_line (start -1.5 2.8) (end -2.2 2.2)
      (stroke (width 0.05) (type solid)) (layer "Dwgs.User") (tstamp fd5810f8-e62c-409c-9c9a-f4948c91691c))
    (fp_line (start -1.2 2.8) (end -1.5 2.8)
      (stroke (width 0.05) (type solid)) (layer "Dwgs.User") (tstamp 0b446ba8-e692-4ae5-940b-617ec87d95ee))
    (fp_line (start -2.2 2.2) (end -2.2 2.4)
      (stroke (width 0.05) (type solid)) (layer "Dwgs.User") (tstamp 47658d8e-46fc-4a6c-aa8c-a0ba19ee0a02))
    (fp_line (start -2.2 2.2) (end -2 2.2)
      (stroke (width 0.05) (type solid)) (layer "Dwgs.User") (tstamp ee0d1036-9f85-4f22-80c9-6c1a01300324))
    (fp_poly
      (pts
        (xy -3.6 -2.3)
        (xy 3.6 -2.3)
        (xy 3.6 2.3)
        (xy -3.6 2.3)
      )
      (stroke (width 0.1) (type solid)) (fill solid) (layer "F.CrtYd") (tstamp c50a3837-1ef9-4743-8df2-2c92fce495b7))
    (fp_line (start -2.9 14.75) (end 2.9 14.75)
      (stroke (width 0.1) (type solid)) (layer "F.Fab") (tstamp 8a9fbd66-6464-4e14-bd06-e372d05aa816))
    (fp_line (start -2.9 14) (end -2.9 14.75)
      (stroke (width 0.1) (type solid)) (layer "F.Fab") (tstamp 86814bcb-ceb4-4466-a0d8-615aa6ea4b5c))
    (fp_line (start 2.9 14) (end 2.9 14.75)
      (stroke (width 0.1) (type solid)) (layer "F.Fab") (tstamp 8050f84f-a19e-4e3b-9ec0-e94ff13c9bab))
    (fp_line (start -3.2 13.7) (end -2.9 14)
      (stroke (width 0.1) (type solid)) (layer "F.Fab") (tstamp cba24e0c-d90f-4b94-89f0-4b80632a2a4a))
    (fp_line (start 3.2 13.7) (end 2.9 14)
      (stroke (width 0.1) (type solid)) (layer "F.Fab") (tstamp 469616bc-c349-433d-9798-50e0ea94349e))
    (fp_line (start -3.2 5.3) (end -3.2 13.7)
      (stroke (width 0.1) (type solid)) (layer "F.Fab") (tstamp cf45f4af-23ae-48c7-a774-8d12d4baa646))
    (fp_line (start 3.2 5.3) (end 3.2 13.7)
      (stroke (width 0.1) (type solid)) (layer "F.Fab") (tstamp d3c78569-f94c-404e-8ca2-bf6416a6e71a))
    (fp_line (start -2.9 5.1) (end -3.2 5.3)
      (stroke (width 0.1) (type solid)) (layer "F.Fab") (tstamp 2195c15a-23b1-4c74-b743-9b2bff7f4dfd))
    (fp_line (start 2.9 5.1) (end 3.2 5.3)
      (stroke (width 0.1) (type solid)) (layer "F.Fab") (tstamp df4920b2-3bf9-4500-8c0f-342ba24a9314))
    (fp_line (start -3.175 3.7) (end -2.9 3.7)
      (stroke (width 0.1) (type solid)) (layer "F.Fab") (tstamp 725402c3-a3e9-4627-bc81-c6f9bf5703b3))
    (fp_line (start -2.9 3.7) (end -2.9 5.1)
      (stroke (width 0.1) (type solid)) (layer "F.Fab") (tstamp 4094dd3c-1175-4aad-9c87-1f16fb308d23))
    (fp_line (start 2.9 3.7) (end 2.9 5.1)
      (stroke (width 0.1) (type solid)) (layer "F.Fab") (tstamp 90998e61-c1ea-4ce8-812c-a6ca7d902bdd))
    (fp_line (start 3.175 3.7) (end 2.9 3.7)
      (stroke (width 0.1) (type solid)) (layer "F.Fab") (tstamp 4310af3b-2751-4944-8753-0376176c0d51))
    (fp_line (start -3.175 2.05) (end -3.175 3.7)
      (stroke (width 0.1) (type solid)) (layer "F.Fab") (tstamp e33e1c8e-3e08-4136-bfe1-644a42aa041d))
    (fp_line (start -3.175 2.05) (end -2.365 2.05)
      (stroke (width 0.1) (type solid)) (layer "F.Fab") (tstamp 538322b0-d566-4363-a37b-abcd524a89ad))
    (fp_line (start -3.175 2.05) (end -3.175 -1.76)
      (stroke (width 0.1) (type solid)) (layer "F.Fab") (tstamp cb78581e-f71d-401f-8efb-3fe5ad294625))
    (fp_line (start -2.365 2.05) (end -0.38 2.05)
      (stroke (width 0.1) (type solid)) (layer "F.Fab") (tstamp 8d226464-8a53-471d-8f61-ce9ecac5987c))
    (fp_line (start -0.38 2.05) (end 0.38 2.05)
      (stroke (width 0.1) (type solid)) (layer "F.Fab") (tstamp b60a6041-80d6-4006-89e8-c517de48da1c))
    (fp_line (start -0.38 2.05) (end -0.38 -1.76)
      (stroke (width 0.1) (type solid)) (layer "F.Fab") (tstamp 142488a3-b655-4e22-8909-404455a11b98))
    (fp_line (start 0.38 2.05) (end 3.175 2.05)
      (stroke (width 0.1) (type solid)) (layer "F.Fab") (tstamp a246c2a6-6315-48a5-9fb6-f1109f26c4a4))
    (fp_line (start 3.175 2.05) (end 3.175 3.7)
      (stroke (width 0.1) (type solid)) (layer "F.Fab") (tstamp 26635316-b190-45d1-b511-8862bd6f140f))
    (fp_line (start 3.175 2.05) (end 3.175 -1.76)
      (stroke (width 0.1) (type solid)) (layer "F.Fab") (tstamp 12b80dc0-8eb3-4d09-a244-7b897196114a))
    (fp_line (start -3.175 -1.76) (end -2.365 -1.76)
      (stroke (width 0.1) (type solid)) (layer "F.Fab") (tstamp 9fb2e7de-f246-429d-bd14-cdf24a727c4c))
    (fp_line (start -2.365 -1.76) (end -2.365 2.05)
      (stroke (width 0.1) (type solid)) (layer "F.Fab") (tstamp 56524154-3c3e-4a90-8837-43b9f7fb5441))
    (fp_line (start -0.38 -1.76) (end 0.38 -1.76)
      (stroke (width 0.1) (type solid)) (layer "F.Fab") (tstamp 36c25c47-ce51-425f-a136-3771d89bdd9b))
    (fp_line (start 0.38 -1.76) (end 0.38 2.05)
      (stroke (width 0.1) (type solid)) (layer "F.Fab") (tstamp c0e3b327-9fb4-47b4-8a07-2b9f58ba6acd))
    (fp_line (start 2.365 -1.76) (end 2.365 2.05)
      (stroke (width 0.1) (type solid)) (layer "F.Fab") (tstamp 3f9b0028-1e30-4e59-ac9e-2259ee0501a9))
    (fp_line (start 3.175 -1.76) (end 2.365 -1.76)
      (stroke (width 0.1) (type solid)) (layer "F.Fab") (tstamp 15987091-4f86-4f9c-b681-d3b067b84f8f))
    (fp_text user "PCB END" (at -1.1 3 90) (layer "Dwgs.User") (tstamp 91109400-404f-4c3d-82fd-ad8f9b338111)
      (effects (font (size 0.32 0.32) (thickness 0.15)))
    )
    (fp_text user "PCB Thickness: 1.6mm" (at -2.1 3.8 90) (layer "Dwgs.User") (tstamp d8865570-9724-4445-847f-b097f1783243)
      (effects (font (size 0.24 0.24) (thickness 0.15)))
    )
    (pad "1" smd rect (at 0 0 270) (size 0.9 4.1) (layers "F.Cu" "F.Paste" "F.Mask")
      (net 1 "Net-(J1-Pad1)") (pintype "passive") (tstamp 422cae9b-e975-49c6-9d16-53cd5f71e503))
    (pad "2" smd rect (at -2.775 0 270) (size 1.25 4.1) (layers "F.Cu" "F.Paste" "F.Mask")
      (net 2 "GND") (pintype "passive") (tstamp e7ca767f-198f-4d1c-a64d-1cf5d367b34e))
    (pad "3" smd rect (at 2.775 0 270) (size 1.25 4.1) (layers "F.Cu" "F.Paste" "F.Mask")
      (net 2 "GND") (pintype "passive") (tstamp c97eadb4-a9a0-4d05-a5e8-011e23bd7f85))
    (pad "4" smd rect (at -2.775 0 270) (size 1.25 4.1) (layers "B.Cu" "B.Paste" "B.Mask")
      (net 2 "GND") (pintype "passive") (tstamp 7c37a2b2-5d8d-4177-b3e5-2bb81beb8c4d))
    (pad "5" smd rect (at 2.775 0 270) (size 1.25 4.1) (layers "B.Cu" "B.Paste" "B.Mask")
      (net 2 "GND") (pintype "passive") (tstamp b92a392e-25b1-4dac-8b5b-c42e806cd262))
    (model "${KIPRJMOD}/kicad-components-library/63012242121508/63012242121508.step"
      (offset (xyz 0 -2 0.5))
      (scale (xyz 1 1 1))
      (rotate (xyz -90 0 0))
    )
  )

  (gr_line (start 150.75 82.95) (end 145.75 82.95)
    (stroke (width 0.1) (type default)) (layer "Edge.Cuts") (tstamp 07d9ddbe-646e-4bcd-a77a-f6fefa51e423))
  (gr_line (start 145.75 82.95) (end 145.75 67.95)
    (stroke (width 0.1) (type default)) (layer "Edge.Cuts") (tstamp 4d011149-cf00-43f5-a959-e9a321cc6ec0))
  (gr_line (start 145.75 67.95) (end 154.25 67.95)
    (stroke (width 0.1) (type default)) (layer "Edge.Cuts") (tstamp 4e5e41c2-6291-4e04-8942-63df08d355fd))
  (gr_line (start 154.25 67.95) (end 154.25 77.95)
    (stroke (width 0.1) (type default)) (layer "Edge.Cuts") (tstamp 533d6d14-1233-46a5-9dbd-0a1b1d69f9c0))
  (gr_line (start 154.25 77.95) (end 150.75 82.95)
    (stroke (width 0.1) (type default)) (layer "Edge.Cuts") (tstamp cdc654db-e401-4b61-bc25-3c9e9bdbf9c7))

  (segment (start 150.725 79.275) (end 147.925 79.275) (width 1.119632) (layer "F.Cu") (net 1) (tstamp 2eefc1ad-1f6e-4071-8bf9-799ac961a76b))
  (segment (start 150 70.125) (end 150 73.3) (width 1.119632) (layer "F.Cu") (net 1) (tstamp 36d827bb-5194-425f-90e3-3d47ce7f0540))
  (segment (start 152 75.3) (end 152 78) (width 1.119632) (layer "F.Cu") (net 1) (tstamp 703b5f4b-463c-4d4c-b253-26e3b0b499ec))
  (segment (start 152 78) (end 150.725 79.275) (width 1.119632) (layer "F.Cu") (net 1) (tstamp 706e9d68-eb45-4ce9-8271-02f5f72a66d0))
  (segment (start 150 73.3) (end 152 75.3) (width 1.119632) (layer "F.Cu") (net 1) (tstamp e90a2c59-d9da-40c6-b5da-7ba0d88ca66d))
  (via (at 150.9 81.5) (size 0.8) (drill 0.4) (layers "F.Cu" "B.Cu") (free) (net 2) (tstamp 3422086e-ee79-4716-8c58-7709f18523a3))
  (via (at 146.6 73.7) (size 0.8) (drill 0.4) (layers "F.Cu" "B.Cu") (free) (net 2) (tstamp ebb9f346-8223-473a-86fc-619b566636ad))

  (zone (net 2) (net_name "GND") (layers "F&B.Cu") (tstamp add9bc7b-1f2f-4672-afb9-70e2a5867e9c) (hatch edge 0.5)
    (connect_pads yes (clearance 0.254))
    (min_thickness 0.25) (filled_areas_thickness no)
    (fill yes (thermal_gap 0.5) (thermal_bridge_width 0.5) (island_removal_mode 1) (island_area_min 10))
    (polygon
      (pts
        (xy 154.275 82.925)
        (xy 154.25 67.975)
        (xy 145.725 67.95)
        (xy 145.75 83)
      )
    )
    (filled_polygon
      (layer "F.Cu")
      (pts
        (xy 154.125867 67.974635)
        (xy 154.192845 67.994516)
        (xy 154.238445 68.047454)
        (xy 154.2495 68.098634)
        (xy 154.2495 77.910754)
        (xy 154.229815 77.977793)
        (xy 154.227085 77.981863)
        (xy 153.765908 78.640688)
        (xy 150.800483 82.877011)
        (xy 150.786764 82.896609)
        (xy 150.732193 82.940242)
        (xy 150.685179 82.9495)
        (xy 145.8745 82.9495)
        (xy 145.807461 82.929815)
        (xy 145.761706 82.877011)
        (xy 145.7505 82.8255)
        (xy 145.7505 80.103499)
        (xy 145.770185 80.03646)
        (xy 145.822989 79.990705)
        (xy 145.874495 79.979499)
        (xy 147.479902 79.979499)
        (xy 147.545874 79.998505)
        (xy 147.569443 80.013314)
        (xy 147.569446 80.013316)
        (xy 147.742651 80.073923)
        (xy 147.742654 80.073923)
        (xy 147.742656 80.073924)
        (xy 147.834713 80.084296)
        (xy 147.87926 80.089315)
        (xy 147.879263 80.089316)
        (xy 147.879266 80.089316)
        (xy 150.629493 80.089316)
        (xy 150.629509 80.089317)
        (xy 150.633249 80.089317)
        (xy 150.816746 80.089317)
        (xy 150.816751 80.089317)
        (xy 150.858239 80.079846)
        (xy 150.86507 80.078686)
        (xy 150.907349 80.073923)
        (xy 150.947498 80.059873)
        (xy 150.954162 80.057952)
        (xy 150.995654 80.048483)
        (xy 151.033989 80.03002)
        (xy 151.040398 80.027366)
        (xy 151.080554 80.013316)
        (xy 151.116582 79.990677)
        (xy 151.122654 79.987321)
        (xy 151.160984 79.968864)
        (xy 151.194244 79.942338)
        (xy 151.199909 79.93832)
        (xy 151.205678 79.934694)
        (xy 151.235931 79.915687)
        (xy 151.365687 79.785931)
        (xy 151.365687 79.785929)
        (xy 151.375895 79.775722)
        (xy 151.375897 79.775719)
        (xy 152.510928 78.640688)
        (xy 152.510931 78.640687)
        (xy 152.640687 78.510931)
        (xy 152.66332 78.474909)
        (xy 152.667338 78.469244)
        (xy 152.693864 78.435984)
        (xy 152.712321 78.397654)
        (xy 152.715677 78.391582)
        (xy 152.738316 78.355554)
        (xy 152.752366 78.315398)
        (xy 152.75502 78.308989)
        (xy 152.773483 78.270654)
        (xy 152.782953 78.229159)
        (xy 152.784871 78.222504)
        (xy 152.798923 78.182349)
        (xy 152.803685 78.140081)
        (xy 152.80485 78.133228)
        (xy 152.814317 78.091752)
        (xy 152.814317 77.908249)
        (xy 152.814317 77.904947)
        (xy 152.814316 77.904925)
        (xy 152.814316 75.395507)
        (xy 152.814317 75.39549)
        (xy 152.814317 75.208249)
        (xy 152.814316 75.208246)
        (xy 152.804845 75.166753)
        (xy 152.803686 75.15993)
        (xy 152.798923 75.117651)
        (xy 152.784873 75.077501)
        (xy 152.782951 75.070829)
        (xy 152.773483 75.029346)
        (xy 152.766002 75.013812)
        (xy 152.755024 74.991015)
        (xy 152.752361 74.984586)
        (xy 152.738316 74.944447)
        (xy 152.738313 74.94444)
        (xy 152.726509 74.925656)
        (xy 152.715676 74.908415)
        (xy 152.712326 74.902353)
        (xy 152.693864 74.864016)
        (xy 152.667343 74.830761)
        (xy 152.663317 74.825086)
        (xy 152.640685 74.789066)
        (xy 152.50861 74.656991)
        (xy 152.508587 74.65697)
        (xy 150.850635 72.999017)
        (xy 150.81715 72.937694)
        (xy 150.814316 72.911336)
        (xy 150.814316 70.079263)
        (xy 150.814315 70.079259)
        (xy 150.798924 69.942656)
        (xy 150.798923 69.942654)
        (xy 150.798923 69.942651)
        (xy 150.738316 69.769446)
        (xy 150.73093 69.757692)
        (xy 150.723504 69.745872)
        (xy 150.704499 69.679902)
        (xy 150.704499 68.088965)
        (xy 150.724184 68.021926)
        (xy 150.776988 67.976171)
        (xy 150.828857 67.964967)
      )
    )
    (filled_polygon
      (layer "F.Cu")
      (pts
        (xy 149.171867 67.960107)
        (xy 149.238845 67.979988)
        (xy 149.284445 68.032926)
        (xy 149.2955 68.084106)
        (xy 149.295499 69.679904)
        (xy 149.276495 69.745873)
        (xy 149.261683 69.769446)
        (xy 149.201075 69.942656)
        (xy 149.185684 70.079259)
        (xy 149.185684 73.204925)
        (xy 149.185683 73.204947)
        (xy 149.185683 73.391756)
        (xy 149.195148 73.433222)
        (xy 149.196313 73.44008)
        (xy 149.201077 73.482351)
        (xy 149.215123 73.522493)
        (xy 149.217048 73.529176)
        (xy 149.226514 73.570645)
        (xy 149.22652 73.570662)
        (xy 149.244974 73.608983)
        (xy 149.247637 73.61541)
        (xy 149.261682 73.655551)
        (xy 149.284314 73.691571)
        (xy 149.287678 73.697658)
        (xy 149.306135 73.735983)
        (xy 149.332656 73.769239)
        (xy 149.336682 73.774914)
        (xy 149.359313 73.810931)
        (xy 149.489069 73.940687)
        (xy 149.48907 73.940687)
        (xy 149.496137 73.947754)
        (xy 149.496136 73.947754)
        (xy 149.49614 73.947757)
        (xy 151.149365 75.600982)
        (xy 151.18285 75.662305)
        (xy 151.185684 75.688663)
        (xy 151.185684 77.611336)
        (xy 151.165999 77.678375)
        (xy 151.149365 77.699017)
        (xy 150.424018 78.424365)
        (xy 150.362695 78.45785)
        (xy 150.336337 78.460684)
        (xy 147.879259 78.460684)
        (xy 147.742656 78.476075)
        (xy 147.56945 78.536682)
        (xy 147.569442 78.536686)
        (xy 147.545871 78.551496)
        (xy 147.479903 78.5705)
        (xy 145.8745 78.5705)
        (xy 145.807461 78.550815)
        (xy 145.761706 78.498011)
        (xy 145.7505 78.4465)
        (xy 145.7505 68.0745)
        (xy 145.770185 68.007461)
        (xy 145.822989 67.961706)
        (xy 145.8745 67.9505)
        (xy 145.895605 67.9505)
      )
    )
    (filled_polygon
      (layer "B.Cu")
      (pts
        (xy 154.125867 67.974635)
        (xy 154.192845 67.994516)
        (xy 154.238445 68.047454)
        (xy 154.2495 68.098634)
        (xy 154.2495 77.910754)
        (xy 154.229815 77.977793)
        (xy 154.227085 77.981863)
        (xy 150.800483 82.877011)
        (xy 150.786764 82.896609)
        (xy 150.732193 82.940242)
        (xy 150.685179 82.9495)
        (xy 145.8745 82.9495)
        (xy 145.807461 82.929815)
        (xy 145.761706 82.877011)
        (xy 145.7505 82.8255)
        (xy 145.7505 68.0745)
        (xy 145.770185 68.007461)
        (xy 145.822989 67.961706)
        (xy 145.8745 67.9505)
        (xy 145.895605 67.9505)
      )
    )
  )
)
