G04 #@! TF.GenerationSoftware,KiCad,Pcbnew,(7.99.0-238-g6803976ab3-dirty)*
G04 #@! TF.CreationDate,2023-03-15T23:54:54+01:00*
G04 #@! TF.ProjectId,rfd-hat,7266642d-6861-4742-9e6b-696361645f70,rev?*
G04 #@! TF.SameCoordinates,Original*
G04 #@! TF.FileFunction,Copper,L1,Top*
G04 #@! TF.FilePolarity,Positive*
%FSLAX46Y46*%
G04 Gerber Fmt 4.6, Leading zero omitted, Abs format (unit mm)*
G04 Created by KiCad (PCBNEW (7.99.0-238-g6803976ab3-dirty)) date 2023-03-15 23:54:54*
%MOMM*%
%LPD*%
G01*
G04 APERTURE LIST*
G04 #@! TA.AperFunction,SMDPad,CuDef*
%ADD10R,3.150000X1.000000*%
G04 #@! TD*
G04 #@! TA.AperFunction,ViaPad*
%ADD11C,0.800000*%
G04 #@! TD*
G04 #@! TA.AperFunction,Conductor*
%ADD12C,0.508000*%
G04 #@! TD*
G04 APERTURE END LIST*
D10*
G04 #@! TO.P,J3,1,Pin_1*
G04 #@! TO.N,GND*
X97474999Y-91109999D03*
G04 #@! TO.P,J3,2,Pin_2*
X102524999Y-91109999D03*
G04 #@! TO.P,J3,3,Pin_3*
G04 #@! TO.N,/CTS*
X97474999Y-93649999D03*
G04 #@! TO.P,J3,4,Pin_4*
G04 #@! TO.N,/+5V*
X102524999Y-93649999D03*
G04 #@! TO.P,J3,5,Pin_5*
G04 #@! TO.N,unconnected-(J3-Pin_5-Pad5)*
X97474999Y-96189999D03*
G04 #@! TO.P,J3,6,Pin_6*
G04 #@! TO.N,unconnected-(J3-Pin_6-Pad6)*
X102524999Y-96189999D03*
G04 #@! TO.P,J3,7,Pin_7*
G04 #@! TO.N,/PIX_TX*
X97474999Y-98729999D03*
G04 #@! TO.P,J3,8,Pin_8*
G04 #@! TO.N,unconnected-(J3-Pin_8-Pad8)*
X102524999Y-98729999D03*
G04 #@! TO.P,J3,9,Pin_9*
G04 #@! TO.N,/PIX_RX*
X97474999Y-101269999D03*
G04 #@! TO.P,J3,10,Pin_10*
G04 #@! TO.N,unconnected-(J3-Pin_10-Pad10)*
X102524999Y-101269999D03*
G04 #@! TO.P,J3,11,Pin_11*
G04 #@! TO.N,/RTS*
X97474999Y-103809999D03*
G04 #@! TO.P,J3,12,Pin_12*
G04 #@! TO.N,unconnected-(J3-Pin_12-Pad12)*
X102524999Y-103809999D03*
G04 #@! TO.P,J3,13,Pin_13*
G04 #@! TO.N,unconnected-(J3-Pin_13-Pad13)*
X97474999Y-106349999D03*
G04 #@! TO.P,J3,14,Pin_14*
G04 #@! TO.N,unconnected-(J3-Pin_14-Pad14)*
X102524999Y-106349999D03*
G04 #@! TO.P,J3,15,Pin_15*
G04 #@! TO.N,unconnected-(J3-Pin_15-Pad15)*
X97474999Y-108889999D03*
G04 #@! TO.P,J3,16,Pin_16*
G04 #@! TO.N,unconnected-(J3-Pin_16-Pad16)*
X102524999Y-108889999D03*
G04 #@! TD*
D11*
G04 #@! TO.N,/PIX_TX*
X100838000Y-102362000D03*
G04 #@! TO.N,/PIX_RX*
X99949000Y-104267000D03*
G04 #@! TO.N,/CTS*
X96139000Y-102616000D03*
G04 #@! TO.N,/RTS*
X98714345Y-102684273D03*
G04 #@! TO.N,/+5V*
X101473000Y-94869000D03*
X103759000Y-94869000D03*
X102616000Y-94869000D03*
G04 #@! TO.N,GND*
X99822000Y-93853000D03*
X99822000Y-91821000D03*
X99822000Y-92837000D03*
G04 #@! TD*
D12*
G04 #@! TO.N,/PIX_TX*
X97475000Y-98730000D02*
X99492000Y-98730000D01*
X99492000Y-98730000D02*
X99695000Y-98933000D01*
X99695000Y-101219000D02*
X100838000Y-102362000D01*
X99695000Y-98933000D02*
X99695000Y-101219000D01*
G04 #@! TO.N,/PIX_RX*
X99949000Y-102669000D02*
X99949000Y-104267000D01*
X98550000Y-101270000D02*
X99949000Y-102669000D01*
X97475000Y-101270000D02*
X98550000Y-101270000D01*
G04 #@! TO.N,/CTS*
X95377000Y-95305000D02*
X95377000Y-101727000D01*
X95544000Y-102322000D02*
X95838000Y-102616000D01*
X95838000Y-102616000D02*
X96139000Y-102616000D01*
X97475000Y-93650000D02*
X97032000Y-93650000D01*
X95377000Y-101727000D02*
X95377000Y-102155000D01*
X95377000Y-102155000D02*
X95544000Y-102322000D01*
X97032000Y-93650000D02*
X95377000Y-95305000D01*
G04 #@! TO.N,/RTS*
X98600727Y-102684273D02*
X97475000Y-103810000D01*
X98714345Y-102684273D02*
X98600727Y-102684273D01*
G04 #@! TD*
G04 #@! TA.AperFunction,Conductor*
G04 #@! TO.N,/+5V*
G36*
X104967904Y-92464375D02*
G01*
X104990781Y-92487256D01*
X104999150Y-92518509D01*
X104998696Y-95441511D01*
X104980388Y-95485698D01*
X104936197Y-95504000D01*
X104198801Y-95504000D01*
X104186608Y-95502799D01*
X104119749Y-95489500D01*
X104119748Y-95489500D01*
X100930252Y-95489500D01*
X100930251Y-95489500D01*
X100863392Y-95502799D01*
X100851199Y-95504000D01*
X100646500Y-95504000D01*
X100602306Y-95485694D01*
X100584000Y-95441500D01*
X100584000Y-94226026D01*
X100600191Y-94184054D01*
X100640374Y-94163827D01*
X100683731Y-94175826D01*
X100707799Y-94213833D01*
X100714504Y-94247544D01*
X100769760Y-94330239D01*
X100852455Y-94385495D01*
X100925375Y-94400000D01*
X102125000Y-94400000D01*
X102125000Y-94050000D01*
X102925000Y-94050000D01*
X102925000Y-94400000D01*
X104124625Y-94400000D01*
X104197544Y-94385495D01*
X104280239Y-94330239D01*
X104335495Y-94247544D01*
X104350000Y-94174625D01*
X104350000Y-94050000D01*
X102925000Y-94050000D01*
X102125000Y-94050000D01*
X102125000Y-92900000D01*
X102925000Y-92900000D01*
X102925000Y-93250000D01*
X104350000Y-93250000D01*
X104350000Y-93125375D01*
X104335495Y-93052455D01*
X104280239Y-92969760D01*
X104197544Y-92914504D01*
X104124625Y-92900000D01*
X102925000Y-92900000D01*
X102125000Y-92900000D01*
X100925375Y-92900000D01*
X100852455Y-92914504D01*
X100769760Y-92969760D01*
X100714504Y-93052455D01*
X100707799Y-93086167D01*
X100683731Y-93124174D01*
X100640374Y-93136173D01*
X100600191Y-93115946D01*
X100584000Y-93073974D01*
X100584000Y-92518500D01*
X100602306Y-92474306D01*
X100646500Y-92456000D01*
X104936651Y-92456000D01*
X104967904Y-92464375D01*
G37*
G04 #@! TD.AperFunction*
G04 #@! TD*
G04 #@! TA.AperFunction,Conductor*
G04 #@! TO.N,GND*
G36*
X103727593Y-89005498D02*
G01*
X103732417Y-89005690D01*
X103787024Y-89009987D01*
X103932129Y-89022683D01*
X103941262Y-89024171D01*
X104025280Y-89044342D01*
X104026726Y-89044709D01*
X104136688Y-89074173D01*
X104144420Y-89076797D01*
X104229721Y-89112130D01*
X104232203Y-89113223D01*
X104329929Y-89158793D01*
X104336164Y-89162143D01*
X104416765Y-89211535D01*
X104419949Y-89213623D01*
X104506572Y-89274277D01*
X104511312Y-89277948D01*
X104583819Y-89339874D01*
X104587423Y-89343205D01*
X104661793Y-89417575D01*
X104665124Y-89421179D01*
X104727049Y-89493684D01*
X104730721Y-89498426D01*
X104791375Y-89585049D01*
X104793468Y-89588241D01*
X104842851Y-89668826D01*
X104846205Y-89675069D01*
X104891775Y-89772795D01*
X104892874Y-89775291D01*
X104928199Y-89860574D01*
X104930826Y-89868315D01*
X104960271Y-89978204D01*
X104960674Y-89979790D01*
X104980826Y-90063732D01*
X104982315Y-90072875D01*
X104994997Y-90217825D01*
X104995042Y-90218368D01*
X104999306Y-90272544D01*
X104999499Y-90277458D01*
X104999202Y-92188010D01*
X104980893Y-92232198D01*
X104936702Y-92250500D01*
X100646499Y-92250500D01*
X100567856Y-92266143D01*
X100523668Y-92284446D01*
X100456996Y-92328996D01*
X100412446Y-92395668D01*
X100394143Y-92439856D01*
X100378500Y-92518499D01*
X100378500Y-93073975D01*
X100392270Y-93147933D01*
X100392271Y-93147935D01*
X100408462Y-93189907D01*
X100447926Y-93253951D01*
X100507794Y-93299503D01*
X100547977Y-93319730D01*
X100620231Y-93340683D01*
X100669456Y-93336443D01*
X100681638Y-93335395D01*
X100715101Y-93341839D01*
X100740210Y-93364878D01*
X100749500Y-93397665D01*
X100749500Y-93902335D01*
X100740210Y-93935122D01*
X100715101Y-93958161D01*
X100681638Y-93964605D01*
X100635131Y-93960600D01*
X100620231Y-93959317D01*
X100620230Y-93959317D01*
X100547978Y-93980269D01*
X100507792Y-94000498D01*
X100447926Y-94046048D01*
X100408462Y-94110092D01*
X100392270Y-94152066D01*
X100378500Y-94226025D01*
X100378500Y-95441501D01*
X100394143Y-95520143D01*
X100412446Y-95564331D01*
X100412448Y-95564334D01*
X100412449Y-95564336D01*
X100456996Y-95631004D01*
X100523664Y-95675551D01*
X100523666Y-95675552D01*
X100523668Y-95675553D01*
X100553126Y-95687754D01*
X100567858Y-95693857D01*
X100626971Y-95705615D01*
X100646499Y-95709500D01*
X100646500Y-95709500D01*
X100687000Y-95709500D01*
X100731194Y-95727806D01*
X100749500Y-95772000D01*
X100749500Y-96709749D01*
X100761132Y-96768231D01*
X100805447Y-96834552D01*
X100871768Y-96878867D01*
X100930251Y-96890500D01*
X100930252Y-96890500D01*
X104119748Y-96890500D01*
X104119749Y-96890500D01*
X104178231Y-96878867D01*
X104244552Y-96834552D01*
X104288867Y-96768231D01*
X104300500Y-96709749D01*
X104300500Y-95772000D01*
X104318806Y-95727806D01*
X104363000Y-95709500D01*
X104936144Y-95709500D01*
X104967397Y-95717875D01*
X104990274Y-95740756D01*
X104998644Y-95772010D01*
X104996474Y-109724530D01*
X104996281Y-109729423D01*
X104992029Y-109783463D01*
X104991984Y-109784008D01*
X104979287Y-109929126D01*
X104977798Y-109938267D01*
X104957701Y-110021985D01*
X104957298Y-110023572D01*
X104927787Y-110133708D01*
X104925160Y-110141449D01*
X104889925Y-110226515D01*
X104888826Y-110229012D01*
X104843140Y-110326985D01*
X104839786Y-110333227D01*
X104790548Y-110413578D01*
X104788455Y-110416770D01*
X104727627Y-110503642D01*
X104723955Y-110508385D01*
X104662203Y-110580687D01*
X104658872Y-110584290D01*
X104584290Y-110658872D01*
X104580687Y-110662203D01*
X104508385Y-110723955D01*
X104503642Y-110727627D01*
X104416770Y-110788455D01*
X104413578Y-110790548D01*
X104333227Y-110839786D01*
X104326985Y-110843140D01*
X104229012Y-110888826D01*
X104226515Y-110889925D01*
X104141449Y-110925160D01*
X104133708Y-110927787D01*
X104023572Y-110957298D01*
X104021985Y-110957701D01*
X103938267Y-110977798D01*
X103929126Y-110979287D01*
X103784008Y-110991984D01*
X103783463Y-110992029D01*
X103729427Y-110996281D01*
X103724524Y-110996474D01*
X96275476Y-110996474D01*
X96270573Y-110996281D01*
X96216535Y-110992029D01*
X96215990Y-110991984D01*
X96070872Y-110979287D01*
X96061731Y-110977798D01*
X95978013Y-110957701D01*
X95976426Y-110957298D01*
X95866290Y-110927787D01*
X95858548Y-110925159D01*
X95773466Y-110889917D01*
X95770971Y-110888819D01*
X95673027Y-110843148D01*
X95666784Y-110839794D01*
X95586391Y-110790529D01*
X95583199Y-110788436D01*
X95530715Y-110751687D01*
X95496356Y-110727629D01*
X95491641Y-110723978D01*
X95419294Y-110662189D01*
X95415701Y-110658867D01*
X95341131Y-110584297D01*
X95337812Y-110580707D01*
X95276016Y-110508352D01*
X95272374Y-110503649D01*
X95211562Y-110416799D01*
X95209469Y-110413607D01*
X95202824Y-110402764D01*
X95160198Y-110333203D01*
X95156856Y-110326983D01*
X95111172Y-110229012D01*
X95110081Y-110226532D01*
X95074839Y-110141450D01*
X95072216Y-110133723D01*
X95042674Y-110023470D01*
X95042319Y-110022072D01*
X95022199Y-109938262D01*
X95020712Y-109929135D01*
X95008009Y-109783930D01*
X95007979Y-109783567D01*
X95003719Y-109729417D01*
X95003526Y-109724509D01*
X95003558Y-109409749D01*
X95699500Y-109409749D01*
X95711132Y-109468231D01*
X95755447Y-109534552D01*
X95821768Y-109578867D01*
X95880251Y-109590500D01*
X95880252Y-109590500D01*
X99069748Y-109590500D01*
X99069749Y-109590500D01*
X99128231Y-109578867D01*
X99194552Y-109534552D01*
X99238867Y-109468231D01*
X99250500Y-109409749D01*
X100749500Y-109409749D01*
X100761132Y-109468231D01*
X100805447Y-109534552D01*
X100871768Y-109578867D01*
X100930251Y-109590500D01*
X100930252Y-109590500D01*
X104119748Y-109590500D01*
X104119749Y-109590500D01*
X104178231Y-109578867D01*
X104244552Y-109534552D01*
X104288867Y-109468231D01*
X104300500Y-109409749D01*
X104300500Y-108370251D01*
X104288867Y-108311768D01*
X104244552Y-108245447D01*
X104178231Y-108201132D01*
X104119749Y-108189500D01*
X104119748Y-108189500D01*
X100930252Y-108189500D01*
X100930251Y-108189500D01*
X100871768Y-108201132D01*
X100805447Y-108245447D01*
X100761132Y-108311768D01*
X100749500Y-108370251D01*
X100749500Y-109409749D01*
X99250500Y-109409749D01*
X99250500Y-108370251D01*
X99238867Y-108311768D01*
X99194552Y-108245447D01*
X99128231Y-108201132D01*
X99069749Y-108189500D01*
X99069748Y-108189500D01*
X95880252Y-108189500D01*
X95880251Y-108189500D01*
X95821768Y-108201132D01*
X95755447Y-108245447D01*
X95711132Y-108311768D01*
X95699500Y-108370251D01*
X95699500Y-109409749D01*
X95003558Y-109409749D01*
X95003558Y-109409748D01*
X95003816Y-106869749D01*
X95699500Y-106869749D01*
X95711132Y-106928231D01*
X95755447Y-106994552D01*
X95821768Y-107038867D01*
X95880251Y-107050500D01*
X95880252Y-107050500D01*
X99069748Y-107050500D01*
X99069749Y-107050500D01*
X99128231Y-107038867D01*
X99194552Y-106994552D01*
X99238867Y-106928231D01*
X99250500Y-106869749D01*
X100749500Y-106869749D01*
X100761132Y-106928231D01*
X100805447Y-106994552D01*
X100871768Y-107038867D01*
X100930251Y-107050500D01*
X100930252Y-107050500D01*
X104119748Y-107050500D01*
X104119749Y-107050500D01*
X104178231Y-107038867D01*
X104244552Y-106994552D01*
X104288867Y-106928231D01*
X104300500Y-106869749D01*
X104300500Y-105830251D01*
X104288867Y-105771768D01*
X104244552Y-105705447D01*
X104178231Y-105661132D01*
X104119749Y-105649500D01*
X104119748Y-105649500D01*
X100930252Y-105649500D01*
X100930251Y-105649500D01*
X100871768Y-105661132D01*
X100805447Y-105705447D01*
X100761132Y-105771768D01*
X100749500Y-105830251D01*
X100749500Y-106869749D01*
X99250500Y-106869749D01*
X99250500Y-105830251D01*
X99238867Y-105771768D01*
X99194552Y-105705447D01*
X99128231Y-105661132D01*
X99069749Y-105649500D01*
X99069748Y-105649500D01*
X95880252Y-105649500D01*
X95880251Y-105649500D01*
X95821768Y-105661132D01*
X95755447Y-105705447D01*
X95711132Y-105771768D01*
X95699500Y-105830251D01*
X95699500Y-106869749D01*
X95003816Y-106869749D01*
X95004251Y-102575891D01*
X95022560Y-102531702D01*
X95066753Y-102513399D01*
X95110945Y-102531705D01*
X95496080Y-102916840D01*
X95500750Y-102922065D01*
X95525369Y-102952936D01*
X95573989Y-102986084D01*
X95575895Y-102987436D01*
X95623227Y-103022369D01*
X95623636Y-103022512D01*
X95638203Y-103029864D01*
X95638572Y-103030116D01*
X95694834Y-103047469D01*
X95696989Y-103048179D01*
X95722110Y-103056969D01*
X95739513Y-103066378D01*
X95747367Y-103072405D01*
X95770983Y-103111808D01*
X95761285Y-103156711D01*
X95711132Y-103231768D01*
X95699500Y-103290251D01*
X95699500Y-104329749D01*
X95711132Y-104388231D01*
X95755447Y-104454552D01*
X95821768Y-104498867D01*
X95880251Y-104510500D01*
X95880252Y-104510500D01*
X99069748Y-104510500D01*
X99069749Y-104510500D01*
X99128231Y-104498867D01*
X99194552Y-104454552D01*
X99245775Y-104377894D01*
X99247405Y-104378983D01*
X99259913Y-104358495D01*
X99300812Y-104344981D01*
X99340740Y-104361138D01*
X99360734Y-104399290D01*
X99363955Y-104423758D01*
X99363955Y-104423759D01*
X99363956Y-104423762D01*
X99376710Y-104454552D01*
X99424465Y-104569843D01*
X99520717Y-104695282D01*
X99646156Y-104791534D01*
X99646159Y-104791536D01*
X99792238Y-104852044D01*
X99949000Y-104872682D01*
X100105762Y-104852044D01*
X100251841Y-104791536D01*
X100377282Y-104695282D01*
X100473536Y-104569841D01*
X100534044Y-104423762D01*
X100546421Y-104329749D01*
X100749500Y-104329749D01*
X100761132Y-104388231D01*
X100805447Y-104454552D01*
X100871768Y-104498867D01*
X100930251Y-104510500D01*
X100930252Y-104510500D01*
X104119748Y-104510500D01*
X104119749Y-104510500D01*
X104178231Y-104498867D01*
X104244552Y-104454552D01*
X104288867Y-104388231D01*
X104300500Y-104329749D01*
X104300500Y-103290251D01*
X104288867Y-103231768D01*
X104244552Y-103165447D01*
X104178231Y-103121132D01*
X104119749Y-103109500D01*
X104119748Y-103109500D01*
X100930252Y-103109500D01*
X100930251Y-103109500D01*
X100871768Y-103121132D01*
X100805447Y-103165447D01*
X100761132Y-103231768D01*
X100749500Y-103290251D01*
X100749500Y-104329749D01*
X100546421Y-104329749D01*
X100554682Y-104267000D01*
X100534044Y-104110238D01*
X100473536Y-103964159D01*
X100473534Y-103964156D01*
X100416415Y-103889716D01*
X100403500Y-103851669D01*
X100403500Y-102912249D01*
X100419920Y-102870025D01*
X100460552Y-102849987D01*
X100504047Y-102862664D01*
X100535156Y-102886534D01*
X100535159Y-102886536D01*
X100681238Y-102947044D01*
X100838000Y-102967682D01*
X100994762Y-102947044D01*
X101140841Y-102886536D01*
X101266282Y-102790282D01*
X101362536Y-102664841D01*
X101423044Y-102518762D01*
X101443682Y-102362000D01*
X101423044Y-102205238D01*
X101399535Y-102148484D01*
X101361608Y-102056917D01*
X101358981Y-102016824D01*
X101381304Y-101983415D01*
X101419351Y-101970500D01*
X104119749Y-101970500D01*
X104178231Y-101958867D01*
X104244552Y-101914552D01*
X104288867Y-101848231D01*
X104300500Y-101789749D01*
X104300500Y-100750251D01*
X104288867Y-100691768D01*
X104244552Y-100625447D01*
X104178231Y-100581132D01*
X104119749Y-100569500D01*
X104119748Y-100569500D01*
X100930252Y-100569500D01*
X100930251Y-100569500D01*
X100871768Y-100581132D01*
X100805447Y-100625447D01*
X100761132Y-100691768D01*
X100749500Y-100750251D01*
X100749500Y-101479852D01*
X100738967Y-101514575D01*
X100710918Y-101537594D01*
X100674807Y-101541151D01*
X100642806Y-101524046D01*
X100447977Y-101329217D01*
X100167806Y-101049045D01*
X100149500Y-101004851D01*
X100149500Y-99249749D01*
X100749500Y-99249749D01*
X100761132Y-99308231D01*
X100805447Y-99374552D01*
X100871768Y-99418867D01*
X100930251Y-99430500D01*
X100930252Y-99430500D01*
X104119748Y-99430500D01*
X104119749Y-99430500D01*
X104178231Y-99418867D01*
X104244552Y-99374552D01*
X104288867Y-99308231D01*
X104300500Y-99249749D01*
X104300500Y-98210251D01*
X104288867Y-98151768D01*
X104244552Y-98085447D01*
X104178231Y-98041132D01*
X104119749Y-98029500D01*
X104119748Y-98029500D01*
X100930252Y-98029500D01*
X100930251Y-98029500D01*
X100871768Y-98041132D01*
X100805447Y-98085447D01*
X100761132Y-98151768D01*
X100749500Y-98210251D01*
X100749500Y-99249749D01*
X100149500Y-99249749D01*
X100149500Y-98962038D01*
X100149893Y-98955040D01*
X100154313Y-98915813D01*
X100143375Y-98858007D01*
X100142983Y-98855701D01*
X100134214Y-98797523D01*
X100134214Y-98797521D01*
X100134024Y-98797127D01*
X100128922Y-98781620D01*
X100128841Y-98781192D01*
X100101350Y-98729176D01*
X100100297Y-98727090D01*
X100074768Y-98674080D01*
X100074469Y-98673758D01*
X100065025Y-98660447D01*
X100064821Y-98660061D01*
X100064820Y-98660060D01*
X100023198Y-98618438D01*
X100021603Y-98616782D01*
X99981575Y-98573642D01*
X99981195Y-98573423D01*
X99968250Y-98563490D01*
X99833915Y-98429154D01*
X99829245Y-98423928D01*
X99804632Y-98393065D01*
X99756009Y-98359914D01*
X99754104Y-98358562D01*
X99706772Y-98323630D01*
X99706352Y-98323483D01*
X99691796Y-98316135D01*
X99691428Y-98315884D01*
X99691427Y-98315883D01*
X99691426Y-98315883D01*
X99635221Y-98298546D01*
X99633001Y-98297816D01*
X99577450Y-98278378D01*
X99577004Y-98278362D01*
X99560933Y-98275631D01*
X99560508Y-98275500D01*
X99560505Y-98275500D01*
X99501670Y-98275500D01*
X99499334Y-98275456D01*
X99497273Y-98275378D01*
X99440540Y-98273255D01*
X99440397Y-98273293D01*
X99440110Y-98273370D01*
X99423934Y-98275500D01*
X99313000Y-98275500D01*
X99268806Y-98257194D01*
X99251850Y-98216259D01*
X99251701Y-98216289D01*
X99251551Y-98215539D01*
X99250500Y-98213000D01*
X99250500Y-98210251D01*
X99238867Y-98151768D01*
X99194552Y-98085447D01*
X99128231Y-98041132D01*
X99069749Y-98029500D01*
X99069748Y-98029500D01*
X95894000Y-98029500D01*
X95849806Y-98011194D01*
X95831500Y-97967000D01*
X95831500Y-96953000D01*
X95849806Y-96908806D01*
X95894000Y-96890500D01*
X99069749Y-96890500D01*
X99128231Y-96878867D01*
X99194552Y-96834552D01*
X99238867Y-96768231D01*
X99250500Y-96709749D01*
X99250500Y-95670251D01*
X99238867Y-95611768D01*
X99194552Y-95545447D01*
X99128231Y-95501132D01*
X99069749Y-95489500D01*
X99069748Y-95489500D01*
X95986148Y-95489500D01*
X95941954Y-95471194D01*
X95923648Y-95427000D01*
X95941954Y-95382806D01*
X96955954Y-94368806D01*
X97000148Y-94350500D01*
X99069749Y-94350500D01*
X99128231Y-94338867D01*
X99194552Y-94294552D01*
X99238867Y-94228231D01*
X99250500Y-94169749D01*
X99250500Y-93130251D01*
X99238867Y-93071768D01*
X99194552Y-93005447D01*
X99128231Y-92961132D01*
X99069749Y-92949500D01*
X99069748Y-92949500D01*
X95880252Y-92949500D01*
X95880251Y-92949500D01*
X95821768Y-92961132D01*
X95755447Y-93005447D01*
X95711132Y-93071768D01*
X95699500Y-93130251D01*
X95699500Y-94169749D01*
X95711132Y-94228230D01*
X95722640Y-94245453D01*
X95732872Y-94286302D01*
X95714867Y-94324370D01*
X95111725Y-94927512D01*
X95079723Y-94944617D01*
X95043610Y-94941059D01*
X95015562Y-94918037D01*
X95005031Y-94883312D01*
X95005091Y-94294552D01*
X95005373Y-91510000D01*
X95650000Y-91510000D01*
X95650000Y-91634625D01*
X95664504Y-91707544D01*
X95719760Y-91790239D01*
X95802455Y-91845495D01*
X95875375Y-91860000D01*
X97075000Y-91860000D01*
X97075000Y-91510000D01*
X97875000Y-91510000D01*
X97875000Y-91860000D01*
X99074625Y-91860000D01*
X99147544Y-91845495D01*
X99230239Y-91790239D01*
X99285495Y-91707544D01*
X99300000Y-91634625D01*
X99300000Y-91510000D01*
X100700000Y-91510000D01*
X100700000Y-91634625D01*
X100714504Y-91707544D01*
X100769760Y-91790239D01*
X100852455Y-91845495D01*
X100925375Y-91860000D01*
X102125000Y-91860000D01*
X102125000Y-91510000D01*
X102925000Y-91510000D01*
X102925000Y-91860000D01*
X104124625Y-91860000D01*
X104197544Y-91845495D01*
X104280239Y-91790239D01*
X104335495Y-91707544D01*
X104350000Y-91634625D01*
X104350000Y-91510000D01*
X102925000Y-91510000D01*
X102125000Y-91510000D01*
X100700000Y-91510000D01*
X99300000Y-91510000D01*
X97875000Y-91510000D01*
X97075000Y-91510000D01*
X95650000Y-91510000D01*
X95005373Y-91510000D01*
X95005454Y-90710000D01*
X95650000Y-90710000D01*
X97075000Y-90710000D01*
X97075000Y-90360000D01*
X97875000Y-90360000D01*
X97875000Y-90710000D01*
X99300000Y-90710000D01*
X100700000Y-90710000D01*
X102125000Y-90710000D01*
X102125000Y-90360000D01*
X102925000Y-90360000D01*
X102925000Y-90710000D01*
X104350000Y-90710000D01*
X104350000Y-90585375D01*
X104335495Y-90512455D01*
X104280239Y-90429760D01*
X104197544Y-90374504D01*
X104124625Y-90360000D01*
X102925000Y-90360000D01*
X102125000Y-90360000D01*
X100925375Y-90360000D01*
X100852455Y-90374504D01*
X100769760Y-90429760D01*
X100714504Y-90512455D01*
X100700000Y-90585375D01*
X100700000Y-90710000D01*
X99300000Y-90710000D01*
X99300000Y-90585375D01*
X99285495Y-90512455D01*
X99230239Y-90429760D01*
X99147544Y-90374504D01*
X99074625Y-90360000D01*
X97875000Y-90360000D01*
X97075000Y-90360000D01*
X95875375Y-90360000D01*
X95802455Y-90374504D01*
X95719760Y-90429760D01*
X95664504Y-90512455D01*
X95650000Y-90585375D01*
X95650000Y-90710000D01*
X95005454Y-90710000D01*
X95005498Y-90272428D01*
X95005690Y-90267571D01*
X95009975Y-90213123D01*
X95022684Y-90067868D01*
X95024170Y-90058741D01*
X95044351Y-89974680D01*
X95044699Y-89973310D01*
X95074176Y-89863301D01*
X95076794Y-89855588D01*
X95112144Y-89770244D01*
X95113209Y-89767825D01*
X95158801Y-89670053D01*
X95162134Y-89663849D01*
X95211554Y-89583203D01*
X95213608Y-89580071D01*
X95274286Y-89493413D01*
X95277931Y-89488706D01*
X95339897Y-89416153D01*
X95343180Y-89412601D01*
X95417601Y-89338180D01*
X95421153Y-89334897D01*
X95493706Y-89272931D01*
X95498413Y-89269286D01*
X95585071Y-89208608D01*
X95588203Y-89206554D01*
X95668849Y-89157134D01*
X95675053Y-89153801D01*
X95772825Y-89108209D01*
X95775244Y-89107144D01*
X95860588Y-89071794D01*
X95868301Y-89069176D01*
X95978310Y-89039699D01*
X95979680Y-89039351D01*
X96063741Y-89019170D01*
X96072868Y-89017684D01*
X96218064Y-89004981D01*
X96218065Y-89004980D01*
X96272542Y-89000693D01*
X96277453Y-89000501D01*
X103727593Y-89005498D01*
G37*
G04 #@! TD.AperFunction*
G04 #@! TD*
M02*
