M48
METRIC,TZ
T1C0.400
T2C0.500
%
G90
G05
T1
X105025Y-20662
X105025Y-52659
X105025Y-84656
X107946Y-25869
X107946Y-57866
X107946Y-89863
X108454Y-26885
X108454Y-38696
X108454Y-39712
X108454Y-58882
X108454Y-70693
X108454Y-71709
X108454Y-90879
X108454Y-102690
X108454Y-103706
X108581Y-23075
X108581Y-55072
X108581Y-87069
X108962Y-25869
X108962Y-57866
X108962Y-89863
X109216Y-33616
X109216Y-65613
X109216Y-97610
X111502Y-33489
X111502Y-65486
X111502Y-97483
X111805Y-20662
X111805Y-52659
X111805Y-84656
X112137Y-25742
X112137Y-57739
X112137Y-89736
X112264Y-30822
X112264Y-62819
X112264Y-94816
X125022Y-20662
X125022Y-52659
X125022Y-84656
X127943Y-25869
X127943Y-57866
X127943Y-89863
X128451Y-26885
X128451Y-38696
X128451Y-39712
X128451Y-58882
X128451Y-70693
X128451Y-71709
X128451Y-90879
X128451Y-102690
X128451Y-103706
X128578Y-23075
X128578Y-55072
X128578Y-87069
X128959Y-25869
X128959Y-57866
X128959Y-89863
X129213Y-33616
X129213Y-65613
X129213Y-97610
X131499Y-33489
X131499Y-65486
X131499Y-97483
X131802Y-20662
X131802Y-52659
X131802Y-84656
X132134Y-25742
X132134Y-57739
X132134Y-89736
X132261Y-30822
X132261Y-62819
X132261Y-94816
X145018Y-20662
X145018Y-52659
X145018Y-84656
X147939Y-25869
X147939Y-57866
X147939Y-89863
X148447Y-26885
X148447Y-38696
X148447Y-39712
X148447Y-58882
X148447Y-70693
X148447Y-71709
X148447Y-90879
X148447Y-102690
X148447Y-103706
X148574Y-23075
X148574Y-55072
X148574Y-87069
X148955Y-25869
X148955Y-57866
X148955Y-89863
X149209Y-33616
X149209Y-65613
X149209Y-97610
X151495Y-33489
X151495Y-65486
X151495Y-97483
X151798Y-20662
X151798Y-52659
X151798Y-84656
X152130Y-25742
X152130Y-57739
X152130Y-89736
X152257Y-30822
X152257Y-62819
X152257Y-94816
X165015Y-20662
X165015Y-52659
X165015Y-84656
X167936Y-25869
X167936Y-57866
X167936Y-89863
X168444Y-26885
X168444Y-38696
X168444Y-39712
X168444Y-58882
X168444Y-70693
X168444Y-71709
X168444Y-90879
X168444Y-102690
X168444Y-103706
X168571Y-23075
X168571Y-55072
X168571Y-87069
X168952Y-25869
X168952Y-57866
X168952Y-89863
X169206Y-33616
X169206Y-65613
X169206Y-97610
X171492Y-33489
X171492Y-65486
X171492Y-97483
X171795Y-20662
X171795Y-52659
X171795Y-84656
X172127Y-25742
X172127Y-57739
X172127Y-89736
X172254Y-30822
X172254Y-62819
X172254Y-94816
X185012Y-20662
X185012Y-52659
X185012Y-84656
X187933Y-25869
X187933Y-57866
X187933Y-89863
X188441Y-26885
X188441Y-38696
X188441Y-39712
X188441Y-58882
X188441Y-70693
X188441Y-71709
X188441Y-90879
X188441Y-102690
X188441Y-103706
X188568Y-23075
X188568Y-55072
X188568Y-87069
X188949Y-25869
X188949Y-57866
X188949Y-89863
X189203Y-33616
X189203Y-65613
X189203Y-97610
X191489Y-33489
X191489Y-65486
X191489Y-97483
X191792Y-20662
X191792Y-52659
X191792Y-84656
X192124Y-25742
X192124Y-57739
X192124Y-89736
X192251Y-30822
X192251Y-62819
X192251Y-94816
T2
X113503Y-32498
X113503Y-64495
X113503Y-96492
X113503Y-31748
X113503Y-63745
X113503Y-95742
X113503Y-30998
X113503Y-62995
X113503Y-94992
X113503Y-30248
X113503Y-62245
X113503Y-94242
X113503Y-29498
X113503Y-61495
X113503Y-93492
X116505Y-44997
X116505Y-44997
X116505Y-45797
X116505Y-46597
X116505Y-47397
X116505Y-48197
X116505Y-48997
X116505Y-48997
X116505Y-76994
X116505Y-76994
X116505Y-77794
X116505Y-78594
X116505Y-79394
X116505Y-80194
X116505Y-80994
X116505Y-80994
X117305Y-44997
X117305Y-48997
X117305Y-76994
X117305Y-80994
X118105Y-44997
X118105Y-48997
X118105Y-76994
X118105Y-80994
X118905Y-44997
X118905Y-48997
X118905Y-76994
X118905Y-80994
X119705Y-44997
X119705Y-48997
X119705Y-76994
X119705Y-80994
X120505Y-44997
X120505Y-44997
X120505Y-45797
X120505Y-46597
X120505Y-47397
X120505Y-48197
X120505Y-48997
X120505Y-48997
X120505Y-76994
X120505Y-76994
X120505Y-77794
X120505Y-78594
X120505Y-79394
X120505Y-80194
X120505Y-80994
X120505Y-80994
X123505Y-32498
X123505Y-64495
X123505Y-96492
X123505Y-31748
X123505Y-63745
X123505Y-95742
X123506Y-30998
X123506Y-62995
X123506Y-94992
X123506Y-30248
X123506Y-62245
X123506Y-94242
X123506Y-29498
X123506Y-61495
X123506Y-93492
X133500Y-32498
X133500Y-64495
X133500Y-96492
X133500Y-31748
X133500Y-63745
X133500Y-95742
X133500Y-30998
X133500Y-62995
X133500Y-94992
X133500Y-30248
X133500Y-62245
X133500Y-94242
X133500Y-29498
X133500Y-61495
X133500Y-93492
X136502Y-44997
X136502Y-44997
X136502Y-45797
X136502Y-46597
X136502Y-47397
X136502Y-48197
X136502Y-48997
X136502Y-48997
X136502Y-76994
X136502Y-76994
X136502Y-77794
X136502Y-78594
X136502Y-79394
X136502Y-80194
X136502Y-80994
X136502Y-80994
X137302Y-44997
X137302Y-48997
X137302Y-76994
X137302Y-80994
X138102Y-44997
X138102Y-48997
X138102Y-76994
X138102Y-80994
X138902Y-44997
X138902Y-48997
X138902Y-76994
X138902Y-80994
X139702Y-44997
X139702Y-48997
X139702Y-76994
X139702Y-80994
X140502Y-44997
X140502Y-44997
X140502Y-45797
X140502Y-46597
X140502Y-47397
X140502Y-48197
X140502Y-48997
X140502Y-48997
X140502Y-76994
X140502Y-76994
X140502Y-77794
X140502Y-78594
X140502Y-79394
X140502Y-80194
X140502Y-80994
X140502Y-80994
X143502Y-32498
X143502Y-64495
X143502Y-96492
X143502Y-31748
X143502Y-63745
X143502Y-95742
X143503Y-30998
X143503Y-62995
X143503Y-94992
X143503Y-30248
X143503Y-62245
X143503Y-94242
X143503Y-29498
X143503Y-61495
X143503Y-93492
X153497Y-32498
X153497Y-64495
X153497Y-96492
X153497Y-31748
X153497Y-63745
X153497Y-95742
X153497Y-30998
X153497Y-62995
X153497Y-94992
X153497Y-30248
X153497Y-62245
X153497Y-94242
X153497Y-29498
X153497Y-61495
X153497Y-93492
X156498Y-44997
X156498Y-44997
X156498Y-45797
X156498Y-46597
X156498Y-47397
X156498Y-48197
X156498Y-48997
X156498Y-48997
X156498Y-76994
X156498Y-76994
X156498Y-77794
X156498Y-78594
X156498Y-79394
X156498Y-80194
X156498Y-80994
X156498Y-80994
X157298Y-44997
X157298Y-48997
X157298Y-76994
X157298Y-80994
X158098Y-44997
X158098Y-48997
X158098Y-76994
X158098Y-80994
X158898Y-44997
X158898Y-48997
X158898Y-76994
X158898Y-80994
X159698Y-44997
X159698Y-48997
X159698Y-76994
X159698Y-80994
X160498Y-44997
X160498Y-44997
X160498Y-45797
X160498Y-46597
X160498Y-47397
X160498Y-48197
X160498Y-48997
X160498Y-48997
X160498Y-76994
X160498Y-76994
X160498Y-77794
X160498Y-78594
X160498Y-79394
X160498Y-80194
X160498Y-80994
X160498Y-80994
X163499Y-32498
X163499Y-64495
X163499Y-96492
X163499Y-31748
X163499Y-63745
X163499Y-95742
X163499Y-30998
X163499Y-62995
X163499Y-94992
X163500Y-30248
X163500Y-62245
X163500Y-94242
X163500Y-29498
X163500Y-61495
X163500Y-93492
X173494Y-32498
X173494Y-64495
X173494Y-96492
X173494Y-31748
X173494Y-63745
X173494Y-95742
X173494Y-30998
X173494Y-62995
X173494Y-94992
X173494Y-30248
X173494Y-62245
X173494Y-94242
X173494Y-29498
X173494Y-61495
X173494Y-93492
X176495Y-44997
X176495Y-44997
X176495Y-45797
X176495Y-46597
X176495Y-47397
X176495Y-48197
X176495Y-48997
X176495Y-48997
X176495Y-76994
X176495Y-76994
X176495Y-77794
X176495Y-78594
X176495Y-79394
X176495Y-80194
X176495Y-80994
X176495Y-80994
X177295Y-44997
X177295Y-48997
X177295Y-76994
X177295Y-80994
X178095Y-44997
X178095Y-48997
X178095Y-76994
X178095Y-80994
X178895Y-44997
X178895Y-48997
X178895Y-76994
X178895Y-80994
X179695Y-44997
X179695Y-48997
X179695Y-76994
X179695Y-80994
X180495Y-44997
X180495Y-44997
X180495Y-45797
X180495Y-46597
X180495Y-47397
X180495Y-48197
X180495Y-48997
X180495Y-48997
X180495Y-76994
X180495Y-76994
X180495Y-77794
X180495Y-78594
X180495Y-79394
X180495Y-80194
X180495Y-80994
X180495Y-80994
X183496Y-32498
X183496Y-64495
X183496Y-96492
X183496Y-31748
X183496Y-63745
X183496Y-95742
X183496Y-30998
X183496Y-62995
X183496Y-94992
X183497Y-30248
X183497Y-62245
X183497Y-94242
X183497Y-29498
X183497Y-61495
X183497Y-93492
T0
M30
