%!PS-Adobe-3.0
%%Creator: PCBNEW
%%CreationDate: Wed Mar 15 23:54:54 2023
%%Title: ()
%%Pages: 1
%%PageOrder: Ascend
%%BoundingBox: 0 0 596 842
%%DocumentMedia: A4 595 842 0 () ()
%%Orientation: Landscape
%%EndComments
%%BeginProlog
/line { newpath moveto lineto stroke } bind def
/cir0 { newpath 0 360 arc stroke } bind def
/cir1 { newpath 0 360 arc gsave fill grestore stroke } bind def
/cir2 { newpath 0 360 arc gsave fill grestore stroke } bind def
/arc0 { newpath arc stroke } bind def
/arc1 { newpath 4 index 4 index moveto arc closepath gsave fill
    grestore stroke } bind def
/arc2 { newpath 4 index 4 index moveto arc closepath gsave fill
    grestore stroke } bind def
/poly0 { stroke } bind def
/poly1 { closepath gsave fill grestore stroke } bind def
/poly2 { closepath gsave fill grestore stroke } bind def
/rect0 { rectstroke } bind def
/rect1 { rectfill } bind def
/rect2 { rectfill } bind def
/linemode0 { 0 setlinecap 0 setlinejoin 0 setlinewidth } bind def
/linemode1 { 1 setlinecap 1 setlinejoin } bind def
/dashedline { [200] 100 setdash } bind def
/solidline { [] 0 setdash } bind def
/phantomshow { moveto
    /KicadFont findfont 0.000001 scalefont setfont
    show } bind def
/textshow { gsave
    findfont exch scalefont setfont concat 1 scale 0 0 moveto show
    } bind def
/reencodefont {
  findfont dup length dict begin
  { 1 index /FID ne
    { def }
    { pop pop } ifelse
  } forall
  /Encoding ISOLatin1Encoding def
  currentdict
  end } bind def
/KicadFont /Helvetica reencodefont definefont pop
/KicadFont-Bold /Helvetica-Bold reencodefont definefont pop
/KicadFont-Oblique /Helvetica-Oblique reencodefont definefont pop
/KicadFont-BoldOblique /Helvetica-BoldOblique reencodefont definefont pop
%%EndProlog
%Page: (1) 1
%%BeginPageSetup
gsave
0.0072 0.0072 scale
linemode1
82680 0 translate 90 rotate
236.22 setlinewidth
%%EndPageSetup
0 0 0 setrgbcolor
118.11 setlinewidth
newpath
52563.6 69366.3 moveto
52561.3 46385.7 lineto
stroke
0 0 0 setrgbcolor
newpath
64368.7 69360.4 moveto
64365.2 46385.7 lineto
stroke
0 0 0 setrgbcolor
54061.2 46385.6 1499.97 179.999 -89.9988 arc0
0 0 0 setrgbcolor
newpath
54063.6 70866.3 moveto
62868.7 70860.4 lineto
stroke
0 0 0 setrgbcolor
62865.2 46385.6 1499.97 -90.0012 0.00117301 arc0
0 0 0 setrgbcolor
54063.6 69366.3 1500 90 -180 arc0
0 0 0 setrgbcolor
newpath
62865.2 44885.7 moveto
54061.3 44885.7 lineto
stroke
0 0 0 setrgbcolor
62868.7 69360.4 1500 0 90 arc0
236.22 setlinewidth
47.2441 setlinewidth
newpath
53666.8 55020.7 moveto
54139.2 54548.2 lineto
stroke
newpath
54139.2 55020.7 moveto
53666.8 54548.2 lineto
stroke
newpath
56708.5 54940 moveto
57180.9 54467.6 lineto
stroke
newpath
57180.9 54940 moveto
56708.5 54467.6 lineto
stroke
newpath
58016.8 67770.7 moveto
58489.2 67298.2 lineto
stroke
newpath
58489.2 67770.7 moveto
58016.8 67298.2 lineto
stroke
newpath
58016.8 66570.7 moveto
58489.2 66098.2 lineto
stroke
newpath
58489.2 66570.7 moveto
58016.8 66098.2 lineto
stroke
newpath
58016.8 65370.7 moveto
58489.2 64898.2 lineto
stroke
newpath
58489.2 65370.7 moveto
58016.8 64898.2 lineto
stroke
newpath
58166.8 53070.7 moveto
58639.2 52598.2 lineto
stroke
newpath
58639.2 53070.7 moveto
58166.8 52598.2 lineto
stroke
newpath
59216.8 55320.7 moveto
59689.2 54848.2 lineto
stroke
newpath
59689.2 55320.7 moveto
59216.8 54848.2 lineto
stroke
newpath
59966.8 64170.7 moveto
60439.2 63698.2 lineto
stroke
newpath
60439.2 64170.7 moveto
59966.8 63698.2 lineto
stroke
newpath
61316.8 64170.7 moveto
61789.2 63698.2 lineto
stroke
newpath
61789.2 64170.7 moveto
61316.8 63698.2 lineto
stroke
newpath
62666.8 64170.7 moveto
63139.2 63698.2 lineto
stroke
newpath
63139.2 64170.7 moveto
62666.8 63698.2 lineto
stroke
236.22 setlinewidth
78.7406 setlinewidth
0 0 0 setrgbcolor
0 0 0 setrgbcolor
newpath
53477.1 43671.2 moveto
53477.1 44458.6 lineto
stroke
newpath
53477.1 44458.6 moveto
53664.6 44458.6 lineto
stroke
newpath
53664.6 44458.6 moveto
53777.1 44421.1 lineto
stroke
newpath
53777.1 44421.1 moveto
53852.1 44346.1 lineto
stroke
newpath
53852.1 44346.1 moveto
53889.5 44271.1 lineto
stroke
newpath
53889.5 44271.1 moveto
53927 44121.1 lineto
stroke
newpath
53927 44121.1 moveto
53927 44008.6 lineto
stroke
newpath
53927 44008.6 moveto
53889.5 43858.7 lineto
stroke
newpath
53889.5 43858.7 moveto
53852.1 43783.7 lineto
stroke
newpath
53852.1 43783.7 moveto
53777.1 43708.7 lineto
stroke
newpath
53777.1 43708.7 moveto
53664.6 43671.2 lineto
stroke
newpath
53664.6 43671.2 moveto
53477.1 43671.2 lineto
stroke
newpath
54264.5 43671.2 moveto
54264.5 44196.1 lineto
stroke
newpath
54264.5 44046.1 moveto
54302 44121.1 lineto
stroke
newpath
54302 44121.1 moveto
54339.5 44158.6 lineto
stroke
newpath
54339.5 44158.6 moveto
54414.5 44196.1 lineto
stroke
newpath
54414.5 44196.1 moveto
54489.5 44196.1 lineto
stroke
newpath
54751.9 43671.2 moveto
54751.9 44196.1 lineto
stroke
newpath
54751.9 44458.6 moveto
54714.4 44421.1 lineto
stroke
newpath
54714.4 44421.1 moveto
54751.9 44383.6 lineto
stroke
newpath
54751.9 44383.6 moveto
54789.4 44421.1 lineto
stroke
newpath
54789.4 44421.1 moveto
54751.9 44458.6 lineto
stroke
newpath
54751.9 44458.6 moveto
54751.9 44383.6 lineto
stroke
newpath
55239.4 43671.2 moveto
55164.4 43708.7 lineto
stroke
newpath
55164.4 43708.7 moveto
55126.9 43783.7 lineto
stroke
newpath
55126.9 43783.7 moveto
55126.9 44458.6 lineto
stroke
newpath
55651.8 43671.2 moveto
55576.8 43708.7 lineto
stroke
newpath
55576.8 43708.7 moveto
55539.3 43783.7 lineto
stroke
newpath
55539.3 43783.7 moveto
55539.3 44458.6 lineto
stroke
newpath
56424.2 43671.2 moveto
56424.2 44458.6 lineto
stroke
newpath
56424.2 44458.6 moveto
56686.7 43896.2 lineto
stroke
newpath
56686.7 43896.2 moveto
56949.2 44458.6 lineto
stroke
newpath
56949.2 44458.6 moveto
56949.2 43671.2 lineto
stroke
newpath
57661.6 43671.2 moveto
57661.6 44083.6 lineto
stroke
newpath
57661.6 44083.6 moveto
57624.1 44158.6 lineto
stroke
newpath
57624.1 44158.6 moveto
57549.1 44196.1 lineto
stroke
newpath
57549.1 44196.1 moveto
57399.1 44196.1 lineto
stroke
newpath
57399.1 44196.1 moveto
57324.1 44158.6 lineto
stroke
newpath
57661.6 43708.7 moveto
57586.6 43671.2 lineto
stroke
newpath
57586.6 43671.2 moveto
57399.1 43671.2 lineto
stroke
newpath
57399.1 43671.2 moveto
57324.1 43708.7 lineto
stroke
newpath
57324.1 43708.7 moveto
57286.6 43783.7 lineto
stroke
newpath
57286.6 43783.7 moveto
57286.6 43858.7 lineto
stroke
newpath
57286.6 43858.7 moveto
57324.1 43933.7 lineto
stroke
newpath
57324.1 43933.7 moveto
57399.1 43971.2 lineto
stroke
newpath
57399.1 43971.2 moveto
57586.6 43971.2 lineto
stroke
newpath
57586.6 43971.2 moveto
57661.6 44008.6 lineto
stroke
newpath
58036.5 44196.1 moveto
58036.5 43408.7 lineto
stroke
newpath
58036.5 44158.6 moveto
58111.5 44196.1 lineto
stroke
newpath
58111.5 44196.1 moveto
58261.5 44196.1 lineto
stroke
newpath
58261.5 44196.1 moveto
58336.5 44158.6 lineto
stroke
newpath
58336.5 44158.6 moveto
58374 44121.1 lineto
stroke
newpath
58374 44121.1 moveto
58411.5 44046.1 lineto
stroke
newpath
58411.5 44046.1 moveto
58411.5 43821.2 lineto
stroke
newpath
58411.5 43821.2 moveto
58374 43746.2 lineto
stroke
newpath
58374 43746.2 moveto
58336.5 43708.7 lineto
stroke
newpath
58336.5 43708.7 moveto
58261.5 43671.2 lineto
stroke
newpath
58261.5 43671.2 moveto
58111.5 43671.2 lineto
stroke
newpath
58111.5 43671.2 moveto
58036.5 43708.7 lineto
stroke
newpath
58748.9 43746.2 moveto
58786.4 43708.7 lineto
stroke
newpath
58786.4 43708.7 moveto
58748.9 43671.2 lineto
stroke
newpath
58748.9 43671.2 moveto
58711.4 43708.7 lineto
stroke
newpath
58711.4 43708.7 moveto
58748.9 43746.2 lineto
stroke
newpath
58748.9 43746.2 moveto
58748.9 43671.2 lineto
stroke
newpath
58748.9 44158.6 moveto
58786.4 44121.1 lineto
stroke
newpath
58786.4 44121.1 moveto
58748.9 44083.6 lineto
stroke
newpath
58748.9 44083.6 moveto
58711.4 44121.1 lineto
stroke
newpath
58711.4 44121.1 moveto
58748.9 44158.6 lineto
stroke
newpath
58748.9 44158.6 moveto
58748.9 44083.6 lineto
stroke
47.2441 setlinewidth
newpath
52029.8 42543.1 moveto
52502.2 42070.7 lineto
stroke
newpath
52502.2 42543.1 moveto
52029.8 42070.7 lineto
stroke
236.22 setlinewidth
78.7406 setlinewidth
0 0 0 setrgbcolor
0 0 0 setrgbcolor
newpath
53627.1 42805 moveto
53702.1 42805 lineto
stroke
newpath
53702.1 42805 moveto
53777.1 42767.5 lineto
stroke
newpath
53777.1 42767.5 moveto
53814.6 42730.1 lineto
stroke
newpath
53814.6 42730.1 moveto
53852.1 42655.1 lineto
stroke
newpath
53852.1 42655.1 moveto
53889.5 42505.1 lineto
stroke
newpath
53889.5 42505.1 moveto
53889.5 42317.6 lineto
stroke
newpath
53889.5 42317.6 moveto
53852.1 42167.6 lineto
stroke
newpath
53852.1 42167.6 moveto
53814.6 42092.6 lineto
stroke
newpath
53814.6 42092.6 moveto
53777.1 42055.1 lineto
stroke
newpath
53777.1 42055.1 moveto
53702.1 42017.6 lineto
stroke
newpath
53702.1 42017.6 moveto
53627.1 42017.6 lineto
stroke
newpath
53627.1 42017.6 moveto
53552.1 42055.1 lineto
stroke
newpath
53552.1 42055.1 moveto
53514.6 42092.6 lineto
stroke
newpath
53514.6 42092.6 moveto
53477.1 42167.6 lineto
stroke
newpath
53477.1 42167.6 moveto
53439.6 42317.6 lineto
stroke
newpath
53439.6 42317.6 moveto
53439.6 42505.1 lineto
stroke
newpath
53439.6 42505.1 moveto
53477.1 42655.1 lineto
stroke
newpath
53477.1 42655.1 moveto
53514.6 42730.1 lineto
stroke
newpath
53514.6 42730.1 moveto
53552.1 42767.5 lineto
stroke
newpath
53552.1 42767.5 moveto
53627.1 42805 lineto
stroke
newpath
54227 42092.6 moveto
54264.5 42055.1 lineto
stroke
newpath
54264.5 42055.1 moveto
54227 42017.6 lineto
stroke
newpath
54227 42017.6 moveto
54189.5 42055.1 lineto
stroke
newpath
54189.5 42055.1 moveto
54227 42092.6 lineto
stroke
newpath
54227 42092.6 moveto
54227 42017.6 lineto
stroke
newpath
54939.4 42542.6 moveto
54939.4 42017.6 lineto
stroke
newpath
54751.9 42842.5 moveto
54564.5 42280.1 lineto
stroke
newpath
54564.5 42280.1 moveto
55051.9 42280.1 lineto
stroke
newpath
55501.8 42805 moveto
55576.8 42805 lineto
stroke
newpath
55576.8 42805 moveto
55651.8 42767.5 lineto
stroke
newpath
55651.8 42767.5 moveto
55689.3 42730.1 lineto
stroke
newpath
55689.3 42730.1 moveto
55726.8 42655.1 lineto
stroke
newpath
55726.8 42655.1 moveto
55764.3 42505.1 lineto
stroke
newpath
55764.3 42505.1 moveto
55764.3 42317.6 lineto
stroke
newpath
55764.3 42317.6 moveto
55726.8 42167.6 lineto
stroke
newpath
55726.8 42167.6 moveto
55689.3 42092.6 lineto
stroke
newpath
55689.3 42092.6 moveto
55651.8 42055.1 lineto
stroke
newpath
55651.8 42055.1 moveto
55576.8 42017.6 lineto
stroke
newpath
55576.8 42017.6 moveto
55501.8 42017.6 lineto
stroke
newpath
55501.8 42017.6 moveto
55426.9 42055.1 lineto
stroke
newpath
55426.9 42055.1 moveto
55389.4 42092.6 lineto
stroke
newpath
55389.4 42092.6 moveto
55351.9 42167.6 lineto
stroke
newpath
55351.9 42167.6 moveto
55314.4 42317.6 lineto
stroke
newpath
55314.4 42317.6 moveto
55314.4 42505.1 lineto
stroke
newpath
55314.4 42505.1 moveto
55351.9 42655.1 lineto
stroke
newpath
55351.9 42655.1 moveto
55389.4 42730.1 lineto
stroke
newpath
55389.4 42730.1 moveto
55426.9 42767.5 lineto
stroke
newpath
55426.9 42767.5 moveto
55501.8 42805 lineto
stroke
newpath
56251.8 42805 moveto
56326.7 42805 lineto
stroke
newpath
56326.7 42805 moveto
56401.7 42767.5 lineto
stroke
newpath
56401.7 42767.5 moveto
56439.2 42730.1 lineto
stroke
newpath
56439.2 42730.1 moveto
56476.7 42655.1 lineto
stroke
newpath
56476.7 42655.1 moveto
56514.2 42505.1 lineto
stroke
newpath
56514.2 42505.1 moveto
56514.2 42317.6 lineto
stroke
newpath
56514.2 42317.6 moveto
56476.7 42167.6 lineto
stroke
newpath
56476.7 42167.6 moveto
56439.2 42092.6 lineto
stroke
newpath
56439.2 42092.6 moveto
56401.7 42055.1 lineto
stroke
newpath
56401.7 42055.1 moveto
56326.7 42017.6 lineto
stroke
newpath
56326.7 42017.6 moveto
56251.8 42017.6 lineto
stroke
newpath
56251.8 42017.6 moveto
56176.8 42055.1 lineto
stroke
newpath
56176.8 42055.1 moveto
56139.3 42092.6 lineto
stroke
newpath
56139.3 42092.6 moveto
56101.8 42167.6 lineto
stroke
newpath
56101.8 42167.6 moveto
56064.3 42317.6 lineto
stroke
newpath
56064.3 42317.6 moveto
56064.3 42505.1 lineto
stroke
newpath
56064.3 42505.1 moveto
56101.8 42655.1 lineto
stroke
newpath
56101.8 42655.1 moveto
56139.3 42730.1 lineto
stroke
newpath
56139.3 42730.1 moveto
56176.8 42767.5 lineto
stroke
newpath
56176.8 42767.5 moveto
56251.8 42805 lineto
stroke
newpath
56851.7 42017.6 moveto
56851.7 42542.6 lineto
stroke
newpath
56851.7 42467.6 moveto
56889.2 42505.1 lineto
stroke
newpath
56889.2 42505.1 moveto
56964.2 42542.6 lineto
stroke
newpath
56964.2 42542.6 moveto
57076.7 42542.6 lineto
stroke
newpath
57076.7 42542.6 moveto
57151.6 42505.1 lineto
stroke
newpath
57151.6 42505.1 moveto
57189.1 42430.1 lineto
stroke
newpath
57189.1 42430.1 moveto
57189.1 42017.6 lineto
stroke
newpath
57189.1 42430.1 moveto
57226.6 42505.1 lineto
stroke
newpath
57226.6 42505.1 moveto
57301.6 42542.6 lineto
stroke
newpath
57301.6 42542.6 moveto
57414.1 42542.6 lineto
stroke
newpath
57414.1 42542.6 moveto
57489.1 42505.1 lineto
stroke
newpath
57489.1 42505.1 moveto
57526.6 42430.1 lineto
stroke
newpath
57526.6 42430.1 moveto
57526.6 42017.6 lineto
stroke
newpath
57901.5 42017.6 moveto
57901.5 42542.6 lineto
stroke
newpath
57901.5 42467.6 moveto
57939 42505.1 lineto
stroke
newpath
57939 42505.1 moveto
58014 42542.6 lineto
stroke
newpath
58014 42542.6 moveto
58126.5 42542.6 lineto
stroke
newpath
58126.5 42542.6 moveto
58201.5 42505.1 lineto
stroke
newpath
58201.5 42505.1 moveto
58239 42430.1 lineto
stroke
newpath
58239 42430.1 moveto
58239 42017.6 lineto
stroke
newpath
58239 42430.1 moveto
58276.5 42505.1 lineto
stroke
newpath
58276.5 42505.1 moveto
58351.5 42542.6 lineto
stroke
newpath
58351.5 42542.6 moveto
58464 42542.6 lineto
stroke
newpath
58464 42542.6 moveto
58539 42505.1 lineto
stroke
newpath
58539 42505.1 moveto
58576.5 42430.1 lineto
stroke
newpath
58576.5 42430.1 moveto
58576.5 42017.6 lineto
stroke
newpath
59986.3 42842.5 moveto
59311.4 41830.2 lineto
stroke
newpath
60871.2 42805 moveto
60946.2 42805 lineto
stroke
newpath
60946.2 42805 moveto
61021.2 42767.5 lineto
stroke
newpath
61021.2 42767.5 moveto
61058.7 42730.1 lineto
stroke
newpath
61058.7 42730.1 moveto
61096.1 42655.1 lineto
stroke
newpath
61096.1 42655.1 moveto
61133.6 42505.1 lineto
stroke
newpath
61133.6 42505.1 moveto
61133.6 42317.6 lineto
stroke
newpath
61133.6 42317.6 moveto
61096.1 42167.6 lineto
stroke
newpath
61096.1 42167.6 moveto
61058.7 42092.6 lineto
stroke
newpath
61058.7 42092.6 moveto
61021.2 42055.1 lineto
stroke
newpath
61021.2 42055.1 moveto
60946.2 42017.6 lineto
stroke
newpath
60946.2 42017.6 moveto
60871.2 42017.6 lineto
stroke
newpath
60871.2 42017.6 moveto
60796.2 42055.1 lineto
stroke
newpath
60796.2 42055.1 moveto
60758.7 42092.6 lineto
stroke
newpath
60758.7 42092.6 moveto
60721.2 42167.6 lineto
stroke
newpath
60721.2 42167.6 moveto
60683.7 42317.6 lineto
stroke
newpath
60683.7 42317.6 moveto
60683.7 42505.1 lineto
stroke
newpath
60683.7 42505.1 moveto
60721.2 42655.1 lineto
stroke
newpath
60721.2 42655.1 moveto
60758.7 42730.1 lineto
stroke
newpath
60758.7 42730.1 moveto
60796.2 42767.5 lineto
stroke
newpath
60796.2 42767.5 moveto
60871.2 42805 lineto
stroke
newpath
61471.1 42092.6 moveto
61508.6 42055.1 lineto
stroke
newpath
61508.6 42055.1 moveto
61471.1 42017.6 lineto
stroke
newpath
61471.1 42017.6 moveto
61433.6 42055.1 lineto
stroke
newpath
61433.6 42055.1 moveto
61471.1 42092.6 lineto
stroke
newpath
61471.1 42092.6 moveto
61471.1 42017.6 lineto
stroke
newpath
61996 42805 moveto
62071 42805 lineto
stroke
newpath
62071 42805 moveto
62146 42767.5 lineto
stroke
newpath
62146 42767.5 moveto
62183.5 42730.1 lineto
stroke
newpath
62183.5 42730.1 moveto
62221 42655.1 lineto
stroke
newpath
62221 42655.1 moveto
62258.5 42505.1 lineto
stroke
newpath
62258.5 42505.1 moveto
62258.5 42317.6 lineto
stroke
newpath
62258.5 42317.6 moveto
62221 42167.6 lineto
stroke
newpath
62221 42167.6 moveto
62183.5 42092.6 lineto
stroke
newpath
62183.5 42092.6 moveto
62146 42055.1 lineto
stroke
newpath
62146 42055.1 moveto
62071 42017.6 lineto
stroke
newpath
62071 42017.6 moveto
61996 42017.6 lineto
stroke
newpath
61996 42017.6 moveto
61921 42055.1 lineto
stroke
newpath
61921 42055.1 moveto
61883.5 42092.6 lineto
stroke
newpath
61883.5 42092.6 moveto
61846.1 42167.6 lineto
stroke
newpath
61846.1 42167.6 moveto
61808.6 42317.6 lineto
stroke
newpath
61808.6 42317.6 moveto
61808.6 42505.1 lineto
stroke
newpath
61808.6 42505.1 moveto
61846.1 42655.1 lineto
stroke
newpath
61846.1 42655.1 moveto
61883.5 42730.1 lineto
stroke
newpath
61883.5 42730.1 moveto
61921 42767.5 lineto
stroke
newpath
61921 42767.5 moveto
61996 42805 lineto
stroke
newpath
63008.4 42017.6 moveto
62558.5 42017.6 lineto
stroke
newpath
62783.4 42017.6 moveto
62783.4 42805 lineto
stroke
newpath
62783.4 42805 moveto
62708.4 42692.6 lineto
stroke
newpath
62708.4 42692.6 moveto
62633.5 42617.6 lineto
stroke
newpath
62633.5 42617.6 moveto
62558.5 42580.1 lineto
stroke
newpath
63720.8 42805 moveto
63345.9 42805 lineto
stroke
newpath
63345.9 42805 moveto
63308.4 42430.1 lineto
stroke
newpath
63308.4 42430.1 moveto
63345.9 42467.6 lineto
stroke
newpath
63345.9 42467.6 moveto
63420.9 42505.1 lineto
stroke
newpath
63420.9 42505.1 moveto
63608.3 42505.1 lineto
stroke
newpath
63608.3 42505.1 moveto
63683.3 42467.6 lineto
stroke
newpath
63683.3 42467.6 moveto
63720.8 42430.1 lineto
stroke
newpath
63720.8 42430.1 moveto
63758.3 42355.1 lineto
stroke
newpath
63758.3 42355.1 moveto
63758.3 42167.6 lineto
stroke
newpath
63758.3 42167.6 moveto
63720.8 42092.6 lineto
stroke
newpath
63720.8 42092.6 moveto
63683.3 42055.1 lineto
stroke
newpath
63683.3 42055.1 moveto
63608.3 42017.6 lineto
stroke
newpath
63608.3 42017.6 moveto
63420.9 42017.6 lineto
stroke
newpath
63420.9 42017.6 moveto
63345.9 42055.1 lineto
stroke
newpath
63345.9 42055.1 moveto
63308.4 42092.6 lineto
stroke
newpath
64020.8 42805 moveto
64545.7 42805 lineto
stroke
newpath
64545.7 42805 moveto
64208.3 42017.6 lineto
stroke
newpath
64808.2 42805 moveto
64808.2 42655.1 lineto
stroke
newpath
65108.1 42805 moveto
65108.1 42655.1 lineto
stroke
newpath
66143 41717.7 moveto
66105.5 41755.2 lineto
stroke
newpath
66105.5 41755.2 moveto
66030.5 41867.7 lineto
stroke
newpath
66030.5 41867.7 moveto
65993 41942.7 lineto
stroke
newpath
65993 41942.7 moveto
65955.5 42055.1 lineto
stroke
newpath
65955.5 42055.1 moveto
65918 42242.6 lineto
stroke
newpath
65918 42242.6 moveto
65918 42392.6 lineto
stroke
newpath
65918 42392.6 moveto
65955.5 42580.1 lineto
stroke
newpath
65955.5 42580.1 moveto
65993 42692.6 lineto
stroke
newpath
65993 42692.6 moveto
66030.5 42767.5 lineto
stroke
newpath
66030.5 42767.5 moveto
66105.5 42880 lineto
stroke
newpath
66105.5 42880 moveto
66143 42917.5 lineto
stroke
newpath
66855.4 42017.6 moveto
66405.5 42017.6 lineto
stroke
newpath
66630.5 42017.6 moveto
66630.5 42805 lineto
stroke
newpath
66630.5 42805 moveto
66555.5 42692.6 lineto
stroke
newpath
66555.5 42692.6 moveto
66480.5 42617.6 lineto
stroke
newpath
66480.5 42617.6 moveto
66405.5 42580.1 lineto
stroke
newpath
67342.9 42805 moveto
67417.9 42805 lineto
stroke
newpath
67417.9 42805 moveto
67492.9 42767.5 lineto
stroke
newpath
67492.9 42767.5 moveto
67530.3 42730.1 lineto
stroke
newpath
67530.3 42730.1 moveto
67567.8 42655.1 lineto
stroke
newpath
67567.8 42655.1 moveto
67605.3 42505.1 lineto
stroke
newpath
67605.3 42505.1 moveto
67605.3 42317.6 lineto
stroke
newpath
67605.3 42317.6 moveto
67567.8 42167.6 lineto
stroke
newpath
67567.8 42167.6 moveto
67530.3 42092.6 lineto
stroke
newpath
67530.3 42092.6 moveto
67492.9 42055.1 lineto
stroke
newpath
67492.9 42055.1 moveto
67417.9 42017.6 lineto
stroke
newpath
67417.9 42017.6 moveto
67342.9 42017.6 lineto
stroke
newpath
67342.9 42017.6 moveto
67267.9 42055.1 lineto
stroke
newpath
67267.9 42055.1 moveto
67230.4 42092.6 lineto
stroke
newpath
67230.4 42092.6 moveto
67192.9 42167.6 lineto
stroke
newpath
67192.9 42167.6 moveto
67155.4 42317.6 lineto
stroke
newpath
67155.4 42317.6 moveto
67155.4 42505.1 lineto
stroke
newpath
67155.4 42505.1 moveto
67192.9 42655.1 lineto
stroke
newpath
67192.9 42655.1 moveto
67230.4 42730.1 lineto
stroke
newpath
67230.4 42730.1 moveto
67267.9 42767.5 lineto
stroke
newpath
67267.9 42767.5 moveto
67342.9 42805 lineto
stroke
newpath
68415.2 42017.6 moveto
68415.2 42805 lineto
stroke
newpath
68752.7 42017.6 moveto
68752.7 42430.1 lineto
stroke
newpath
68752.7 42430.1 moveto
68715.2 42505.1 lineto
stroke
newpath
68715.2 42505.1 moveto
68640.2 42542.6 lineto
stroke
newpath
68640.2 42542.6 moveto
68527.7 42542.6 lineto
stroke
newpath
68527.7 42542.6 moveto
68452.7 42505.1 lineto
stroke
newpath
68452.7 42505.1 moveto
68415.2 42467.6 lineto
stroke
newpath
69240.1 42017.6 moveto
69165.1 42055.1 lineto
stroke
newpath
69165.1 42055.1 moveto
69127.6 42092.6 lineto
stroke
newpath
69127.6 42092.6 moveto
69090.2 42167.6 lineto
stroke
newpath
69090.2 42167.6 moveto
69090.2 42392.6 lineto
stroke
newpath
69090.2 42392.6 moveto
69127.6 42467.6 lineto
stroke
newpath
69127.6 42467.6 moveto
69165.1 42505.1 lineto
stroke
newpath
69165.1 42505.1 moveto
69240.1 42542.6 lineto
stroke
newpath
69240.1 42542.6 moveto
69352.6 42542.6 lineto
stroke
newpath
69352.6 42542.6 moveto
69427.6 42505.1 lineto
stroke
newpath
69427.6 42505.1 moveto
69465.1 42467.6 lineto
stroke
newpath
69465.1 42467.6 moveto
69502.6 42392.6 lineto
stroke
newpath
69502.6 42392.6 moveto
69502.6 42167.6 lineto
stroke
newpath
69502.6 42167.6 moveto
69465.1 42092.6 lineto
stroke
newpath
69465.1 42092.6 moveto
69427.6 42055.1 lineto
stroke
newpath
69427.6 42055.1 moveto
69352.6 42017.6 lineto
stroke
newpath
69352.6 42017.6 moveto
69240.1 42017.6 lineto
stroke
newpath
69952.5 42017.6 moveto
69877.6 42055.1 lineto
stroke
newpath
69877.6 42055.1 moveto
69840.1 42130.1 lineto
stroke
newpath
69840.1 42130.1 moveto
69840.1 42805 lineto
stroke
newpath
70552.5 42055.1 moveto
70477.5 42017.6 lineto
stroke
newpath
70477.5 42017.6 moveto
70327.5 42017.6 lineto
stroke
newpath
70327.5 42017.6 moveto
70252.5 42055.1 lineto
stroke
newpath
70252.5 42055.1 moveto
70215 42130.1 lineto
stroke
newpath
70215 42130.1 moveto
70215 42430.1 lineto
stroke
newpath
70215 42430.1 moveto
70252.5 42505.1 lineto
stroke
newpath
70252.5 42505.1 moveto
70327.5 42542.6 lineto
stroke
newpath
70327.5 42542.6 moveto
70477.5 42542.6 lineto
stroke
newpath
70477.5 42542.6 moveto
70552.5 42505.1 lineto
stroke
newpath
70552.5 42505.1 moveto
70590 42430.1 lineto
stroke
newpath
70590 42430.1 moveto
70590 42355.1 lineto
stroke
newpath
70590 42355.1 moveto
70215 42280.1 lineto
stroke
newpath
70889.9 42055.1 moveto
70964.9 42017.6 lineto
stroke
newpath
70964.9 42017.6 moveto
71114.9 42017.6 lineto
stroke
newpath
71114.9 42017.6 moveto
71189.9 42055.1 lineto
stroke
newpath
71189.9 42055.1 moveto
71227.4 42130.1 lineto
stroke
newpath
71227.4 42130.1 moveto
71227.4 42167.6 lineto
stroke
newpath
71227.4 42167.6 moveto
71189.9 42242.6 lineto
stroke
newpath
71189.9 42242.6 moveto
71114.9 42280.1 lineto
stroke
newpath
71114.9 42280.1 moveto
71002.4 42280.1 lineto
stroke
newpath
71002.4 42280.1 moveto
70927.4 42317.6 lineto
stroke
newpath
70927.4 42317.6 moveto
70889.9 42392.6 lineto
stroke
newpath
70889.9 42392.6 moveto
70889.9 42430.1 lineto
stroke
newpath
70889.9 42430.1 moveto
70927.4 42505.1 lineto
stroke
newpath
70927.4 42505.1 moveto
71002.4 42542.6 lineto
stroke
newpath
71002.4 42542.6 moveto
71114.9 42542.6 lineto
stroke
newpath
71114.9 42542.6 moveto
71189.9 42505.1 lineto
stroke
newpath
71489.9 41717.7 moveto
71527.4 41755.2 lineto
stroke
newpath
71527.4 41755.2 moveto
71602.3 41867.7 lineto
stroke
newpath
71602.3 41867.7 moveto
71639.8 41942.7 lineto
stroke
newpath
71639.8 41942.7 moveto
71677.3 42055.1 lineto
stroke
newpath
71677.3 42055.1 moveto
71714.8 42242.6 lineto
stroke
newpath
71714.8 42242.6 moveto
71714.8 42392.6 lineto
stroke
newpath
71714.8 42392.6 moveto
71677.3 42580.1 lineto
stroke
newpath
71677.3 42580.1 moveto
71639.8 42692.6 lineto
stroke
newpath
71639.8 42692.6 moveto
71602.3 42767.5 lineto
stroke
newpath
71602.3 42767.5 moveto
71527.4 42880 lineto
stroke
newpath
71527.4 42880 moveto
71489.9 42917.5 lineto
stroke
showpage
grestore
%%EOF
