%!PS-Adobe-3.0
%%Creator: PCBNEW
%%CreationDate: Sun Apr  2 16:59:10 2023
%%Title: ()
%%Pages: 1
%%PageOrder: Ascend
%%BoundingBox: 0 0 596 842
%%DocumentMedia: A4 595 842 0 () ()
%%Orientation: Landscape
%%EndComments
%%BeginProlog
/line { newpath moveto lineto stroke } bind def
/cir0 { newpath 0 360 arc stroke } bind def
/cir1 { newpath 0 360 arc gsave fill grestore stroke } bind def
/cir2 { newpath 0 360 arc gsave fill grestore stroke } bind def
/arc0 { newpath arc stroke } bind def
/arc1 { newpath 4 index 4 index moveto arc closepath gsave fill
    grestore stroke } bind def
/arc2 { newpath 4 index 4 index moveto arc closepath gsave fill
    grestore stroke } bind def
/poly0 { stroke } bind def
/poly1 { closepath gsave fill grestore stroke } bind def
/poly2 { closepath gsave fill grestore stroke } bind def
/rect0 { rectstroke } bind def
/rect1 { rectfill } bind def
/rect2 { rectfill } bind def
/linemode0 { 0 setlinecap 0 setlinejoin 0 setlinewidth } bind def
/linemode1 { 1 setlinecap 1 setlinejoin } bind def
/dashedline { [200] 100 setdash } bind def
/solidline { [] 0 setdash } bind def
/phantomshow { moveto
    /KicadFont findfont 0.000001 scalefont setfont
    show } bind def
/textshow { gsave
    findfont exch scalefont setfont concat 1 scale 0 0 moveto show
    } bind def
/reencodefont {
  findfont dup length dict begin
  { 1 index /FID ne
    { def }
    { pop pop } ifelse
  } forall
  /Encoding ISOLatin1Encoding def
  currentdict
  end } bind def
/KicadFont /Helvetica reencodefont definefont pop
/KicadFont-Bold /Helvetica-Bold reencodefont definefont pop
/KicadFont-Oblique /Helvetica-Oblique reencodefont definefont pop
/KicadFont-BoldOblique /Helvetica-BoldOblique reencodefont definefont pop
%%EndProlog
%Page: (1) 1
%%BeginPageSetup
gsave
0.0072 0.0072 scale
linemode1
82680 0 translate 90 rotate
213.575 setlinewidth
%%EndPageSetup
213.575 setlinewidth
42.715 setlinewidth
newpath
31635.7 47972.5 moveto
32062.8 47545.4 lineto
stroke
newpath
32062.8 47972.5 moveto
31635.7 47545.4 lineto
stroke
newpath
31744.2 63487.5 moveto
32171.3 63060.3 lineto
stroke
newpath
32171.3 63487.5 moveto
31744.2 63060.3 lineto
stroke
newpath
31906.9 52082.2 moveto
32334.1 51655.1 lineto
stroke
newpath
32334.1 52082.2 moveto
31906.9 51655.1 lineto
stroke
newpath
32691.5 52855.8 moveto
33118.7 52428.7 lineto
stroke
newpath
33118.7 52855.8 moveto
32691.5 52428.7 lineto
stroke
newpath
32720.6 47972.5 moveto
33147.8 47545.4 lineto
stroke
newpath
33147.8 47972.5 moveto
32720.6 47545.4 lineto
stroke
newpath
33758.9 53357.3 moveto
34186 52930.1 lineto
stroke
newpath
34186 53357.3 moveto
33758.9 52930.1 lineto
stroke
newpath
33805.6 47972.5 moveto
34232.8 47545.4 lineto
stroke
newpath
34232.8 47972.5 moveto
33805.6 47545.4 lineto
stroke
newpath
34483.7 67501.8 moveto
34910.9 67074.7 lineto
stroke
newpath
34910.9 67501.8 moveto
34483.7 67074.7 lineto
stroke
newpath
34483.7 66145.6 moveto
34910.9 65718.5 lineto
stroke
newpath
34910.9 66145.6 moveto
34483.7 65718.5 lineto
stroke
newpath
35704.3 52854.8 moveto
36131.4 52427.7 lineto
stroke
newpath
36131.4 52854.8 moveto
35704.3 52427.7 lineto
stroke
newpath
35970.2 57154.6 moveto
36397.4 56727.5 lineto
stroke
newpath
36397.4 57154.6 moveto
35970.2 56727.5 lineto
stroke
newpath
35975.5 66145.6 moveto
36402.7 65718.5 lineto
stroke
newpath
36402.7 66145.6 moveto
35975.5 65718.5 lineto
stroke
newpath
36924.9 56652.2 moveto
37352 56225.1 lineto
stroke
newpath
37352 56652.2 moveto
36924.9 56225.1 lineto
stroke
newpath
37467.4 67501.8 moveto
37894.5 67074.7 lineto
stroke
newpath
37894.5 67501.8 moveto
37467.4 67074.7 lineto
stroke
newpath
37467.4 66145.6 moveto
37894.5 65718.5 lineto
stroke
newpath
37894.5 66145.6 moveto
37467.4 65718.5 lineto
stroke
newpath
48588.2 67095 moveto
49015.4 66667.8 lineto
stroke
newpath
49015.4 67095 moveto
48588.2 66667.8 lineto
stroke
newpath
61743.4 53397.3 moveto
62170.5 52970.2 lineto
stroke
newpath
62170.5 53397.3 moveto
61743.4 52970.2 lineto
stroke
newpath
61743.4 52303.2 moveto
62170.5 51876 lineto
stroke
newpath
62170.5 52303.2 moveto
61743.4 51876 lineto
stroke
newpath
61743.4 49871.2 moveto
62170.5 49444 lineto
stroke
newpath
62170.5 49871.2 moveto
61743.4 49444 lineto
stroke
newpath
61743.9 51197.6 moveto
62171.1 50770.4 lineto
stroke
newpath
62171.1 51197.6 moveto
61743.9 50770.4 lineto
stroke
newpath
66354.5 49871.2 moveto
66781.6 49444 lineto
stroke
newpath
66781.6 49871.2 moveto
66354.5 49444 lineto
stroke
newpath
67439.4 49871.2 moveto
67866.6 49444 lineto
stroke
newpath
67866.6 49871.2 moveto
67439.4 49444 lineto
stroke
newpath
68524.4 49871.2 moveto
68951.5 49444 lineto
stroke
newpath
68951.5 49871.2 moveto
68524.4 49444 lineto
stroke
newpath
69378.2 74689.7 moveto
69805.3 74262.6 lineto
stroke
newpath
69805.3 74689.7 moveto
69378.2 74262.6 lineto
stroke
newpath
69609.4 68858 moveto
70036.5 68430.9 lineto
stroke
newpath
70036.5 68858 moveto
69609.4 68430.9 lineto
stroke
newpath
70151.8 75503.4 moveto
70579 75076.3 lineto
stroke
newpath
70579 75503.4 moveto
70151.8 75076.3 lineto
stroke
newpath
74491.7 65331.9 moveto
74918.8 64904.8 lineto
stroke
newpath
74918.8 65331.9 moveto
74491.7 64904.8 lineto
stroke
newpath
75034.2 49600 moveto
75461.3 49172.8 lineto
stroke
newpath
75461.3 49600 moveto
75034.2 49172.8 lineto
stroke
newpath
76119.1 49600 moveto
76546.3 49172.8 lineto
stroke
newpath
76546.3 49600 moveto
76119.1 49172.8 lineto
stroke
newpath
76485.4 70023.1 moveto
76912.6 69595.9 lineto
stroke
newpath
76912.6 70023.1 moveto
76485.4 69595.9 lineto
stroke
newpath
77095.6 62576 moveto
77522.7 62148.9 lineto
stroke
newpath
77522.7 62576 moveto
77095.6 62148.9 lineto
stroke
newpath
77095.6 59635.9 moveto
77522.7 59208.7 lineto
stroke
newpath
77522.7 59635.9 moveto
77095.6 59208.7 lineto
stroke
newpath
77095.6 54438.8 moveto
77522.7 54011.7 lineto
stroke
newpath
77522.7 54438.8 moveto
77095.6 54011.7 lineto
stroke
newpath
77095.6 51661.4 moveto
77522.7 51234.2 lineto
stroke
newpath
77522.7 51661.4 moveto
77095.6 51234.2 lineto
stroke
newpath
78354.2 66744.2 moveto
78781.3 66317 lineto
stroke
newpath
78781.3 66744.2 moveto
78354.2 66317 lineto
stroke
newpath
79048.5 46305 moveto
79475.7 45877.9 lineto
stroke
newpath
79475.7 46305 moveto
79048.5 45877.9 lineto
stroke
newpath
79982.7 66819.5 moveto
80409.9 66392.3 lineto
stroke
newpath
80409.9 66819.5 moveto
79982.7 66392.3 lineto
stroke
newpath
80621.7 38153.6 moveto
81048.9 37726.5 lineto
stroke
newpath
81048.9 38153.6 moveto
80621.7 37726.5 lineto
stroke
newpath
81001.5 73573.8 moveto
81428.6 73146.6 lineto
stroke
newpath
81428.6 73573.8 moveto
81001.5 73146.6 lineto
stroke
newpath
81130.7 70049.8 moveto
81557.8 69622.6 lineto
stroke
newpath
81557.8 70049.8 moveto
81130.7 69622.6 lineto
stroke
newpath
82764.5 76995.3 moveto
83191.7 76568.1 lineto
stroke
newpath
83191.7 76995.3 moveto
82764.5 76568.1 lineto
stroke
newpath
82764.5 68586.8 moveto
83191.7 68159.6 lineto
stroke
newpath
83191.7 68586.8 moveto
82764.5 68159.6 lineto
stroke
newpath
84581.8 70788.8 moveto
85009 70361.6 lineto
stroke
newpath
85009 70788.8 moveto
84581.8 70361.6 lineto
stroke
newpath
84636.1 72123.6 moveto
85063.2 71696.5 lineto
stroke
newpath
85063.2 72123.6 moveto
84636.1 71696.5 lineto
stroke
newpath
84734.8 73360.2 moveto
85161.9 72933.1 lineto
stroke
newpath
85161.9 73360.2 moveto
84734.8 72933.1 lineto
stroke
newpath
84934.4 76588.4 moveto
85361.6 76161.2 lineto
stroke
newpath
85361.6 76588.4 moveto
84934.4 76161.2 lineto
stroke
newpath
85832.5 48808.9 moveto
86259.7 48381.7 lineto
stroke
newpath
86259.7 48808.9 moveto
85832.5 48381.7 lineto
stroke
newpath
86870.5 66899.6 moveto
87297.7 66472.4 lineto
stroke
newpath
87297.7 66899.6 moveto
86870.5 66472.4 lineto
stroke
newpath
86917.5 48839.6 moveto
87344.6 48412.5 lineto
stroke
newpath
87344.6 48839.6 moveto
86917.5 48412.5 lineto
stroke
newpath
88037.9 65884.6 moveto
88465 65457.4 lineto
stroke
newpath
88465 65884.6 moveto
88037.9 65457.4 lineto
stroke
newpath
88053.7 47701.3 moveto
88480.9 47274.1 lineto
stroke
newpath
88480.9 47701.3 moveto
88053.7 47274.1 lineto
stroke
newpath
88325 69943 moveto
88752.1 69515.9 lineto
stroke
newpath
88752.1 69943 moveto
88325 69515.9 lineto
stroke
newpath
88541.9 38153.6 moveto
88969.1 37726.5 lineto
stroke
newpath
88969.1 38153.6 moveto
88541.9 37726.5 lineto
stroke
newpath
89084.4 39021.6 moveto
89511.6 38594.4 lineto
stroke
newpath
89511.6 39021.6 moveto
89084.4 38594.4 lineto
stroke
newpath
89138.7 47701.3 moveto
89565.8 47274.1 lineto
stroke
newpath
89565.8 47701.3 moveto
89138.7 47274.1 lineto
stroke
newpath
89626.9 38184.4 moveto
90054.1 37757.2 lineto
stroke
newpath
90054.1 38184.4 moveto
89626.9 37757.2 lineto
stroke
newpath
90223.6 47701.3 moveto
90650.8 47274.1 lineto
stroke
newpath
90650.8 47701.3 moveto
90223.6 47274.1 lineto
stroke
newpath
90494.9 45531.4 moveto
90922 45104.2 lineto
stroke
newpath
90922 45531.4 moveto
90494.9 45104.2 lineto
stroke
newpath
90494.9 44446.4 moveto
90922 44019.2 lineto
stroke
newpath
90922 44446.4 moveto
90494.9 44019.2 lineto
stroke
newpath
90494.9 42818.9 moveto
90922 42391.8 lineto
stroke
newpath
90922 42818.9 moveto
90494.9 42391.8 lineto
stroke
newpath
90494.9 41734 moveto
90922 41306.8 lineto
stroke
newpath
90922 41734 moveto
90494.9 41306.8 lineto
stroke
newpath
92664.8 69807.4 moveto
93092 69380.2 lineto
stroke
newpath
93092 69807.4 moveto
92664.8 69380.2 lineto
stroke
newpath
92800.4 75503.4 moveto
93227.6 75076.3 lineto
stroke
newpath
93227.6 75503.4 moveto
92800.4 75076.3 lineto
stroke
106.788 setlinewidth
23641.6 75506.6 533.938 cir0
23641.6 72794.2 533.938 cir0
23641.6 70081.8 533.938 cir0
23641.6 67369.4 533.938 cir0
23641.6 64657 533.938 cir0
23641.6 61944.6 533.938 cir0
23641.6 59232.2 533.938 cir0
23641.6 56519.8 533.938 cir0
23641.6 53807.4 533.938 cir0
23641.6 51095 533.938 cir0
23641.6 48382.6 533.938 cir0
23641.6 45670.2 533.938 cir0
23641.6 42957.8 533.938 cir0
23641.6 40245.4 533.938 cir0
26354 75506.6 533.938 cir0
26354 72794.2 533.938 cir0
26354 70081.8 533.938 cir0
26354 67369.4 533.938 cir0
26354 64657 533.938 cir0
26354 61944.6 533.938 cir0
26354 59232.2 533.938 cir0
26354 56519.8 533.938 cir0
26354 53807.4 533.938 cir0
26354 51095 533.938 cir0
26354 48382.6 533.938 cir0
26354 45670.2 533.938 cir0
26354 42957.8 533.938 cir0
26354 40245.4 533.938 cir0
29066.4 75506.6 533.938 cir0
29066.4 72794.2 533.938 cir0
29066.4 70081.8 533.938 cir0
29066.4 67369.4 533.938 cir0
29066.4 64657 533.938 cir0
29066.4 61944.6 533.938 cir0
29066.4 59232.2 533.938 cir0
29066.4 56519.8 533.938 cir0
29066.4 53807.4 533.938 cir0
29066.4 51095 533.938 cir0
29066.4 48382.6 533.938 cir0
29066.4 45670.2 533.938 cir0
29066.4 42957.8 533.938 cir0
29066.4 40245.4 533.938 cir0
39916 70081.8 533.938 cir0
41805.1 76029.9 533.938 cir0
41805.1 39722.1 533.938 cir0
42628.4 70081.8 533.938 cir0
44517.5 76029.9 533.938 cir0
44517.5 39722.1 533.938 cir0
45340.8 70081.8 533.938 cir0
47229.9 76029.9 533.938 cir0
47229.9 39722.1 533.938 cir0
48053.2 70081.8 533.938 cir0
49942.3 76029.9 533.938 cir0
49942.3 39722.1 533.938 cir0
50765.6 70081.8 533.938 cir0
52654.7 76029.9 533.938 cir0
52654.7 39722.1 533.938 cir0
53478 70081.8 533.938 cir0
55367.1 76029.9 533.938 cir0
55367.1 39722.1 533.938 cir0
56190.4 70081.8 533.938 cir0
58079.5 76029.9 533.938 cir0
58079.5 39722.1 533.938 cir0
58902.8 70081.8 533.938 cir0
60791.9 76029.9 533.938 cir0
60791.9 39722.1 533.938 cir0
61615.2 70081.8 533.938 cir0
72464.9 75506.6 533.938 cir0
72464.9 72794.2 533.938 cir0
72464.9 70081.8 533.938 cir0
72464.9 67369.4 533.938 cir0
72464.9 64657 533.938 cir0
72464.9 61944.6 533.938 cir0
72464.9 59232.2 533.938 cir0
72464.9 56519.8 533.938 cir0
72464.9 53807.4 533.938 cir0
72464.9 51095 533.938 cir0
72464.9 48382.6 533.938 cir0
72464.9 45670.2 533.938 cir0
108.923 setlinewidth
newpath
81945.9 63818.5 moveto
81945.9 62729.3 lineto
stroke
newpath
81401.3 63273.9 moveto
82490.5 63273.9 lineto
stroke
newpath
81945.9 61106.1 moveto
81945.9 60016.9 lineto
stroke
newpath
81401.3 60561.5 moveto
82490.5 60561.5 lineto
stroke
newpath
81945.9 58393.7 moveto
81945.9 57304.5 lineto
stroke
newpath
81401.3 57849.1 moveto
82490.5 57849.1 lineto
stroke
newpath
81945.9 55681.3 moveto
81945.9 54592.1 lineto
stroke
newpath
81401.3 55136.7 moveto
82490.5 55136.7 lineto
stroke
newpath
81945.9 52968.9 moveto
81945.9 51879.7 lineto
stroke
newpath
81401.3 52424.3 moveto
82490.5 52424.3 lineto
stroke
newpath
84658.3 63818.5 moveto
84658.3 62729.3 lineto
stroke
newpath
84113.7 63273.9 moveto
85202.9 63273.9 lineto
stroke
newpath
84658.3 61106.1 moveto
84658.3 60016.9 lineto
stroke
newpath
84113.7 60561.5 moveto
85202.9 60561.5 lineto
stroke
newpath
84658.3 58393.7 moveto
84658.3 57304.5 lineto
stroke
newpath
84113.7 57849.1 moveto
85202.9 57849.1 lineto
stroke
newpath
84658.3 55681.3 moveto
84658.3 54592.1 lineto
stroke
newpath
84113.7 55136.7 moveto
85202.9 55136.7 lineto
stroke
newpath
84658.3 52968.9 moveto
84658.3 51879.7 lineto
stroke
newpath
84113.7 52424.3 moveto
85202.9 52424.3 lineto
stroke
newpath
87370.7 63818.5 moveto
87370.7 62729.3 lineto
stroke
newpath
86826.1 63273.9 moveto
87915.3 63273.9 lineto
stroke
newpath
87370.7 61106.1 moveto
87370.7 60016.9 lineto
stroke
newpath
86826.1 60561.5 moveto
87915.3 60561.5 lineto
stroke
newpath
87370.7 58393.7 moveto
87370.7 57304.5 lineto
stroke
newpath
86826.1 57849.1 moveto
87915.3 57849.1 lineto
stroke
newpath
87370.7 55681.3 moveto
87370.7 54592.1 lineto
stroke
newpath
86826.1 55136.7 moveto
87915.3 55136.7 lineto
stroke
newpath
87370.7 52968.9 moveto
87370.7 51879.7 lineto
stroke
newpath
86826.1 52424.3 moveto
87915.3 52424.3 lineto
stroke
266.969 setlinewidth
newpath
32178 76954.8 moveto
32178 78842.6 lineto
30290.3 78842.6 lineto
30290.3 76954.8 lineto
32178 76954.8 lineto
poly0
newpath
32178 36909.4 moveto
32178 38797.2 lineto
30290.3 38797.2 lineto
30290.3 36909.4 lineto
32178 36909.4 lineto
poly0
newpath
36182.6 72950.3 moveto
36182.6 74838 lineto
34294.8 74838 lineto
34294.8 72950.3 lineto
36182.6 72950.3 lineto
poly0
newpath
36182.6 40914 moveto
36182.6 42801.7 lineto
34294.8 42801.7 lineto
34294.8 40914 lineto
36182.6 40914 lineto
poly0
newpath
68218.9 72950.3 moveto
68218.9 74838 lineto
66331.1 74838 lineto
66331.1 72950.3 lineto
68218.9 72950.3 lineto
poly0
newpath
68218.9 40914 moveto
68218.9 42801.7 lineto
66331.1 42801.7 lineto
66331.1 40914 lineto
68218.9 40914 lineto
poly0
newpath
72223.4 76954.8 moveto
72223.4 78842.6 lineto
70335.6 78842.6 lineto
70335.6 76954.8 lineto
72223.4 76954.8 lineto
poly0
newpath
72223.4 36909.4 moveto
72223.4 38797.2 lineto
70335.6 38797.2 lineto
70335.6 36909.4 lineto
72223.4 36909.4 lineto
poly0
newpath
77829.8 74552.1 moveto
77829.8 76439.8 lineto
75942 76439.8 lineto
75942 74552.1 lineto
77829.8 74552.1 lineto
poly0
newpath
77829.8 39312.2 moveto
77829.8 41199.9 lineto
75942 41199.9 lineto
75942 39312.2 lineto
77829.8 39312.2 lineto
poly0
213.575 setlinewidth
78.7399 setlinewidth
0 0 0 setrgbcolor
0 0 0 setrgbcolor
newpath
22801 33885.1 moveto
22801 34672.5 lineto
stroke
newpath
22801 34672.5 moveto
22988.5 34672.5 lineto
stroke
newpath
22988.5 34672.5 moveto
23101 34635 lineto
stroke
newpath
23101 34635 moveto
23176 34560 lineto
stroke
newpath
23176 34560 moveto
23213.5 34485 lineto
stroke
newpath
23213.5 34485 moveto
23251 34335 lineto
stroke
newpath
23251 34335 moveto
23251 34222.5 lineto
stroke
newpath
23251 34222.5 moveto
23213.5 34072.6 lineto
stroke
newpath
23213.5 34072.6 moveto
23176 33997.6 lineto
stroke
newpath
23176 33997.6 moveto
23101 33922.6 lineto
stroke
newpath
23101 33922.6 moveto
22988.5 33885.1 lineto
stroke
newpath
22988.5 33885.1 moveto
22801 33885.1 lineto
stroke
newpath
23588.4 33885.1 moveto
23588.4 34410 lineto
stroke
newpath
23588.4 34260 moveto
23625.9 34335 lineto
stroke
newpath
23625.9 34335 moveto
23663.4 34372.5 lineto
stroke
newpath
23663.4 34372.5 moveto
23738.4 34410 lineto
stroke
newpath
23738.4 34410 moveto
23813.4 34410 lineto
stroke
newpath
24075.9 33885.1 moveto
24075.9 34410 lineto
stroke
newpath
24075.9 34672.5 moveto
24038.4 34635 lineto
stroke
newpath
24038.4 34635 moveto
24075.9 34597.5 lineto
stroke
newpath
24075.9 34597.5 moveto
24113.4 34635 lineto
stroke
newpath
24113.4 34635 moveto
24075.9 34672.5 lineto
stroke
newpath
24075.9 34672.5 moveto
24075.9 34597.5 lineto
stroke
newpath
24563.3 33885.1 moveto
24488.3 33922.6 lineto
stroke
newpath
24488.3 33922.6 moveto
24450.8 33997.6 lineto
stroke
newpath
24450.8 33997.6 moveto
24450.8 34672.5 lineto
stroke
newpath
24975.8 33885.1 moveto
24900.8 33922.6 lineto
stroke
newpath
24900.8 33922.6 moveto
24863.3 33997.6 lineto
stroke
newpath
24863.3 33997.6 moveto
24863.3 34672.5 lineto
stroke
newpath
25748.2 33885.1 moveto
25748.2 34672.5 lineto
stroke
newpath
25748.2 34672.5 moveto
26010.6 34110.1 lineto
stroke
newpath
26010.6 34110.1 moveto
26273.1 34672.5 lineto
stroke
newpath
26273.1 34672.5 moveto
26273.1 33885.1 lineto
stroke
newpath
26985.5 33885.1 moveto
26985.5 34297.5 lineto
stroke
newpath
26985.5 34297.5 moveto
26948 34372.5 lineto
stroke
newpath
26948 34372.5 moveto
26873 34410 lineto
stroke
newpath
26873 34410 moveto
26723.1 34410 lineto
stroke
newpath
26723.1 34410 moveto
26648.1 34372.5 lineto
stroke
newpath
26985.5 33922.6 moveto
26910.5 33885.1 lineto
stroke
newpath
26910.5 33885.1 moveto
26723.1 33885.1 lineto
stroke
newpath
26723.1 33885.1 moveto
26648.1 33922.6 lineto
stroke
newpath
26648.1 33922.6 moveto
26610.6 33997.6 lineto
stroke
newpath
26610.6 33997.6 moveto
26610.6 34072.6 lineto
stroke
newpath
26610.6 34072.6 moveto
26648.1 34147.6 lineto
stroke
newpath
26648.1 34147.6 moveto
26723.1 34185 lineto
stroke
newpath
26723.1 34185 moveto
26910.5 34185 lineto
stroke
newpath
26910.5 34185 moveto
26985.5 34222.5 lineto
stroke
newpath
27360.5 34410 moveto
27360.5 33622.6 lineto
stroke
newpath
27360.5 34372.5 moveto
27435.5 34410 lineto
stroke
newpath
27435.5 34410 moveto
27585.4 34410 lineto
stroke
newpath
27585.4 34410 moveto
27660.4 34372.5 lineto
stroke
newpath
27660.4 34372.5 moveto
27697.9 34335 lineto
stroke
newpath
27697.9 34335 moveto
27735.4 34260 lineto
stroke
newpath
27735.4 34260 moveto
27735.4 34035.1 lineto
stroke
newpath
27735.4 34035.1 moveto
27697.9 33960.1 lineto
stroke
newpath
27697.9 33960.1 moveto
27660.4 33922.6 lineto
stroke
newpath
27660.4 33922.6 moveto
27585.4 33885.1 lineto
stroke
newpath
27585.4 33885.1 moveto
27435.5 33885.1 lineto
stroke
newpath
27435.5 33885.1 moveto
27360.5 33922.6 lineto
stroke
newpath
28072.9 33960.1 moveto
28110.4 33922.6 lineto
stroke
newpath
28110.4 33922.6 moveto
28072.9 33885.1 lineto
stroke
newpath
28072.9 33885.1 moveto
28035.4 33922.6 lineto
stroke
newpath
28035.4 33922.6 moveto
28072.9 33960.1 lineto
stroke
newpath
28072.9 33960.1 moveto
28072.9 33885.1 lineto
stroke
newpath
28072.9 34372.5 moveto
28110.4 34335 lineto
stroke
newpath
28110.4 34335 moveto
28072.9 34297.5 lineto
stroke
newpath
28072.9 34297.5 moveto
28035.4 34335 lineto
stroke
newpath
28035.4 34335 moveto
28072.9 34372.5 lineto
stroke
newpath
28072.9 34372.5 moveto
28072.9 34297.5 lineto
stroke
42.715 setlinewidth
newpath
21399 32734.4 moveto
21826.2 32307.2 lineto
stroke
newpath
21826.2 32734.4 moveto
21399 32307.2 lineto
stroke
213.575 setlinewidth
78.7399 setlinewidth
0 0 0 setrgbcolor
0 0 0 setrgbcolor
newpath
22951 33018.9 moveto
23026 33018.9 lineto
stroke
newpath
23026 33018.9 moveto
23101 32981.4 lineto
stroke
newpath
23101 32981.4 moveto
23138.5 32944 lineto
stroke
newpath
23138.5 32944 moveto
23176 32869 lineto
stroke
newpath
23176 32869 moveto
23213.5 32719 lineto
stroke
newpath
23213.5 32719 moveto
23213.5 32531.5 lineto
stroke
newpath
23213.5 32531.5 moveto
23176 32381.5 lineto
stroke
newpath
23176 32381.5 moveto
23138.5 32306.5 lineto
stroke
newpath
23138.5 32306.5 moveto
23101 32269 lineto
stroke
newpath
23101 32269 moveto
23026 32231.5 lineto
stroke
newpath
23026 32231.5 moveto
22951 32231.5 lineto
stroke
newpath
22951 32231.5 moveto
22876 32269 lineto
stroke
newpath
22876 32269 moveto
22838.5 32306.5 lineto
stroke
newpath
22838.5 32306.5 moveto
22801 32381.5 lineto
stroke
newpath
22801 32381.5 moveto
22763.6 32531.5 lineto
stroke
newpath
22763.6 32531.5 moveto
22763.6 32719 lineto
stroke
newpath
22763.6 32719 moveto
22801 32869 lineto
stroke
newpath
22801 32869 moveto
22838.5 32944 lineto
stroke
newpath
22838.5 32944 moveto
22876 32981.4 lineto
stroke
newpath
22876 32981.4 moveto
22951 33018.9 lineto
stroke
newpath
23551 32306.5 moveto
23588.4 32269 lineto
stroke
newpath
23588.4 32269 moveto
23551 32231.5 lineto
stroke
newpath
23551 32231.5 moveto
23513.5 32269 lineto
stroke
newpath
23513.5 32269 moveto
23551 32306.5 lineto
stroke
newpath
23551 32306.5 moveto
23551 32231.5 lineto
stroke
newpath
24263.4 32756.5 moveto
24263.4 32231.5 lineto
stroke
newpath
24075.9 33056.4 moveto
23888.4 32494 lineto
stroke
newpath
23888.4 32494 moveto
24375.8 32494 lineto
stroke
newpath
24825.8 33018.9 moveto
24900.8 33018.9 lineto
stroke
newpath
24900.8 33018.9 moveto
24975.8 32981.4 lineto
stroke
newpath
24975.8 32981.4 moveto
25013.3 32944 lineto
stroke
newpath
25013.3 32944 moveto
25050.8 32869 lineto
stroke
newpath
25050.8 32869 moveto
25088.3 32719 lineto
stroke
newpath
25088.3 32719 moveto
25088.3 32531.5 lineto
stroke
newpath
25088.3 32531.5 moveto
25050.8 32381.5 lineto
stroke
newpath
25050.8 32381.5 moveto
25013.3 32306.5 lineto
stroke
newpath
25013.3 32306.5 moveto
24975.8 32269 lineto
stroke
newpath
24975.8 32269 moveto
24900.8 32231.5 lineto
stroke
newpath
24900.8 32231.5 moveto
24825.8 32231.5 lineto
stroke
newpath
24825.8 32231.5 moveto
24750.8 32269 lineto
stroke
newpath
24750.8 32269 moveto
24713.3 32306.5 lineto
stroke
newpath
24713.3 32306.5 moveto
24675.8 32381.5 lineto
stroke
newpath
24675.8 32381.5 moveto
24638.3 32531.5 lineto
stroke
newpath
24638.3 32531.5 moveto
24638.3 32719 lineto
stroke
newpath
24638.3 32719 moveto
24675.8 32869 lineto
stroke
newpath
24675.8 32869 moveto
24713.3 32944 lineto
stroke
newpath
24713.3 32944 moveto
24750.8 32981.4 lineto
stroke
newpath
24750.8 32981.4 moveto
24825.8 33018.9 lineto
stroke
newpath
25575.7 33018.9 moveto
25650.7 33018.9 lineto
stroke
newpath
25650.7 33018.9 moveto
25725.7 32981.4 lineto
stroke
newpath
25725.7 32981.4 moveto
25763.2 32944 lineto
stroke
newpath
25763.2 32944 moveto
25800.7 32869 lineto
stroke
newpath
25800.7 32869 moveto
25838.2 32719 lineto
stroke
newpath
25838.2 32719 moveto
25838.2 32531.5 lineto
stroke
newpath
25838.2 32531.5 moveto
25800.7 32381.5 lineto
stroke
newpath
25800.7 32381.5 moveto
25763.2 32306.5 lineto
stroke
newpath
25763.2 32306.5 moveto
25725.7 32269 lineto
stroke
newpath
25725.7 32269 moveto
25650.7 32231.5 lineto
stroke
newpath
25650.7 32231.5 moveto
25575.7 32231.5 lineto
stroke
newpath
25575.7 32231.5 moveto
25500.7 32269 lineto
stroke
newpath
25500.7 32269 moveto
25463.2 32306.5 lineto
stroke
newpath
25463.2 32306.5 moveto
25425.7 32381.5 lineto
stroke
newpath
25425.7 32381.5 moveto
25388.2 32531.5 lineto
stroke
newpath
25388.2 32531.5 moveto
25388.2 32719 lineto
stroke
newpath
25388.2 32719 moveto
25425.7 32869 lineto
stroke
newpath
25425.7 32869 moveto
25463.2 32944 lineto
stroke
newpath
25463.2 32944 moveto
25500.7 32981.4 lineto
stroke
newpath
25500.7 32981.4 moveto
25575.7 33018.9 lineto
stroke
newpath
26175.6 32231.5 moveto
26175.6 32756.5 lineto
stroke
newpath
26175.6 32681.5 moveto
26213.1 32719 lineto
stroke
newpath
26213.1 32719 moveto
26288.1 32756.5 lineto
stroke
newpath
26288.1 32756.5 moveto
26400.6 32756.5 lineto
stroke
newpath
26400.6 32756.5 moveto
26475.6 32719 lineto
stroke
newpath
26475.6 32719 moveto
26513.1 32644 lineto
stroke
newpath
26513.1 32644 moveto
26513.1 32231.5 lineto
stroke
newpath
26513.1 32644 moveto
26550.6 32719 lineto
stroke
newpath
26550.6 32719 moveto
26625.6 32756.5 lineto
stroke
newpath
26625.6 32756.5 moveto
26738.1 32756.5 lineto
stroke
newpath
26738.1 32756.5 moveto
26813 32719 lineto
stroke
newpath
26813 32719 moveto
26850.5 32644 lineto
stroke
newpath
26850.5 32644 moveto
26850.5 32231.5 lineto
stroke
newpath
27225.5 32231.5 moveto
27225.5 32756.5 lineto
stroke
newpath
27225.5 32681.5 moveto
27263 32719 lineto
stroke
newpath
27263 32719 moveto
27338 32756.5 lineto
stroke
newpath
27338 32756.5 moveto
27450.5 32756.5 lineto
stroke
newpath
27450.5 32756.5 moveto
27525.5 32719 lineto
stroke
newpath
27525.5 32719 moveto
27562.9 32644 lineto
stroke
newpath
27562.9 32644 moveto
27562.9 32231.5 lineto
stroke
newpath
27562.9 32644 moveto
27600.4 32719 lineto
stroke
newpath
27600.4 32719 moveto
27675.4 32756.5 lineto
stroke
newpath
27675.4 32756.5 moveto
27787.9 32756.5 lineto
stroke
newpath
27787.9 32756.5 moveto
27862.9 32719 lineto
stroke
newpath
27862.9 32719 moveto
27900.4 32644 lineto
stroke
newpath
27900.4 32644 moveto
27900.4 32231.5 lineto
stroke
newpath
29310.2 33056.4 moveto
28635.3 32044.1 lineto
stroke
newpath
30195.1 33018.9 moveto
30270.1 33018.9 lineto
stroke
newpath
30270.1 33018.9 moveto
30345.1 32981.4 lineto
stroke
newpath
30345.1 32981.4 moveto
30382.6 32944 lineto
stroke
newpath
30382.6 32944 moveto
30420.1 32869 lineto
stroke
newpath
30420.1 32869 moveto
30457.6 32719 lineto
stroke
newpath
30457.6 32719 moveto
30457.6 32531.5 lineto
stroke
newpath
30457.6 32531.5 moveto
30420.1 32381.5 lineto
stroke
newpath
30420.1 32381.5 moveto
30382.6 32306.5 lineto
stroke
newpath
30382.6 32306.5 moveto
30345.1 32269 lineto
stroke
newpath
30345.1 32269 moveto
30270.1 32231.5 lineto
stroke
newpath
30270.1 32231.5 moveto
30195.1 32231.5 lineto
stroke
newpath
30195.1 32231.5 moveto
30120.1 32269 lineto
stroke
newpath
30120.1 32269 moveto
30082.6 32306.5 lineto
stroke
newpath
30082.6 32306.5 moveto
30045.1 32381.5 lineto
stroke
newpath
30045.1 32381.5 moveto
30007.6 32531.5 lineto
stroke
newpath
30007.6 32531.5 moveto
30007.6 32719 lineto
stroke
newpath
30007.6 32719 moveto
30045.1 32869 lineto
stroke
newpath
30045.1 32869 moveto
30082.6 32944 lineto
stroke
newpath
30082.6 32944 moveto
30120.1 32981.4 lineto
stroke
newpath
30120.1 32981.4 moveto
30195.1 33018.9 lineto
stroke
newpath
30795 32306.5 moveto
30832.5 32269 lineto
stroke
newpath
30832.5 32269 moveto
30795 32231.5 lineto
stroke
newpath
30795 32231.5 moveto
30757.6 32269 lineto
stroke
newpath
30757.6 32269 moveto
30795 32306.5 lineto
stroke
newpath
30795 32306.5 moveto
30795 32231.5 lineto
stroke
newpath
31320 33018.9 moveto
31395 33018.9 lineto
stroke
newpath
31395 33018.9 moveto
31470 32981.4 lineto
stroke
newpath
31470 32981.4 moveto
31507.5 32944 lineto
stroke
newpath
31507.5 32944 moveto
31545 32869 lineto
stroke
newpath
31545 32869 moveto
31582.4 32719 lineto
stroke
newpath
31582.4 32719 moveto
31582.4 32531.5 lineto
stroke
newpath
31582.4 32531.5 moveto
31545 32381.5 lineto
stroke
newpath
31545 32381.5 moveto
31507.5 32306.5 lineto
stroke
newpath
31507.5 32306.5 moveto
31470 32269 lineto
stroke
newpath
31470 32269 moveto
31395 32231.5 lineto
stroke
newpath
31395 32231.5 moveto
31320 32231.5 lineto
stroke
newpath
31320 32231.5 moveto
31245 32269 lineto
stroke
newpath
31245 32269 moveto
31207.5 32306.5 lineto
stroke
newpath
31207.5 32306.5 moveto
31170 32381.5 lineto
stroke
newpath
31170 32381.5 moveto
31132.5 32531.5 lineto
stroke
newpath
31132.5 32531.5 moveto
31132.5 32719 lineto
stroke
newpath
31132.5 32719 moveto
31170 32869 lineto
stroke
newpath
31170 32869 moveto
31207.5 32944 lineto
stroke
newpath
31207.5 32944 moveto
31245 32981.4 lineto
stroke
newpath
31245 32981.4 moveto
31320 33018.9 lineto
stroke
newpath
32332.4 32231.5 moveto
31882.4 32231.5 lineto
stroke
newpath
32107.4 32231.5 moveto
32107.4 33018.9 lineto
stroke
newpath
32107.4 33018.9 moveto
32032.4 32906.5 lineto
stroke
newpath
32032.4 32906.5 moveto
31957.4 32831.5 lineto
stroke
newpath
31957.4 32831.5 moveto
31882.4 32794 lineto
stroke
newpath
33044.8 33018.9 moveto
32669.8 33018.9 lineto
stroke
newpath
32669.8 33018.9 moveto
32632.3 32644 lineto
stroke
newpath
32632.3 32644 moveto
32669.8 32681.5 lineto
stroke
newpath
32669.8 32681.5 moveto
32744.8 32719 lineto
stroke
newpath
32744.8 32719 moveto
32932.3 32719 lineto
stroke
newpath
32932.3 32719 moveto
33007.3 32681.5 lineto
stroke
newpath
33007.3 32681.5 moveto
33044.8 32644 lineto
stroke
newpath
33044.8 32644 moveto
33082.3 32569 lineto
stroke
newpath
33082.3 32569 moveto
33082.3 32381.5 lineto
stroke
newpath
33082.3 32381.5 moveto
33044.8 32306.5 lineto
stroke
newpath
33044.8 32306.5 moveto
33007.3 32269 lineto
stroke
newpath
33007.3 32269 moveto
32932.3 32231.5 lineto
stroke
newpath
32932.3 32231.5 moveto
32744.8 32231.5 lineto
stroke
newpath
32744.8 32231.5 moveto
32669.8 32269 lineto
stroke
newpath
32669.8 32269 moveto
32632.3 32306.5 lineto
stroke
newpath
33344.7 33018.9 moveto
33869.7 33018.9 lineto
stroke
newpath
33869.7 33018.9 moveto
33532.2 32231.5 lineto
stroke
newpath
34132.1 33018.9 moveto
34132.1 32869 lineto
stroke
newpath
34432.1 33018.9 moveto
34432.1 32869 lineto
stroke
newpath
35467 31931.6 moveto
35429.5 31969.1 lineto
stroke
newpath
35429.5 31969.1 moveto
35354.5 32081.6 lineto
stroke
newpath
35354.5 32081.6 moveto
35317 32156.6 lineto
stroke
newpath
35317 32156.6 moveto
35279.5 32269 lineto
stroke
newpath
35279.5 32269 moveto
35242 32456.5 lineto
stroke
newpath
35242 32456.5 moveto
35242 32606.5 lineto
stroke
newpath
35242 32606.5 moveto
35279.5 32794 lineto
stroke
newpath
35279.5 32794 moveto
35317 32906.5 lineto
stroke
newpath
35317 32906.5 moveto
35354.5 32981.4 lineto
stroke
newpath
35354.5 32981.4 moveto
35429.5 33093.9 lineto
stroke
newpath
35429.5 33093.9 moveto
35467 33131.4 lineto
stroke
newpath
36104.4 33018.9 moveto
35954.4 33018.9 lineto
stroke
newpath
35954.4 33018.9 moveto
35879.4 32981.4 lineto
stroke
newpath
35879.4 32981.4 moveto
35841.9 32944 lineto
stroke
newpath
35841.9 32944 moveto
35766.9 32831.5 lineto
stroke
newpath
35766.9 32831.5 moveto
35729.4 32681.5 lineto
stroke
newpath
35729.4 32681.5 moveto
35729.4 32381.5 lineto
stroke
newpath
35729.4 32381.5 moveto
35766.9 32306.5 lineto
stroke
newpath
35766.9 32306.5 moveto
35804.4 32269 lineto
stroke
newpath
35804.4 32269 moveto
35879.4 32231.5 lineto
stroke
newpath
35879.4 32231.5 moveto
36029.4 32231.5 lineto
stroke
newpath
36029.4 32231.5 moveto
36104.4 32269 lineto
stroke
newpath
36104.4 32269 moveto
36141.9 32306.5 lineto
stroke
newpath
36141.9 32306.5 moveto
36179.4 32381.5 lineto
stroke
newpath
36179.4 32381.5 moveto
36179.4 32569 lineto
stroke
newpath
36179.4 32569 moveto
36141.9 32644 lineto
stroke
newpath
36141.9 32644 moveto
36104.4 32681.5 lineto
stroke
newpath
36104.4 32681.5 moveto
36029.4 32719 lineto
stroke
newpath
36029.4 32719 moveto
35879.4 32719 lineto
stroke
newpath
35879.4 32719 moveto
35804.4 32681.5 lineto
stroke
newpath
35804.4 32681.5 moveto
35766.9 32644 lineto
stroke
newpath
35766.9 32644 moveto
35729.4 32569 lineto
stroke
newpath
36441.8 33018.9 moveto
36929.3 33018.9 lineto
stroke
newpath
36929.3 33018.9 moveto
36666.8 32719 lineto
stroke
newpath
36666.8 32719 moveto
36779.3 32719 lineto
stroke
newpath
36779.3 32719 moveto
36854.3 32681.5 lineto
stroke
newpath
36854.3 32681.5 moveto
36891.8 32644 lineto
stroke
newpath
36891.8 32644 moveto
36929.3 32569 lineto
stroke
newpath
36929.3 32569 moveto
36929.3 32381.5 lineto
stroke
newpath
36929.3 32381.5 moveto
36891.8 32306.5 lineto
stroke
newpath
36891.8 32306.5 moveto
36854.3 32269 lineto
stroke
newpath
36854.3 32269 moveto
36779.3 32231.5 lineto
stroke
newpath
36779.3 32231.5 moveto
36554.3 32231.5 lineto
stroke
newpath
36554.3 32231.5 moveto
36479.3 32269 lineto
stroke
newpath
36479.3 32269 moveto
36441.8 32306.5 lineto
stroke
newpath
37739.2 32231.5 moveto
37739.2 33018.9 lineto
stroke
newpath
38076.6 32231.5 moveto
38076.6 32644 lineto
stroke
newpath
38076.6 32644 moveto
38039.1 32719 lineto
stroke
newpath
38039.1 32719 moveto
37964.2 32756.5 lineto
stroke
newpath
37964.2 32756.5 moveto
37851.7 32756.5 lineto
stroke
newpath
37851.7 32756.5 moveto
37776.7 32719 lineto
stroke
newpath
37776.7 32719 moveto
37739.2 32681.5 lineto
stroke
newpath
38564.1 32231.5 moveto
38489.1 32269 lineto
stroke
newpath
38489.1 32269 moveto
38451.6 32306.5 lineto
stroke
newpath
38451.6 32306.5 moveto
38414.1 32381.5 lineto
stroke
newpath
38414.1 32381.5 moveto
38414.1 32606.5 lineto
stroke
newpath
38414.1 32606.5 moveto
38451.6 32681.5 lineto
stroke
newpath
38451.6 32681.5 moveto
38489.1 32719 lineto
stroke
newpath
38489.1 32719 moveto
38564.1 32756.5 lineto
stroke
newpath
38564.1 32756.5 moveto
38676.6 32756.5 lineto
stroke
newpath
38676.6 32756.5 moveto
38751.6 32719 lineto
stroke
newpath
38751.6 32719 moveto
38789 32681.5 lineto
stroke
newpath
38789 32681.5 moveto
38826.5 32606.5 lineto
stroke
newpath
38826.5 32606.5 moveto
38826.5 32381.5 lineto
stroke
newpath
38826.5 32381.5 moveto
38789 32306.5 lineto
stroke
newpath
38789 32306.5 moveto
38751.6 32269 lineto
stroke
newpath
38751.6 32269 moveto
38676.6 32231.5 lineto
stroke
newpath
38676.6 32231.5 moveto
38564.1 32231.5 lineto
stroke
newpath
39276.5 32231.5 moveto
39201.5 32269 lineto
stroke
newpath
39201.5 32269 moveto
39164 32344 lineto
stroke
newpath
39164 32344 moveto
39164 33018.9 lineto
stroke
newpath
39876.4 32269 moveto
39801.4 32231.5 lineto
stroke
newpath
39801.4 32231.5 moveto
39651.4 32231.5 lineto
stroke
newpath
39651.4 32231.5 moveto
39576.5 32269 lineto
stroke
newpath
39576.5 32269 moveto
39539 32344 lineto
stroke
newpath
39539 32344 moveto
39539 32644 lineto
stroke
newpath
39539 32644 moveto
39576.5 32719 lineto
stroke
newpath
39576.5 32719 moveto
39651.4 32756.5 lineto
stroke
newpath
39651.4 32756.5 moveto
39801.4 32756.5 lineto
stroke
newpath
39801.4 32756.5 moveto
39876.4 32719 lineto
stroke
newpath
39876.4 32719 moveto
39913.9 32644 lineto
stroke
newpath
39913.9 32644 moveto
39913.9 32569 lineto
stroke
newpath
39913.9 32569 moveto
39539 32494 lineto
stroke
newpath
40213.9 32269 moveto
40288.9 32231.5 lineto
stroke
newpath
40288.9 32231.5 moveto
40438.8 32231.5 lineto
stroke
newpath
40438.8 32231.5 moveto
40513.8 32269 lineto
stroke
newpath
40513.8 32269 moveto
40551.3 32344 lineto
stroke
newpath
40551.3 32344 moveto
40551.3 32381.5 lineto
stroke
newpath
40551.3 32381.5 moveto
40513.8 32456.5 lineto
stroke
newpath
40513.8 32456.5 moveto
40438.8 32494 lineto
stroke
newpath
40438.8 32494 moveto
40326.4 32494 lineto
stroke
newpath
40326.4 32494 moveto
40251.4 32531.5 lineto
stroke
newpath
40251.4 32531.5 moveto
40213.9 32606.5 lineto
stroke
newpath
40213.9 32606.5 moveto
40213.9 32644 lineto
stroke
newpath
40213.9 32644 moveto
40251.4 32719 lineto
stroke
newpath
40251.4 32719 moveto
40326.4 32756.5 lineto
stroke
newpath
40326.4 32756.5 moveto
40438.8 32756.5 lineto
stroke
newpath
40438.8 32756.5 moveto
40513.8 32719 lineto
stroke
newpath
40813.8 31931.6 moveto
40851.3 31969.1 lineto
stroke
newpath
40851.3 31969.1 moveto
40926.3 32081.6 lineto
stroke
newpath
40926.3 32081.6 moveto
40963.8 32156.6 lineto
stroke
newpath
40963.8 32156.6 moveto
41001.3 32269 lineto
stroke
newpath
41001.3 32269 moveto
41038.8 32456.5 lineto
stroke
newpath
41038.8 32456.5 moveto
41038.8 32606.5 lineto
stroke
newpath
41038.8 32606.5 moveto
41001.3 32794 lineto
stroke
newpath
41001.3 32794 moveto
40963.8 32906.5 lineto
stroke
newpath
40963.8 32906.5 moveto
40926.3 32981.4 lineto
stroke
newpath
40926.3 32981.4 moveto
40851.3 33093.9 lineto
stroke
newpath
40851.3 33093.9 moveto
40813.8 33131.4 lineto
stroke
21432.5 31481.4 393.7 cir0
213.575 setlinewidth
78.7399 setlinewidth
0 0 0 setrgbcolor
0 0 0 setrgbcolor
newpath
23213.5 31192.2 moveto
22763.6 31192.2 lineto
stroke
newpath
22988.5 31192.2 moveto
22988.5 31979.6 lineto
stroke
newpath
22988.5 31979.6 moveto
22913.5 31867.1 lineto
stroke
newpath
22913.5 31867.1 moveto
22838.5 31792.1 lineto
stroke
newpath
22838.5 31792.1 moveto
22763.6 31754.6 lineto
stroke
newpath
23551 31267.2 moveto
23588.4 31229.7 lineto
stroke
newpath
23588.4 31229.7 moveto
23551 31192.2 lineto
stroke
newpath
23551 31192.2 moveto
23513.5 31229.7 lineto
stroke
newpath
23513.5 31229.7 moveto
23551 31267.2 lineto
stroke
newpath
23551 31267.2 moveto
23551 31192.2 lineto
stroke
newpath
24075.9 31979.6 moveto
24150.9 31979.6 lineto
stroke
newpath
24150.9 31979.6 moveto
24225.9 31942.1 lineto
stroke
newpath
24225.9 31942.1 moveto
24263.4 31904.6 lineto
stroke
newpath
24263.4 31904.6 moveto
24300.9 31829.6 lineto
stroke
newpath
24300.9 31829.6 moveto
24338.4 31679.6 lineto
stroke
newpath
24338.4 31679.6 moveto
24338.4 31492.1 lineto
stroke
newpath
24338.4 31492.1 moveto
24300.9 31342.2 lineto
stroke
newpath
24300.9 31342.2 moveto
24263.4 31267.2 lineto
stroke
newpath
24263.4 31267.2 moveto
24225.9 31229.7 lineto
stroke
newpath
24225.9 31229.7 moveto
24150.9 31192.2 lineto
stroke
newpath
24150.9 31192.2 moveto
24075.9 31192.2 lineto
stroke
newpath
24075.9 31192.2 moveto
24000.9 31229.7 lineto
stroke
newpath
24000.9 31229.7 moveto
23963.4 31267.2 lineto
stroke
newpath
23963.4 31267.2 moveto
23925.9 31342.2 lineto
stroke
newpath
23925.9 31342.2 moveto
23888.4 31492.1 lineto
stroke
newpath
23888.4 31492.1 moveto
23888.4 31679.6 lineto
stroke
newpath
23888.4 31679.6 moveto
23925.9 31829.6 lineto
stroke
newpath
23925.9 31829.6 moveto
23963.4 31904.6 lineto
stroke
newpath
23963.4 31904.6 moveto
24000.9 31942.1 lineto
stroke
newpath
24000.9 31942.1 moveto
24075.9 31979.6 lineto
stroke
newpath
24825.8 31979.6 moveto
24900.8 31979.6 lineto
stroke
newpath
24900.8 31979.6 moveto
24975.8 31942.1 lineto
stroke
newpath
24975.8 31942.1 moveto
25013.3 31904.6 lineto
stroke
newpath
25013.3 31904.6 moveto
25050.8 31829.6 lineto
stroke
newpath
25050.8 31829.6 moveto
25088.3 31679.6 lineto
stroke
newpath
25088.3 31679.6 moveto
25088.3 31492.1 lineto
stroke
newpath
25088.3 31492.1 moveto
25050.8 31342.2 lineto
stroke
newpath
25050.8 31342.2 moveto
25013.3 31267.2 lineto
stroke
newpath
25013.3 31267.2 moveto
24975.8 31229.7 lineto
stroke
newpath
24975.8 31229.7 moveto
24900.8 31192.2 lineto
stroke
newpath
24900.8 31192.2 moveto
24825.8 31192.2 lineto
stroke
newpath
24825.8 31192.2 moveto
24750.8 31229.7 lineto
stroke
newpath
24750.8 31229.7 moveto
24713.3 31267.2 lineto
stroke
newpath
24713.3 31267.2 moveto
24675.8 31342.2 lineto
stroke
newpath
24675.8 31342.2 moveto
24638.3 31492.1 lineto
stroke
newpath
24638.3 31492.1 moveto
24638.3 31679.6 lineto
stroke
newpath
24638.3 31679.6 moveto
24675.8 31829.6 lineto
stroke
newpath
24675.8 31829.6 moveto
24713.3 31904.6 lineto
stroke
newpath
24713.3 31904.6 moveto
24750.8 31942.1 lineto
stroke
newpath
24750.8 31942.1 moveto
24825.8 31979.6 lineto
stroke
newpath
25575.7 31979.6 moveto
25650.7 31979.6 lineto
stroke
newpath
25650.7 31979.6 moveto
25725.7 31942.1 lineto
stroke
newpath
25725.7 31942.1 moveto
25763.2 31904.6 lineto
stroke
newpath
25763.2 31904.6 moveto
25800.7 31829.6 lineto
stroke
newpath
25800.7 31829.6 moveto
25838.2 31679.6 lineto
stroke
newpath
25838.2 31679.6 moveto
25838.2 31492.1 lineto
stroke
newpath
25838.2 31492.1 moveto
25800.7 31342.2 lineto
stroke
newpath
25800.7 31342.2 moveto
25763.2 31267.2 lineto
stroke
newpath
25763.2 31267.2 moveto
25725.7 31229.7 lineto
stroke
newpath
25725.7 31229.7 moveto
25650.7 31192.2 lineto
stroke
newpath
25650.7 31192.2 moveto
25575.7 31192.2 lineto
stroke
newpath
25575.7 31192.2 moveto
25500.7 31229.7 lineto
stroke
newpath
25500.7 31229.7 moveto
25463.2 31267.2 lineto
stroke
newpath
25463.2 31267.2 moveto
25425.7 31342.2 lineto
stroke
newpath
25425.7 31342.2 moveto
25388.2 31492.1 lineto
stroke
newpath
25388.2 31492.1 moveto
25388.2 31679.6 lineto
stroke
newpath
25388.2 31679.6 moveto
25425.7 31829.6 lineto
stroke
newpath
25425.7 31829.6 moveto
25463.2 31904.6 lineto
stroke
newpath
25463.2 31904.6 moveto
25500.7 31942.1 lineto
stroke
newpath
25500.7 31942.1 moveto
25575.7 31979.6 lineto
stroke
newpath
26175.6 31192.2 moveto
26175.6 31717.1 lineto
stroke
newpath
26175.6 31642.1 moveto
26213.1 31679.6 lineto
stroke
newpath
26213.1 31679.6 moveto
26288.1 31717.1 lineto
stroke
newpath
26288.1 31717.1 moveto
26400.6 31717.1 lineto
stroke
newpath
26400.6 31717.1 moveto
26475.6 31679.6 lineto
stroke
newpath
26475.6 31679.6 moveto
26513.1 31604.6 lineto
stroke
newpath
26513.1 31604.6 moveto
26513.1 31192.2 lineto
stroke
newpath
26513.1 31604.6 moveto
26550.6 31679.6 lineto
stroke
newpath
26550.6 31679.6 moveto
26625.6 31717.1 lineto
stroke
newpath
26625.6 31717.1 moveto
26738.1 31717.1 lineto
stroke
newpath
26738.1 31717.1 moveto
26813 31679.6 lineto
stroke
newpath
26813 31679.6 moveto
26850.5 31604.6 lineto
stroke
newpath
26850.5 31604.6 moveto
26850.5 31192.2 lineto
stroke
newpath
27225.5 31192.2 moveto
27225.5 31717.1 lineto
stroke
newpath
27225.5 31642.1 moveto
27263 31679.6 lineto
stroke
newpath
27263 31679.6 moveto
27338 31717.1 lineto
stroke
newpath
27338 31717.1 moveto
27450.5 31717.1 lineto
stroke
newpath
27450.5 31717.1 moveto
27525.5 31679.6 lineto
stroke
newpath
27525.5 31679.6 moveto
27562.9 31604.6 lineto
stroke
newpath
27562.9 31604.6 moveto
27562.9 31192.2 lineto
stroke
newpath
27562.9 31604.6 moveto
27600.4 31679.6 lineto
stroke
newpath
27600.4 31679.6 moveto
27675.4 31717.1 lineto
stroke
newpath
27675.4 31717.1 moveto
27787.9 31717.1 lineto
stroke
newpath
27787.9 31717.1 moveto
27862.9 31679.6 lineto
stroke
newpath
27862.9 31679.6 moveto
27900.4 31604.6 lineto
stroke
newpath
27900.4 31604.6 moveto
27900.4 31192.2 lineto
stroke
newpath
29310.2 32017.1 moveto
28635.3 31004.7 lineto
stroke
newpath
30195.1 31979.6 moveto
30270.1 31979.6 lineto
stroke
newpath
30270.1 31979.6 moveto
30345.1 31942.1 lineto
stroke
newpath
30345.1 31942.1 moveto
30382.6 31904.6 lineto
stroke
newpath
30382.6 31904.6 moveto
30420.1 31829.6 lineto
stroke
newpath
30420.1 31829.6 moveto
30457.6 31679.6 lineto
stroke
newpath
30457.6 31679.6 moveto
30457.6 31492.1 lineto
stroke
newpath
30457.6 31492.1 moveto
30420.1 31342.2 lineto
stroke
newpath
30420.1 31342.2 moveto
30382.6 31267.2 lineto
stroke
newpath
30382.6 31267.2 moveto
30345.1 31229.7 lineto
stroke
newpath
30345.1 31229.7 moveto
30270.1 31192.2 lineto
stroke
newpath
30270.1 31192.2 moveto
30195.1 31192.2 lineto
stroke
newpath
30195.1 31192.2 moveto
30120.1 31229.7 lineto
stroke
newpath
30120.1 31229.7 moveto
30082.6 31267.2 lineto
stroke
newpath
30082.6 31267.2 moveto
30045.1 31342.2 lineto
stroke
newpath
30045.1 31342.2 moveto
30007.6 31492.1 lineto
stroke
newpath
30007.6 31492.1 moveto
30007.6 31679.6 lineto
stroke
newpath
30007.6 31679.6 moveto
30045.1 31829.6 lineto
stroke
newpath
30045.1 31829.6 moveto
30082.6 31904.6 lineto
stroke
newpath
30082.6 31904.6 moveto
30120.1 31942.1 lineto
stroke
newpath
30120.1 31942.1 moveto
30195.1 31979.6 lineto
stroke
newpath
30795 31267.2 moveto
30832.5 31229.7 lineto
stroke
newpath
30832.5 31229.7 moveto
30795 31192.2 lineto
stroke
newpath
30795 31192.2 moveto
30757.6 31229.7 lineto
stroke
newpath
30757.6 31229.7 moveto
30795 31267.2 lineto
stroke
newpath
30795 31267.2 moveto
30795 31192.2 lineto
stroke
newpath
31320 31979.6 moveto
31395 31979.6 lineto
stroke
newpath
31395 31979.6 moveto
31470 31942.1 lineto
stroke
newpath
31470 31942.1 moveto
31507.5 31904.6 lineto
stroke
newpath
31507.5 31904.6 moveto
31545 31829.6 lineto
stroke
newpath
31545 31829.6 moveto
31582.4 31679.6 lineto
stroke
newpath
31582.4 31679.6 moveto
31582.4 31492.1 lineto
stroke
newpath
31582.4 31492.1 moveto
31545 31342.2 lineto
stroke
newpath
31545 31342.2 moveto
31507.5 31267.2 lineto
stroke
newpath
31507.5 31267.2 moveto
31470 31229.7 lineto
stroke
newpath
31470 31229.7 moveto
31395 31192.2 lineto
stroke
newpath
31395 31192.2 moveto
31320 31192.2 lineto
stroke
newpath
31320 31192.2 moveto
31245 31229.7 lineto
stroke
newpath
31245 31229.7 moveto
31207.5 31267.2 lineto
stroke
newpath
31207.5 31267.2 moveto
31170 31342.2 lineto
stroke
newpath
31170 31342.2 moveto
31132.5 31492.1 lineto
stroke
newpath
31132.5 31492.1 moveto
31132.5 31679.6 lineto
stroke
newpath
31132.5 31679.6 moveto
31170 31829.6 lineto
stroke
newpath
31170 31829.6 moveto
31207.5 31904.6 lineto
stroke
newpath
31207.5 31904.6 moveto
31245 31942.1 lineto
stroke
newpath
31245 31942.1 moveto
31320 31979.6 lineto
stroke
newpath
31844.9 31979.6 moveto
32332.4 31979.6 lineto
stroke
newpath
32332.4 31979.6 moveto
32069.9 31679.6 lineto
stroke
newpath
32069.9 31679.6 moveto
32182.4 31679.6 lineto
stroke
newpath
32182.4 31679.6 moveto
32257.4 31642.1 lineto
stroke
newpath
32257.4 31642.1 moveto
32294.9 31604.6 lineto
stroke
newpath
32294.9 31604.6 moveto
32332.4 31529.6 lineto
stroke
newpath
32332.4 31529.6 moveto
32332.4 31342.2 lineto
stroke
newpath
32332.4 31342.2 moveto
32294.9 31267.2 lineto
stroke
newpath
32294.9 31267.2 moveto
32257.4 31229.7 lineto
stroke
newpath
32257.4 31229.7 moveto
32182.4 31192.2 lineto
stroke
newpath
32182.4 31192.2 moveto
31957.4 31192.2 lineto
stroke
newpath
31957.4 31192.2 moveto
31882.4 31229.7 lineto
stroke
newpath
31882.4 31229.7 moveto
31844.9 31267.2 lineto
stroke
newpath
32707.3 31192.2 moveto
32857.3 31192.2 lineto
stroke
newpath
32857.3 31192.2 moveto
32932.3 31229.7 lineto
stroke
newpath
32932.3 31229.7 moveto
32969.8 31267.2 lineto
stroke
newpath
32969.8 31267.2 moveto
33044.8 31379.7 lineto
stroke
newpath
33044.8 31379.7 moveto
33082.3 31529.6 lineto
stroke
newpath
33082.3 31529.6 moveto
33082.3 31829.6 lineto
stroke
newpath
33082.3 31829.6 moveto
33044.8 31904.6 lineto
stroke
newpath
33044.8 31904.6 moveto
33007.3 31942.1 lineto
stroke
newpath
33007.3 31942.1 moveto
32932.3 31979.6 lineto
stroke
newpath
32932.3 31979.6 moveto
32782.3 31979.6 lineto
stroke
newpath
32782.3 31979.6 moveto
32707.3 31942.1 lineto
stroke
newpath
32707.3 31942.1 moveto
32669.8 31904.6 lineto
stroke
newpath
32669.8 31904.6 moveto
32632.3 31829.6 lineto
stroke
newpath
32632.3 31829.6 moveto
32632.3 31642.1 lineto
stroke
newpath
32632.3 31642.1 moveto
32669.8 31567.1 lineto
stroke
newpath
32669.8 31567.1 moveto
32707.3 31529.6 lineto
stroke
newpath
32707.3 31529.6 moveto
32782.3 31492.1 lineto
stroke
newpath
32782.3 31492.1 moveto
32932.3 31492.1 lineto
stroke
newpath
32932.3 31492.1 moveto
33007.3 31529.6 lineto
stroke
newpath
33007.3 31529.6 moveto
33044.8 31567.1 lineto
stroke
newpath
33044.8 31567.1 moveto
33082.3 31642.1 lineto
stroke
newpath
33757.2 31717.1 moveto
33757.2 31192.2 lineto
stroke
newpath
33569.7 32017.1 moveto
33382.2 31454.6 lineto
stroke
newpath
33382.2 31454.6 moveto
33869.7 31454.6 lineto
stroke
newpath
34132.1 31979.6 moveto
34132.1 31829.6 lineto
stroke
newpath
34432.1 31979.6 moveto
34432.1 31829.6 lineto
stroke
newpath
35467 30892.2 moveto
35429.5 30929.7 lineto
stroke
newpath
35429.5 30929.7 moveto
35354.5 31042.2 lineto
stroke
newpath
35354.5 31042.2 moveto
35317 31117.2 lineto
stroke
newpath
35317 31117.2 moveto
35279.5 31229.7 lineto
stroke
newpath
35279.5 31229.7 moveto
35242 31417.1 lineto
stroke
newpath
35242 31417.1 moveto
35242 31567.1 lineto
stroke
newpath
35242 31567.1 moveto
35279.5 31754.6 lineto
stroke
newpath
35279.5 31754.6 moveto
35317 31867.1 lineto
stroke
newpath
35317 31867.1 moveto
35354.5 31942.1 lineto
stroke
newpath
35354.5 31942.1 moveto
35429.5 32054.6 lineto
stroke
newpath
35429.5 32054.6 moveto
35467 32092.1 lineto
stroke
newpath
35691.9 31979.6 moveto
36216.9 31979.6 lineto
stroke
newpath
36216.9 31979.6 moveto
35879.4 31192.2 lineto
stroke
newpath
36554.3 31192.2 moveto
36704.3 31192.2 lineto
stroke
newpath
36704.3 31192.2 moveto
36779.3 31229.7 lineto
stroke
newpath
36779.3 31229.7 moveto
36816.8 31267.2 lineto
stroke
newpath
36816.8 31267.2 moveto
36891.8 31379.7 lineto
stroke
newpath
36891.8 31379.7 moveto
36929.3 31529.6 lineto
stroke
newpath
36929.3 31529.6 moveto
36929.3 31829.6 lineto
stroke
newpath
36929.3 31829.6 moveto
36891.8 31904.6 lineto
stroke
newpath
36891.8 31904.6 moveto
36854.3 31942.1 lineto
stroke
newpath
36854.3 31942.1 moveto
36779.3 31979.6 lineto
stroke
newpath
36779.3 31979.6 moveto
36629.3 31979.6 lineto
stroke
newpath
36629.3 31979.6 moveto
36554.3 31942.1 lineto
stroke
newpath
36554.3 31942.1 moveto
36516.8 31904.6 lineto
stroke
newpath
36516.8 31904.6 moveto
36479.3 31829.6 lineto
stroke
newpath
36479.3 31829.6 moveto
36479.3 31642.1 lineto
stroke
newpath
36479.3 31642.1 moveto
36516.8 31567.1 lineto
stroke
newpath
36516.8 31567.1 moveto
36554.3 31529.6 lineto
stroke
newpath
36554.3 31529.6 moveto
36629.3 31492.1 lineto
stroke
newpath
36629.3 31492.1 moveto
36779.3 31492.1 lineto
stroke
newpath
36779.3 31492.1 moveto
36854.3 31529.6 lineto
stroke
newpath
36854.3 31529.6 moveto
36891.8 31567.1 lineto
stroke
newpath
36891.8 31567.1 moveto
36929.3 31642.1 lineto
stroke
newpath
37739.2 31192.2 moveto
37739.2 31979.6 lineto
stroke
newpath
38076.6 31192.2 moveto
38076.6 31604.6 lineto
stroke
newpath
38076.6 31604.6 moveto
38039.1 31679.6 lineto
stroke
newpath
38039.1 31679.6 moveto
37964.2 31717.1 lineto
stroke
newpath
37964.2 31717.1 moveto
37851.7 31717.1 lineto
stroke
newpath
37851.7 31717.1 moveto
37776.7 31679.6 lineto
stroke
newpath
37776.7 31679.6 moveto
37739.2 31642.1 lineto
stroke
newpath
38564.1 31192.2 moveto
38489.1 31229.7 lineto
stroke
newpath
38489.1 31229.7 moveto
38451.6 31267.2 lineto
stroke
newpath
38451.6 31267.2 moveto
38414.1 31342.2 lineto
stroke
newpath
38414.1 31342.2 moveto
38414.1 31567.1 lineto
stroke
newpath
38414.1 31567.1 moveto
38451.6 31642.1 lineto
stroke
newpath
38451.6 31642.1 moveto
38489.1 31679.6 lineto
stroke
newpath
38489.1 31679.6 moveto
38564.1 31717.1 lineto
stroke
newpath
38564.1 31717.1 moveto
38676.6 31717.1 lineto
stroke
newpath
38676.6 31717.1 moveto
38751.6 31679.6 lineto
stroke
newpath
38751.6 31679.6 moveto
38789 31642.1 lineto
stroke
newpath
38789 31642.1 moveto
38826.5 31567.1 lineto
stroke
newpath
38826.5 31567.1 moveto
38826.5 31342.2 lineto
stroke
newpath
38826.5 31342.2 moveto
38789 31267.2 lineto
stroke
newpath
38789 31267.2 moveto
38751.6 31229.7 lineto
stroke
newpath
38751.6 31229.7 moveto
38676.6 31192.2 lineto
stroke
newpath
38676.6 31192.2 moveto
38564.1 31192.2 lineto
stroke
newpath
39276.5 31192.2 moveto
39201.5 31229.7 lineto
stroke
newpath
39201.5 31229.7 moveto
39164 31304.7 lineto
stroke
newpath
39164 31304.7 moveto
39164 31979.6 lineto
stroke
newpath
39876.4 31229.7 moveto
39801.4 31192.2 lineto
stroke
newpath
39801.4 31192.2 moveto
39651.4 31192.2 lineto
stroke
newpath
39651.4 31192.2 moveto
39576.5 31229.7 lineto
stroke
newpath
39576.5 31229.7 moveto
39539 31304.7 lineto
stroke
newpath
39539 31304.7 moveto
39539 31604.6 lineto
stroke
newpath
39539 31604.6 moveto
39576.5 31679.6 lineto
stroke
newpath
39576.5 31679.6 moveto
39651.4 31717.1 lineto
stroke
newpath
39651.4 31717.1 moveto
39801.4 31717.1 lineto
stroke
newpath
39801.4 31717.1 moveto
39876.4 31679.6 lineto
stroke
newpath
39876.4 31679.6 moveto
39913.9 31604.6 lineto
stroke
newpath
39913.9 31604.6 moveto
39913.9 31529.6 lineto
stroke
newpath
39913.9 31529.6 moveto
39539 31454.6 lineto
stroke
newpath
40213.9 31229.7 moveto
40288.9 31192.2 lineto
stroke
newpath
40288.9 31192.2 moveto
40438.8 31192.2 lineto
stroke
newpath
40438.8 31192.2 moveto
40513.8 31229.7 lineto
stroke
newpath
40513.8 31229.7 moveto
40551.3 31304.7 lineto
stroke
newpath
40551.3 31304.7 moveto
40551.3 31342.2 lineto
stroke
newpath
40551.3 31342.2 moveto
40513.8 31417.1 lineto
stroke
newpath
40513.8 31417.1 moveto
40438.8 31454.6 lineto
stroke
newpath
40438.8 31454.6 moveto
40326.4 31454.6 lineto
stroke
newpath
40326.4 31454.6 moveto
40251.4 31492.1 lineto
stroke
newpath
40251.4 31492.1 moveto
40213.9 31567.1 lineto
stroke
newpath
40213.9 31567.1 moveto
40213.9 31604.6 lineto
stroke
newpath
40213.9 31604.6 moveto
40251.4 31679.6 lineto
stroke
newpath
40251.4 31679.6 moveto
40326.4 31717.1 lineto
stroke
newpath
40326.4 31717.1 moveto
40438.8 31717.1 lineto
stroke
newpath
40438.8 31717.1 moveto
40513.8 31679.6 lineto
stroke
newpath
40813.8 30892.2 moveto
40851.3 30929.7 lineto
stroke
newpath
40851.3 30929.7 moveto
40926.3 31042.2 lineto
stroke
newpath
40926.3 31042.2 moveto
40963.8 31117.2 lineto
stroke
newpath
40963.8 31117.2 moveto
41001.3 31229.7 lineto
stroke
newpath
41001.3 31229.7 moveto
41038.8 31417.1 lineto
stroke
newpath
41038.8 31417.1 moveto
41038.8 31567.1 lineto
stroke
newpath
41038.8 31567.1 moveto
41001.3 31754.6 lineto
stroke
newpath
41001.3 31754.6 moveto
40963.8 31867.1 lineto
stroke
newpath
40963.8 31867.1 moveto
40926.3 31942.1 lineto
stroke
newpath
40926.3 31942.1 moveto
40851.3 32054.6 lineto
stroke
newpath
40851.3 32054.6 moveto
40813.8 32092.1 lineto
stroke
newpath
21432.5 30615.3 moveto
21432.5 29827.9 lineto
stroke
newpath
21038.8 30221.6 moveto
21826.2 30221.6 lineto
stroke
213.575 setlinewidth
78.7399 setlinewidth
0 0 0 setrgbcolor
0 0 0 setrgbcolor
newpath
23213.5 29932.3 moveto
22763.6 29932.3 lineto
stroke
newpath
22988.5 29932.3 moveto
22988.5 30719.7 lineto
stroke
newpath
22988.5 30719.7 moveto
22913.5 30607.2 lineto
stroke
newpath
22913.5 30607.2 moveto
22838.5 30532.3 lineto
stroke
newpath
22838.5 30532.3 moveto
22763.6 30494.8 lineto
stroke
newpath
23551 30007.3 moveto
23588.4 29969.8 lineto
stroke
newpath
23588.4 29969.8 moveto
23551 29932.3 lineto
stroke
newpath
23551 29932.3 moveto
23513.5 29969.8 lineto
stroke
newpath
23513.5 29969.8 moveto
23551 30007.3 lineto
stroke
newpath
23551 30007.3 moveto
23551 29932.3 lineto
stroke
newpath
24075.9 30719.7 moveto
24150.9 30719.7 lineto
stroke
newpath
24150.9 30719.7 moveto
24225.9 30682.2 lineto
stroke
newpath
24225.9 30682.2 moveto
24263.4 30644.7 lineto
stroke
newpath
24263.4 30644.7 moveto
24300.9 30569.8 lineto
stroke
newpath
24300.9 30569.8 moveto
24338.4 30419.8 lineto
stroke
newpath
24338.4 30419.8 moveto
24338.4 30232.3 lineto
stroke
newpath
24338.4 30232.3 moveto
24300.9 30082.3 lineto
stroke
newpath
24300.9 30082.3 moveto
24263.4 30007.3 lineto
stroke
newpath
24263.4 30007.3 moveto
24225.9 29969.8 lineto
stroke
newpath
24225.9 29969.8 moveto
24150.9 29932.3 lineto
stroke
newpath
24150.9 29932.3 moveto
24075.9 29932.3 lineto
stroke
newpath
24075.9 29932.3 moveto
24000.9 29969.8 lineto
stroke
newpath
24000.9 29969.8 moveto
23963.4 30007.3 lineto
stroke
newpath
23963.4 30007.3 moveto
23925.9 30082.3 lineto
stroke
newpath
23925.9 30082.3 moveto
23888.4 30232.3 lineto
stroke
newpath
23888.4 30232.3 moveto
23888.4 30419.8 lineto
stroke
newpath
23888.4 30419.8 moveto
23925.9 30569.8 lineto
stroke
newpath
23925.9 30569.8 moveto
23963.4 30644.7 lineto
stroke
newpath
23963.4 30644.7 moveto
24000.9 30682.2 lineto
stroke
newpath
24000.9 30682.2 moveto
24075.9 30719.7 lineto
stroke
newpath
24638.3 30644.7 moveto
24675.8 30682.2 lineto
stroke
newpath
24675.8 30682.2 moveto
24750.8 30719.7 lineto
stroke
newpath
24750.8 30719.7 moveto
24938.3 30719.7 lineto
stroke
newpath
24938.3 30719.7 moveto
25013.3 30682.2 lineto
stroke
newpath
25013.3 30682.2 moveto
25050.8 30644.7 lineto
stroke
newpath
25050.8 30644.7 moveto
25088.3 30569.8 lineto
stroke
newpath
25088.3 30569.8 moveto
25088.3 30494.8 lineto
stroke
newpath
25088.3 30494.8 moveto
25050.8 30382.3 lineto
stroke
newpath
25050.8 30382.3 moveto
24600.8 29932.3 lineto
stroke
newpath
24600.8 29932.3 moveto
25088.3 29932.3 lineto
stroke
newpath
25575.7 30719.7 moveto
25650.7 30719.7 lineto
stroke
newpath
25650.7 30719.7 moveto
25725.7 30682.2 lineto
stroke
newpath
25725.7 30682.2 moveto
25763.2 30644.7 lineto
stroke
newpath
25763.2 30644.7 moveto
25800.7 30569.8 lineto
stroke
newpath
25800.7 30569.8 moveto
25838.2 30419.8 lineto
stroke
newpath
25838.2 30419.8 moveto
25838.2 30232.3 lineto
stroke
newpath
25838.2 30232.3 moveto
25800.7 30082.3 lineto
stroke
newpath
25800.7 30082.3 moveto
25763.2 30007.3 lineto
stroke
newpath
25763.2 30007.3 moveto
25725.7 29969.8 lineto
stroke
newpath
25725.7 29969.8 moveto
25650.7 29932.3 lineto
stroke
newpath
25650.7 29932.3 moveto
25575.7 29932.3 lineto
stroke
newpath
25575.7 29932.3 moveto
25500.7 29969.8 lineto
stroke
newpath
25500.7 29969.8 moveto
25463.2 30007.3 lineto
stroke
newpath
25463.2 30007.3 moveto
25425.7 30082.3 lineto
stroke
newpath
25425.7 30082.3 moveto
25388.2 30232.3 lineto
stroke
newpath
25388.2 30232.3 moveto
25388.2 30419.8 lineto
stroke
newpath
25388.2 30419.8 moveto
25425.7 30569.8 lineto
stroke
newpath
25425.7 30569.8 moveto
25463.2 30644.7 lineto
stroke
newpath
25463.2 30644.7 moveto
25500.7 30682.2 lineto
stroke
newpath
25500.7 30682.2 moveto
25575.7 30719.7 lineto
stroke
newpath
26175.6 29932.3 moveto
26175.6 30457.3 lineto
stroke
newpath
26175.6 30382.3 moveto
26213.1 30419.8 lineto
stroke
newpath
26213.1 30419.8 moveto
26288.1 30457.3 lineto
stroke
newpath
26288.1 30457.3 moveto
26400.6 30457.3 lineto
stroke
newpath
26400.6 30457.3 moveto
26475.6 30419.8 lineto
stroke
newpath
26475.6 30419.8 moveto
26513.1 30344.8 lineto
stroke
newpath
26513.1 30344.8 moveto
26513.1 29932.3 lineto
stroke
newpath
26513.1 30344.8 moveto
26550.6 30419.8 lineto
stroke
newpath
26550.6 30419.8 moveto
26625.6 30457.3 lineto
stroke
newpath
26625.6 30457.3 moveto
26738.1 30457.3 lineto
stroke
newpath
26738.1 30457.3 moveto
26813 30419.8 lineto
stroke
newpath
26813 30419.8 moveto
26850.5 30344.8 lineto
stroke
newpath
26850.5 30344.8 moveto
26850.5 29932.3 lineto
stroke
newpath
27225.5 29932.3 moveto
27225.5 30457.3 lineto
stroke
newpath
27225.5 30382.3 moveto
27263 30419.8 lineto
stroke
newpath
27263 30419.8 moveto
27338 30457.3 lineto
stroke
newpath
27338 30457.3 moveto
27450.5 30457.3 lineto
stroke
newpath
27450.5 30457.3 moveto
27525.5 30419.8 lineto
stroke
newpath
27525.5 30419.8 moveto
27562.9 30344.8 lineto
stroke
newpath
27562.9 30344.8 moveto
27562.9 29932.3 lineto
stroke
newpath
27562.9 30344.8 moveto
27600.4 30419.8 lineto
stroke
newpath
27600.4 30419.8 moveto
27675.4 30457.3 lineto
stroke
newpath
27675.4 30457.3 moveto
27787.9 30457.3 lineto
stroke
newpath
27787.9 30457.3 moveto
27862.9 30419.8 lineto
stroke
newpath
27862.9 30419.8 moveto
27900.4 30344.8 lineto
stroke
newpath
27900.4 30344.8 moveto
27900.4 29932.3 lineto
stroke
newpath
29310.2 30757.2 moveto
28635.3 29744.9 lineto
stroke
newpath
30195.1 30719.7 moveto
30270.1 30719.7 lineto
stroke
newpath
30270.1 30719.7 moveto
30345.1 30682.2 lineto
stroke
newpath
30345.1 30682.2 moveto
30382.6 30644.7 lineto
stroke
newpath
30382.6 30644.7 moveto
30420.1 30569.8 lineto
stroke
newpath
30420.1 30569.8 moveto
30457.6 30419.8 lineto
stroke
newpath
30457.6 30419.8 moveto
30457.6 30232.3 lineto
stroke
newpath
30457.6 30232.3 moveto
30420.1 30082.3 lineto
stroke
newpath
30420.1 30082.3 moveto
30382.6 30007.3 lineto
stroke
newpath
30382.6 30007.3 moveto
30345.1 29969.8 lineto
stroke
newpath
30345.1 29969.8 moveto
30270.1 29932.3 lineto
stroke
newpath
30270.1 29932.3 moveto
30195.1 29932.3 lineto
stroke
newpath
30195.1 29932.3 moveto
30120.1 29969.8 lineto
stroke
newpath
30120.1 29969.8 moveto
30082.6 30007.3 lineto
stroke
newpath
30082.6 30007.3 moveto
30045.1 30082.3 lineto
stroke
newpath
30045.1 30082.3 moveto
30007.6 30232.3 lineto
stroke
newpath
30007.6 30232.3 moveto
30007.6 30419.8 lineto
stroke
newpath
30007.6 30419.8 moveto
30045.1 30569.8 lineto
stroke
newpath
30045.1 30569.8 moveto
30082.6 30644.7 lineto
stroke
newpath
30082.6 30644.7 moveto
30120.1 30682.2 lineto
stroke
newpath
30120.1 30682.2 moveto
30195.1 30719.7 lineto
stroke
newpath
30795 30007.3 moveto
30832.5 29969.8 lineto
stroke
newpath
30832.5 29969.8 moveto
30795 29932.3 lineto
stroke
newpath
30795 29932.3 moveto
30757.6 29969.8 lineto
stroke
newpath
30757.6 29969.8 moveto
30795 30007.3 lineto
stroke
newpath
30795 30007.3 moveto
30795 29932.3 lineto
stroke
newpath
31320 30719.7 moveto
31395 30719.7 lineto
stroke
newpath
31395 30719.7 moveto
31470 30682.2 lineto
stroke
newpath
31470 30682.2 moveto
31507.5 30644.7 lineto
stroke
newpath
31507.5 30644.7 moveto
31545 30569.8 lineto
stroke
newpath
31545 30569.8 moveto
31582.4 30419.8 lineto
stroke
newpath
31582.4 30419.8 moveto
31582.4 30232.3 lineto
stroke
newpath
31582.4 30232.3 moveto
31545 30082.3 lineto
stroke
newpath
31545 30082.3 moveto
31507.5 30007.3 lineto
stroke
newpath
31507.5 30007.3 moveto
31470 29969.8 lineto
stroke
newpath
31470 29969.8 moveto
31395 29932.3 lineto
stroke
newpath
31395 29932.3 moveto
31320 29932.3 lineto
stroke
newpath
31320 29932.3 moveto
31245 29969.8 lineto
stroke
newpath
31245 29969.8 moveto
31207.5 30007.3 lineto
stroke
newpath
31207.5 30007.3 moveto
31170 30082.3 lineto
stroke
newpath
31170 30082.3 moveto
31132.5 30232.3 lineto
stroke
newpath
31132.5 30232.3 moveto
31132.5 30419.8 lineto
stroke
newpath
31132.5 30419.8 moveto
31170 30569.8 lineto
stroke
newpath
31170 30569.8 moveto
31207.5 30644.7 lineto
stroke
newpath
31207.5 30644.7 moveto
31245 30682.2 lineto
stroke
newpath
31245 30682.2 moveto
31320 30719.7 lineto
stroke
newpath
32257.4 30457.3 moveto
32257.4 29932.3 lineto
stroke
newpath
32069.9 30757.2 moveto
31882.4 30194.8 lineto
stroke
newpath
31882.4 30194.8 moveto
32369.8 30194.8 lineto
stroke
newpath
32819.8 30719.7 moveto
32894.8 30719.7 lineto
stroke
newpath
32894.8 30719.7 moveto
32969.8 30682.2 lineto
stroke
newpath
32969.8 30682.2 moveto
33007.3 30644.7 lineto
stroke
newpath
33007.3 30644.7 moveto
33044.8 30569.8 lineto
stroke
newpath
33044.8 30569.8 moveto
33082.3 30419.8 lineto
stroke
newpath
33082.3 30419.8 moveto
33082.3 30232.3 lineto
stroke
newpath
33082.3 30232.3 moveto
33044.8 30082.3 lineto
stroke
newpath
33044.8 30082.3 moveto
33007.3 30007.3 lineto
stroke
newpath
33007.3 30007.3 moveto
32969.8 29969.8 lineto
stroke
newpath
32969.8 29969.8 moveto
32894.8 29932.3 lineto
stroke
newpath
32894.8 29932.3 moveto
32819.8 29932.3 lineto
stroke
newpath
32819.8 29932.3 moveto
32744.8 29969.8 lineto
stroke
newpath
32744.8 29969.8 moveto
32707.3 30007.3 lineto
stroke
newpath
32707.3 30007.3 moveto
32669.8 30082.3 lineto
stroke
newpath
32669.8 30082.3 moveto
32632.3 30232.3 lineto
stroke
newpath
32632.3 30232.3 moveto
32632.3 30419.8 lineto
stroke
newpath
32632.3 30419.8 moveto
32669.8 30569.8 lineto
stroke
newpath
32669.8 30569.8 moveto
32707.3 30644.7 lineto
stroke
newpath
32707.3 30644.7 moveto
32744.8 30682.2 lineto
stroke
newpath
32744.8 30682.2 moveto
32819.8 30719.7 lineto
stroke
newpath
33382.2 30644.7 moveto
33419.7 30682.2 lineto
stroke
newpath
33419.7 30682.2 moveto
33494.7 30719.7 lineto
stroke
newpath
33494.7 30719.7 moveto
33682.2 30719.7 lineto
stroke
newpath
33682.2 30719.7 moveto
33757.2 30682.2 lineto
stroke
newpath
33757.2 30682.2 moveto
33794.7 30644.7 lineto
stroke
newpath
33794.7 30644.7 moveto
33832.2 30569.8 lineto
stroke
newpath
33832.2 30569.8 moveto
33832.2 30494.8 lineto
stroke
newpath
33832.2 30494.8 moveto
33794.7 30382.3 lineto
stroke
newpath
33794.7 30382.3 moveto
33344.7 29932.3 lineto
stroke
newpath
33344.7 29932.3 moveto
33832.2 29932.3 lineto
stroke
newpath
34132.1 30719.7 moveto
34132.1 30569.8 lineto
stroke
newpath
34432.1 30719.7 moveto
34432.1 30569.8 lineto
stroke
newpath
35467 29632.4 moveto
35429.5 29669.9 lineto
stroke
newpath
35429.5 29669.9 moveto
35354.5 29782.3 lineto
stroke
newpath
35354.5 29782.3 moveto
35317 29857.3 lineto
stroke
newpath
35317 29857.3 moveto
35279.5 29969.8 lineto
stroke
newpath
35279.5 29969.8 moveto
35242 30157.3 lineto
stroke
newpath
35242 30157.3 moveto
35242 30307.3 lineto
stroke
newpath
35242 30307.3 moveto
35279.5 30494.8 lineto
stroke
newpath
35279.5 30494.8 moveto
35317 30607.2 lineto
stroke
newpath
35317 30607.2 moveto
35354.5 30682.2 lineto
stroke
newpath
35354.5 30682.2 moveto
35429.5 30794.7 lineto
stroke
newpath
35429.5 30794.7 moveto
35467 30832.2 lineto
stroke
newpath
36179.4 29932.3 moveto
35729.4 29932.3 lineto
stroke
newpath
35954.4 29932.3 moveto
35954.4 30719.7 lineto
stroke
newpath
35954.4 30719.7 moveto
35879.4 30607.2 lineto
stroke
newpath
35879.4 30607.2 moveto
35804.4 30532.3 lineto
stroke
newpath
35804.4 30532.3 moveto
35729.4 30494.8 lineto
stroke
newpath
36891.8 30719.7 moveto
36516.8 30719.7 lineto
stroke
newpath
36516.8 30719.7 moveto
36479.3 30344.8 lineto
stroke
newpath
36479.3 30344.8 moveto
36516.8 30382.3 lineto
stroke
newpath
36516.8 30382.3 moveto
36591.8 30419.8 lineto
stroke
newpath
36591.8 30419.8 moveto
36779.3 30419.8 lineto
stroke
newpath
36779.3 30419.8 moveto
36854.3 30382.3 lineto
stroke
newpath
36854.3 30382.3 moveto
36891.8 30344.8 lineto
stroke
newpath
36891.8 30344.8 moveto
36929.3 30269.8 lineto
stroke
newpath
36929.3 30269.8 moveto
36929.3 30082.3 lineto
stroke
newpath
36929.3 30082.3 moveto
36891.8 30007.3 lineto
stroke
newpath
36891.8 30007.3 moveto
36854.3 29969.8 lineto
stroke
newpath
36854.3 29969.8 moveto
36779.3 29932.3 lineto
stroke
newpath
36779.3 29932.3 moveto
36591.8 29932.3 lineto
stroke
newpath
36591.8 29932.3 moveto
36516.8 29969.8 lineto
stroke
newpath
36516.8 29969.8 moveto
36479.3 30007.3 lineto
stroke
newpath
37739.2 29932.3 moveto
37739.2 30719.7 lineto
stroke
newpath
38076.6 29932.3 moveto
38076.6 30344.8 lineto
stroke
newpath
38076.6 30344.8 moveto
38039.1 30419.8 lineto
stroke
newpath
38039.1 30419.8 moveto
37964.2 30457.3 lineto
stroke
newpath
37964.2 30457.3 moveto
37851.7 30457.3 lineto
stroke
newpath
37851.7 30457.3 moveto
37776.7 30419.8 lineto
stroke
newpath
37776.7 30419.8 moveto
37739.2 30382.3 lineto
stroke
newpath
38564.1 29932.3 moveto
38489.1 29969.8 lineto
stroke
newpath
38489.1 29969.8 moveto
38451.6 30007.3 lineto
stroke
newpath
38451.6 30007.3 moveto
38414.1 30082.3 lineto
stroke
newpath
38414.1 30082.3 moveto
38414.1 30307.3 lineto
stroke
newpath
38414.1 30307.3 moveto
38451.6 30382.3 lineto
stroke
newpath
38451.6 30382.3 moveto
38489.1 30419.8 lineto
stroke
newpath
38489.1 30419.8 moveto
38564.1 30457.3 lineto
stroke
newpath
38564.1 30457.3 moveto
38676.6 30457.3 lineto
stroke
newpath
38676.6 30457.3 moveto
38751.6 30419.8 lineto
stroke
newpath
38751.6 30419.8 moveto
38789 30382.3 lineto
stroke
newpath
38789 30382.3 moveto
38826.5 30307.3 lineto
stroke
newpath
38826.5 30307.3 moveto
38826.5 30082.3 lineto
stroke
newpath
38826.5 30082.3 moveto
38789 30007.3 lineto
stroke
newpath
38789 30007.3 moveto
38751.6 29969.8 lineto
stroke
newpath
38751.6 29969.8 moveto
38676.6 29932.3 lineto
stroke
newpath
38676.6 29932.3 moveto
38564.1 29932.3 lineto
stroke
newpath
39276.5 29932.3 moveto
39201.5 29969.8 lineto
stroke
newpath
39201.5 29969.8 moveto
39164 30044.8 lineto
stroke
newpath
39164 30044.8 moveto
39164 30719.7 lineto
stroke
newpath
39876.4 29969.8 moveto
39801.4 29932.3 lineto
stroke
newpath
39801.4 29932.3 moveto
39651.4 29932.3 lineto
stroke
newpath
39651.4 29932.3 moveto
39576.5 29969.8 lineto
stroke
newpath
39576.5 29969.8 moveto
39539 30044.8 lineto
stroke
newpath
39539 30044.8 moveto
39539 30344.8 lineto
stroke
newpath
39539 30344.8 moveto
39576.5 30419.8 lineto
stroke
newpath
39576.5 30419.8 moveto
39651.4 30457.3 lineto
stroke
newpath
39651.4 30457.3 moveto
39801.4 30457.3 lineto
stroke
newpath
39801.4 30457.3 moveto
39876.4 30419.8 lineto
stroke
newpath
39876.4 30419.8 moveto
39913.9 30344.8 lineto
stroke
newpath
39913.9 30344.8 moveto
39913.9 30269.8 lineto
stroke
newpath
39913.9 30269.8 moveto
39539 30194.8 lineto
stroke
newpath
40213.9 29969.8 moveto
40288.9 29932.3 lineto
stroke
newpath
40288.9 29932.3 moveto
40438.8 29932.3 lineto
stroke
newpath
40438.8 29932.3 moveto
40513.8 29969.8 lineto
stroke
newpath
40513.8 29969.8 moveto
40551.3 30044.8 lineto
stroke
newpath
40551.3 30044.8 moveto
40551.3 30082.3 lineto
stroke
newpath
40551.3 30082.3 moveto
40513.8 30157.3 lineto
stroke
newpath
40513.8 30157.3 moveto
40438.8 30194.8 lineto
stroke
newpath
40438.8 30194.8 moveto
40326.4 30194.8 lineto
stroke
newpath
40326.4 30194.8 moveto
40251.4 30232.3 lineto
stroke
newpath
40251.4 30232.3 moveto
40213.9 30307.3 lineto
stroke
newpath
40213.9 30307.3 moveto
40213.9 30344.8 lineto
stroke
newpath
40213.9 30344.8 moveto
40251.4 30419.8 lineto
stroke
newpath
40251.4 30419.8 moveto
40326.4 30457.3 lineto
stroke
newpath
40326.4 30457.3 moveto
40438.8 30457.3 lineto
stroke
newpath
40438.8 30457.3 moveto
40513.8 30419.8 lineto
stroke
newpath
40813.8 29632.4 moveto
40851.3 29669.9 lineto
stroke
newpath
40851.3 29669.9 moveto
40926.3 29782.3 lineto
stroke
newpath
40926.3 29782.3 moveto
40963.8 29857.3 lineto
stroke
newpath
40963.8 29857.3 moveto
41001.3 29969.8 lineto
stroke
newpath
41001.3 29969.8 moveto
41038.8 30157.3 lineto
stroke
newpath
41038.8 30157.3 moveto
41038.8 30307.3 lineto
stroke
newpath
41038.8 30307.3 moveto
41001.3 30494.8 lineto
stroke
newpath
41001.3 30494.8 moveto
40963.8 30607.2 lineto
stroke
newpath
40963.8 30607.2 moveto
40926.3 30682.2 lineto
stroke
newpath
40926.3 30682.2 moveto
40851.3 30794.7 lineto
stroke
newpath
40851.3 30794.7 moveto
40813.8 30832.2 lineto
stroke
newpath
21710.9 28683.4 moveto
21710.9 29240.2 lineto
21154.1 29240.2 lineto
21154.1 28683.4 lineto
21710.9 28683.4 lineto
poly0
213.575 setlinewidth
78.7399 setlinewidth
0 0 0 setrgbcolor
0 0 0 setrgbcolor
newpath
22763.6 29384.9 moveto
22801 29422.4 lineto
stroke
newpath
22801 29422.4 moveto
22876 29459.9 lineto
stroke
newpath
22876 29459.9 moveto
23063.5 29459.9 lineto
stroke
newpath
23063.5 29459.9 moveto
23138.5 29422.4 lineto
stroke
newpath
23138.5 29422.4 moveto
23176 29384.9 lineto
stroke
newpath
23176 29384.9 moveto
23213.5 29309.9 lineto
stroke
newpath
23213.5 29309.9 moveto
23213.5 29234.9 lineto
stroke
newpath
23213.5 29234.9 moveto
23176 29122.4 lineto
stroke
newpath
23176 29122.4 moveto
22726.1 28672.5 lineto
stroke
newpath
22726.1 28672.5 moveto
23213.5 28672.5 lineto
stroke
newpath
23551 28747.5 moveto
23588.4 28710 lineto
stroke
newpath
23588.4 28710 moveto
23551 28672.5 lineto
stroke
newpath
23551 28672.5 moveto
23513.5 28710 lineto
stroke
newpath
23513.5 28710 moveto
23551 28747.5 lineto
stroke
newpath
23551 28747.5 moveto
23551 28672.5 lineto
stroke
newpath
24300.9 29459.9 moveto
23925.9 29459.9 lineto
stroke
newpath
23925.9 29459.9 moveto
23888.4 29084.9 lineto
stroke
newpath
23888.4 29084.9 moveto
23925.9 29122.4 lineto
stroke
newpath
23925.9 29122.4 moveto
24000.9 29159.9 lineto
stroke
newpath
24000.9 29159.9 moveto
24188.4 29159.9 lineto
stroke
newpath
24188.4 29159.9 moveto
24263.4 29122.4 lineto
stroke
newpath
24263.4 29122.4 moveto
24300.9 29084.9 lineto
stroke
newpath
24300.9 29084.9 moveto
24338.4 29009.9 lineto
stroke
newpath
24338.4 29009.9 moveto
24338.4 28822.5 lineto
stroke
newpath
24338.4 28822.5 moveto
24300.9 28747.5 lineto
stroke
newpath
24300.9 28747.5 moveto
24263.4 28710 lineto
stroke
newpath
24263.4 28710 moveto
24188.4 28672.5 lineto
stroke
newpath
24188.4 28672.5 moveto
24000.9 28672.5 lineto
stroke
newpath
24000.9 28672.5 moveto
23925.9 28710 lineto
stroke
newpath
23925.9 28710 moveto
23888.4 28747.5 lineto
stroke
newpath
24825.8 29459.9 moveto
24900.8 29459.9 lineto
stroke
newpath
24900.8 29459.9 moveto
24975.8 29422.4 lineto
stroke
newpath
24975.8 29422.4 moveto
25013.3 29384.9 lineto
stroke
newpath
25013.3 29384.9 moveto
25050.8 29309.9 lineto
stroke
newpath
25050.8 29309.9 moveto
25088.3 29159.9 lineto
stroke
newpath
25088.3 29159.9 moveto
25088.3 28972.5 lineto
stroke
newpath
25088.3 28972.5 moveto
25050.8 28822.5 lineto
stroke
newpath
25050.8 28822.5 moveto
25013.3 28747.5 lineto
stroke
newpath
25013.3 28747.5 moveto
24975.8 28710 lineto
stroke
newpath
24975.8 28710 moveto
24900.8 28672.5 lineto
stroke
newpath
24900.8 28672.5 moveto
24825.8 28672.5 lineto
stroke
newpath
24825.8 28672.5 moveto
24750.8 28710 lineto
stroke
newpath
24750.8 28710 moveto
24713.3 28747.5 lineto
stroke
newpath
24713.3 28747.5 moveto
24675.8 28822.5 lineto
stroke
newpath
24675.8 28822.5 moveto
24638.3 28972.5 lineto
stroke
newpath
24638.3 28972.5 moveto
24638.3 29159.9 lineto
stroke
newpath
24638.3 29159.9 moveto
24675.8 29309.9 lineto
stroke
newpath
24675.8 29309.9 moveto
24713.3 29384.9 lineto
stroke
newpath
24713.3 29384.9 moveto
24750.8 29422.4 lineto
stroke
newpath
24750.8 29422.4 moveto
24825.8 29459.9 lineto
stroke
newpath
25575.7 29459.9 moveto
25650.7 29459.9 lineto
stroke
newpath
25650.7 29459.9 moveto
25725.7 29422.4 lineto
stroke
newpath
25725.7 29422.4 moveto
25763.2 29384.9 lineto
stroke
newpath
25763.2 29384.9 moveto
25800.7 29309.9 lineto
stroke
newpath
25800.7 29309.9 moveto
25838.2 29159.9 lineto
stroke
newpath
25838.2 29159.9 moveto
25838.2 28972.5 lineto
stroke
newpath
25838.2 28972.5 moveto
25800.7 28822.5 lineto
stroke
newpath
25800.7 28822.5 moveto
25763.2 28747.5 lineto
stroke
newpath
25763.2 28747.5 moveto
25725.7 28710 lineto
stroke
newpath
25725.7 28710 moveto
25650.7 28672.5 lineto
stroke
newpath
25650.7 28672.5 moveto
25575.7 28672.5 lineto
stroke
newpath
25575.7 28672.5 moveto
25500.7 28710 lineto
stroke
newpath
25500.7 28710 moveto
25463.2 28747.5 lineto
stroke
newpath
25463.2 28747.5 moveto
25425.7 28822.5 lineto
stroke
newpath
25425.7 28822.5 moveto
25388.2 28972.5 lineto
stroke
newpath
25388.2 28972.5 moveto
25388.2 29159.9 lineto
stroke
newpath
25388.2 29159.9 moveto
25425.7 29309.9 lineto
stroke
newpath
25425.7 29309.9 moveto
25463.2 29384.9 lineto
stroke
newpath
25463.2 29384.9 moveto
25500.7 29422.4 lineto
stroke
newpath
25500.7 29422.4 moveto
25575.7 29459.9 lineto
stroke
newpath
26175.6 28672.5 moveto
26175.6 29197.4 lineto
stroke
newpath
26175.6 29122.4 moveto
26213.1 29159.9 lineto
stroke
newpath
26213.1 29159.9 moveto
26288.1 29197.4 lineto
stroke
newpath
26288.1 29197.4 moveto
26400.6 29197.4 lineto
stroke
newpath
26400.6 29197.4 moveto
26475.6 29159.9 lineto
stroke
newpath
26475.6 29159.9 moveto
26513.1 29084.9 lineto
stroke
newpath
26513.1 29084.9 moveto
26513.1 28672.5 lineto
stroke
newpath
26513.1 29084.9 moveto
26550.6 29159.9 lineto
stroke
newpath
26550.6 29159.9 moveto
26625.6 29197.4 lineto
stroke
newpath
26625.6 29197.4 moveto
26738.1 29197.4 lineto
stroke
newpath
26738.1 29197.4 moveto
26813 29159.9 lineto
stroke
newpath
26813 29159.9 moveto
26850.5 29084.9 lineto
stroke
newpath
26850.5 29084.9 moveto
26850.5 28672.5 lineto
stroke
newpath
27225.5 28672.5 moveto
27225.5 29197.4 lineto
stroke
newpath
27225.5 29122.4 moveto
27263 29159.9 lineto
stroke
newpath
27263 29159.9 moveto
27338 29197.4 lineto
stroke
newpath
27338 29197.4 moveto
27450.5 29197.4 lineto
stroke
newpath
27450.5 29197.4 moveto
27525.5 29159.9 lineto
stroke
newpath
27525.5 29159.9 moveto
27562.9 29084.9 lineto
stroke
newpath
27562.9 29084.9 moveto
27562.9 28672.5 lineto
stroke
newpath
27562.9 29084.9 moveto
27600.4 29159.9 lineto
stroke
newpath
27600.4 29159.9 moveto
27675.4 29197.4 lineto
stroke
newpath
27675.4 29197.4 moveto
27787.9 29197.4 lineto
stroke
newpath
27787.9 29197.4 moveto
27862.9 29159.9 lineto
stroke
newpath
27862.9 29159.9 moveto
27900.4 29084.9 lineto
stroke
newpath
27900.4 29084.9 moveto
27900.4 28672.5 lineto
stroke
newpath
29310.2 29497.4 moveto
28635.3 28485 lineto
stroke
newpath
30195.1 29459.9 moveto
30270.1 29459.9 lineto
stroke
newpath
30270.1 29459.9 moveto
30345.1 29422.4 lineto
stroke
newpath
30345.1 29422.4 moveto
30382.6 29384.9 lineto
stroke
newpath
30382.6 29384.9 moveto
30420.1 29309.9 lineto
stroke
newpath
30420.1 29309.9 moveto
30457.6 29159.9 lineto
stroke
newpath
30457.6 29159.9 moveto
30457.6 28972.5 lineto
stroke
newpath
30457.6 28972.5 moveto
30420.1 28822.5 lineto
stroke
newpath
30420.1 28822.5 moveto
30382.6 28747.5 lineto
stroke
newpath
30382.6 28747.5 moveto
30345.1 28710 lineto
stroke
newpath
30345.1 28710 moveto
30270.1 28672.5 lineto
stroke
newpath
30270.1 28672.5 moveto
30195.1 28672.5 lineto
stroke
newpath
30195.1 28672.5 moveto
30120.1 28710 lineto
stroke
newpath
30120.1 28710 moveto
30082.6 28747.5 lineto
stroke
newpath
30082.6 28747.5 moveto
30045.1 28822.5 lineto
stroke
newpath
30045.1 28822.5 moveto
30007.6 28972.5 lineto
stroke
newpath
30007.6 28972.5 moveto
30007.6 29159.9 lineto
stroke
newpath
30007.6 29159.9 moveto
30045.1 29309.9 lineto
stroke
newpath
30045.1 29309.9 moveto
30082.6 29384.9 lineto
stroke
newpath
30082.6 29384.9 moveto
30120.1 29422.4 lineto
stroke
newpath
30120.1 29422.4 moveto
30195.1 29459.9 lineto
stroke
newpath
30795 28747.5 moveto
30832.5 28710 lineto
stroke
newpath
30832.5 28710 moveto
30795 28672.5 lineto
stroke
newpath
30795 28672.5 moveto
30757.6 28710 lineto
stroke
newpath
30757.6 28710 moveto
30795 28747.5 lineto
stroke
newpath
30795 28747.5 moveto
30795 28672.5 lineto
stroke
newpath
31320 29459.9 moveto
31395 29459.9 lineto
stroke
newpath
31395 29459.9 moveto
31470 29422.4 lineto
stroke
newpath
31470 29422.4 moveto
31507.5 29384.9 lineto
stroke
newpath
31507.5 29384.9 moveto
31545 29309.9 lineto
stroke
newpath
31545 29309.9 moveto
31582.4 29159.9 lineto
stroke
newpath
31582.4 29159.9 moveto
31582.4 28972.5 lineto
stroke
newpath
31582.4 28972.5 moveto
31545 28822.5 lineto
stroke
newpath
31545 28822.5 moveto
31507.5 28747.5 lineto
stroke
newpath
31507.5 28747.5 moveto
31470 28710 lineto
stroke
newpath
31470 28710 moveto
31395 28672.5 lineto
stroke
newpath
31395 28672.5 moveto
31320 28672.5 lineto
stroke
newpath
31320 28672.5 moveto
31245 28710 lineto
stroke
newpath
31245 28710 moveto
31207.5 28747.5 lineto
stroke
newpath
31207.5 28747.5 moveto
31170 28822.5 lineto
stroke
newpath
31170 28822.5 moveto
31132.5 28972.5 lineto
stroke
newpath
31132.5 28972.5 moveto
31132.5 29159.9 lineto
stroke
newpath
31132.5 29159.9 moveto
31170 29309.9 lineto
stroke
newpath
31170 29309.9 moveto
31207.5 29384.9 lineto
stroke
newpath
31207.5 29384.9 moveto
31245 29422.4 lineto
stroke
newpath
31245 29422.4 moveto
31320 29459.9 lineto
stroke
newpath
31957.4 28672.5 moveto
32107.4 28672.5 lineto
stroke
newpath
32107.4 28672.5 moveto
32182.4 28710 lineto
stroke
newpath
32182.4 28710 moveto
32219.9 28747.5 lineto
stroke
newpath
32219.9 28747.5 moveto
32294.9 28860 lineto
stroke
newpath
32294.9 28860 moveto
32332.4 29009.9 lineto
stroke
newpath
32332.4 29009.9 moveto
32332.4 29309.9 lineto
stroke
newpath
32332.4 29309.9 moveto
32294.9 29384.9 lineto
stroke
newpath
32294.9 29384.9 moveto
32257.4 29422.4 lineto
stroke
newpath
32257.4 29422.4 moveto
32182.4 29459.9 lineto
stroke
newpath
32182.4 29459.9 moveto
32032.4 29459.9 lineto
stroke
newpath
32032.4 29459.9 moveto
31957.4 29422.4 lineto
stroke
newpath
31957.4 29422.4 moveto
31919.9 29384.9 lineto
stroke
newpath
31919.9 29384.9 moveto
31882.4 29309.9 lineto
stroke
newpath
31882.4 29309.9 moveto
31882.4 29122.4 lineto
stroke
newpath
31882.4 29122.4 moveto
31919.9 29047.4 lineto
stroke
newpath
31919.9 29047.4 moveto
31957.4 29009.9 lineto
stroke
newpath
31957.4 29009.9 moveto
32032.4 28972.5 lineto
stroke
newpath
32032.4 28972.5 moveto
32182.4 28972.5 lineto
stroke
newpath
32182.4 28972.5 moveto
32257.4 29009.9 lineto
stroke
newpath
32257.4 29009.9 moveto
32294.9 29047.4 lineto
stroke
newpath
32294.9 29047.4 moveto
32332.4 29122.4 lineto
stroke
newpath
32782.3 29122.4 moveto
32707.3 29159.9 lineto
stroke
newpath
32707.3 29159.9 moveto
32669.8 29197.4 lineto
stroke
newpath
32669.8 29197.4 moveto
32632.3 29272.4 lineto
stroke
newpath
32632.3 29272.4 moveto
32632.3 29309.9 lineto
stroke
newpath
32632.3 29309.9 moveto
32669.8 29384.9 lineto
stroke
newpath
32669.8 29384.9 moveto
32707.3 29422.4 lineto
stroke
newpath
32707.3 29422.4 moveto
32782.3 29459.9 lineto
stroke
newpath
32782.3 29459.9 moveto
32932.3 29459.9 lineto
stroke
newpath
32932.3 29459.9 moveto
33007.3 29422.4 lineto
stroke
newpath
33007.3 29422.4 moveto
33044.8 29384.9 lineto
stroke
newpath
33044.8 29384.9 moveto
33082.3 29309.9 lineto
stroke
newpath
33082.3 29309.9 moveto
33082.3 29272.4 lineto
stroke
newpath
33082.3 29272.4 moveto
33044.8 29197.4 lineto
stroke
newpath
33044.8 29197.4 moveto
33007.3 29159.9 lineto
stroke
newpath
33007.3 29159.9 moveto
32932.3 29122.4 lineto
stroke
newpath
32932.3 29122.4 moveto
32782.3 29122.4 lineto
stroke
newpath
32782.3 29122.4 moveto
32707.3 29084.9 lineto
stroke
newpath
32707.3 29084.9 moveto
32669.8 29047.4 lineto
stroke
newpath
32669.8 29047.4 moveto
32632.3 28972.5 lineto
stroke
newpath
32632.3 28972.5 moveto
32632.3 28822.5 lineto
stroke
newpath
32632.3 28822.5 moveto
32669.8 28747.5 lineto
stroke
newpath
32669.8 28747.5 moveto
32707.3 28710 lineto
stroke
newpath
32707.3 28710 moveto
32782.3 28672.5 lineto
stroke
newpath
32782.3 28672.5 moveto
32932.3 28672.5 lineto
stroke
newpath
32932.3 28672.5 moveto
33007.3 28710 lineto
stroke
newpath
33007.3 28710 moveto
33044.8 28747.5 lineto
stroke
newpath
33044.8 28747.5 moveto
33082.3 28822.5 lineto
stroke
newpath
33082.3 28822.5 moveto
33082.3 28972.5 lineto
stroke
newpath
33082.3 28972.5 moveto
33044.8 29047.4 lineto
stroke
newpath
33044.8 29047.4 moveto
33007.3 29084.9 lineto
stroke
newpath
33007.3 29084.9 moveto
32932.3 29122.4 lineto
stroke
newpath
33757.2 29197.4 moveto
33757.2 28672.5 lineto
stroke
newpath
33569.7 29497.4 moveto
33382.2 28935 lineto
stroke
newpath
33382.2 28935 moveto
33869.7 28935 lineto
stroke
newpath
34132.1 29459.9 moveto
34132.1 29309.9 lineto
stroke
newpath
34432.1 29459.9 moveto
34432.1 29309.9 lineto
stroke
newpath
35467 28372.5 moveto
35429.5 28410 lineto
stroke
newpath
35429.5 28410 moveto
35354.5 28522.5 lineto
stroke
newpath
35354.5 28522.5 moveto
35317 28597.5 lineto
stroke
newpath
35317 28597.5 moveto
35279.5 28710 lineto
stroke
newpath
35279.5 28710 moveto
35242 28897.5 lineto
stroke
newpath
35242 28897.5 moveto
35242 29047.4 lineto
stroke
newpath
35242 29047.4 moveto
35279.5 29234.9 lineto
stroke
newpath
35279.5 29234.9 moveto
35317 29347.4 lineto
stroke
newpath
35317 29347.4 moveto
35354.5 29422.4 lineto
stroke
newpath
35354.5 29422.4 moveto
35429.5 29534.9 lineto
stroke
newpath
35429.5 29534.9 moveto
35467 29572.4 lineto
stroke
newpath
36179.4 28672.5 moveto
35729.4 28672.5 lineto
stroke
newpath
35954.4 28672.5 moveto
35954.4 29459.9 lineto
stroke
newpath
35954.4 29459.9 moveto
35879.4 29347.4 lineto
stroke
newpath
35879.4 29347.4 moveto
35804.4 29272.4 lineto
stroke
newpath
35804.4 29272.4 moveto
35729.4 29234.9 lineto
stroke
newpath
36666.8 29459.9 moveto
36741.8 29459.9 lineto
stroke
newpath
36741.8 29459.9 moveto
36816.8 29422.4 lineto
stroke
newpath
36816.8 29422.4 moveto
36854.3 29384.9 lineto
stroke
newpath
36854.3 29384.9 moveto
36891.8 29309.9 lineto
stroke
newpath
36891.8 29309.9 moveto
36929.3 29159.9 lineto
stroke
newpath
36929.3 29159.9 moveto
36929.3 28972.5 lineto
stroke
newpath
36929.3 28972.5 moveto
36891.8 28822.5 lineto
stroke
newpath
36891.8 28822.5 moveto
36854.3 28747.5 lineto
stroke
newpath
36854.3 28747.5 moveto
36816.8 28710 lineto
stroke
newpath
36816.8 28710 moveto
36741.8 28672.5 lineto
stroke
newpath
36741.8 28672.5 moveto
36666.8 28672.5 lineto
stroke
newpath
36666.8 28672.5 moveto
36591.8 28710 lineto
stroke
newpath
36591.8 28710 moveto
36554.3 28747.5 lineto
stroke
newpath
36554.3 28747.5 moveto
36516.8 28822.5 lineto
stroke
newpath
36516.8 28822.5 moveto
36479.3 28972.5 lineto
stroke
newpath
36479.3 28972.5 moveto
36479.3 29159.9 lineto
stroke
newpath
36479.3 29159.9 moveto
36516.8 29309.9 lineto
stroke
newpath
36516.8 29309.9 moveto
36554.3 29384.9 lineto
stroke
newpath
36554.3 29384.9 moveto
36591.8 29422.4 lineto
stroke
newpath
36591.8 29422.4 moveto
36666.8 29459.9 lineto
stroke
newpath
37739.2 28672.5 moveto
37739.2 29459.9 lineto
stroke
newpath
38076.6 28672.5 moveto
38076.6 29084.9 lineto
stroke
newpath
38076.6 29084.9 moveto
38039.1 29159.9 lineto
stroke
newpath
38039.1 29159.9 moveto
37964.2 29197.4 lineto
stroke
newpath
37964.2 29197.4 moveto
37851.7 29197.4 lineto
stroke
newpath
37851.7 29197.4 moveto
37776.7 29159.9 lineto
stroke
newpath
37776.7 29159.9 moveto
37739.2 29122.4 lineto
stroke
newpath
38564.1 28672.5 moveto
38489.1 28710 lineto
stroke
newpath
38489.1 28710 moveto
38451.6 28747.5 lineto
stroke
newpath
38451.6 28747.5 moveto
38414.1 28822.5 lineto
stroke
newpath
38414.1 28822.5 moveto
38414.1 29047.4 lineto
stroke
newpath
38414.1 29047.4 moveto
38451.6 29122.4 lineto
stroke
newpath
38451.6 29122.4 moveto
38489.1 29159.9 lineto
stroke
newpath
38489.1 29159.9 moveto
38564.1 29197.4 lineto
stroke
newpath
38564.1 29197.4 moveto
38676.6 29197.4 lineto
stroke
newpath
38676.6 29197.4 moveto
38751.6 29159.9 lineto
stroke
newpath
38751.6 29159.9 moveto
38789 29122.4 lineto
stroke
newpath
38789 29122.4 moveto
38826.5 29047.4 lineto
stroke
newpath
38826.5 29047.4 moveto
38826.5 28822.5 lineto
stroke
newpath
38826.5 28822.5 moveto
38789 28747.5 lineto
stroke
newpath
38789 28747.5 moveto
38751.6 28710 lineto
stroke
newpath
38751.6 28710 moveto
38676.6 28672.5 lineto
stroke
newpath
38676.6 28672.5 moveto
38564.1 28672.5 lineto
stroke
newpath
39276.5 28672.5 moveto
39201.5 28710 lineto
stroke
newpath
39201.5 28710 moveto
39164 28785 lineto
stroke
newpath
39164 28785 moveto
39164 29459.9 lineto
stroke
newpath
39876.4 28710 moveto
39801.4 28672.5 lineto
stroke
newpath
39801.4 28672.5 moveto
39651.4 28672.5 lineto
stroke
newpath
39651.4 28672.5 moveto
39576.5 28710 lineto
stroke
newpath
39576.5 28710 moveto
39539 28785 lineto
stroke
newpath
39539 28785 moveto
39539 29084.9 lineto
stroke
newpath
39539 29084.9 moveto
39576.5 29159.9 lineto
stroke
newpath
39576.5 29159.9 moveto
39651.4 29197.4 lineto
stroke
newpath
39651.4 29197.4 moveto
39801.4 29197.4 lineto
stroke
newpath
39801.4 29197.4 moveto
39876.4 29159.9 lineto
stroke
newpath
39876.4 29159.9 moveto
39913.9 29084.9 lineto
stroke
newpath
39913.9 29084.9 moveto
39913.9 29009.9 lineto
stroke
newpath
39913.9 29009.9 moveto
39539 28935 lineto
stroke
newpath
40213.9 28710 moveto
40288.9 28672.5 lineto
stroke
newpath
40288.9 28672.5 moveto
40438.8 28672.5 lineto
stroke
newpath
40438.8 28672.5 moveto
40513.8 28710 lineto
stroke
newpath
40513.8 28710 moveto
40551.3 28785 lineto
stroke
newpath
40551.3 28785 moveto
40551.3 28822.5 lineto
stroke
newpath
40551.3 28822.5 moveto
40513.8 28897.5 lineto
stroke
newpath
40513.8 28897.5 moveto
40438.8 28935 lineto
stroke
newpath
40438.8 28935 moveto
40326.4 28935 lineto
stroke
newpath
40326.4 28935 moveto
40251.4 28972.5 lineto
stroke
newpath
40251.4 28972.5 moveto
40213.9 29047.4 lineto
stroke
newpath
40213.9 29047.4 moveto
40213.9 29084.9 lineto
stroke
newpath
40213.9 29084.9 moveto
40251.4 29159.9 lineto
stroke
newpath
40251.4 29159.9 moveto
40326.4 29197.4 lineto
stroke
newpath
40326.4 29197.4 moveto
40438.8 29197.4 lineto
stroke
newpath
40438.8 29197.4 moveto
40513.8 29159.9 lineto
stroke
newpath
40813.8 28372.5 moveto
40851.3 28410 lineto
stroke
newpath
40851.3 28410 moveto
40926.3 28522.5 lineto
stroke
newpath
40926.3 28522.5 moveto
40963.8 28597.5 lineto
stroke
newpath
40963.8 28597.5 moveto
41001.3 28710 lineto
stroke
newpath
41001.3 28710 moveto
41038.8 28897.5 lineto
stroke
newpath
41038.8 28897.5 moveto
41038.8 29047.4 lineto
stroke
newpath
41038.8 29047.4 moveto
41001.3 29234.9 lineto
stroke
newpath
41001.3 29234.9 moveto
40963.8 29347.4 lineto
stroke
newpath
40963.8 29347.4 moveto
40926.3 29422.4 lineto
stroke
newpath
40926.3 29422.4 moveto
40851.3 29534.9 lineto
stroke
newpath
40851.3 29534.9 moveto
40813.8 29572.4 lineto
stroke
newpath
42111.1 28372.5 moveto
42073.6 28410 lineto
stroke
newpath
42073.6 28410 moveto
41998.7 28522.5 lineto
stroke
newpath
41998.7 28522.5 moveto
41961.2 28597.5 lineto
stroke
newpath
41961.2 28597.5 moveto
41923.7 28710 lineto
stroke
newpath
41923.7 28710 moveto
41886.2 28897.5 lineto
stroke
newpath
41886.2 28897.5 moveto
41886.2 29047.4 lineto
stroke
newpath
41886.2 29047.4 moveto
41923.7 29234.9 lineto
stroke
newpath
41923.7 29234.9 moveto
41961.2 29347.4 lineto
stroke
newpath
41961.2 29347.4 moveto
41998.7 29422.4 lineto
stroke
newpath
41998.7 29422.4 moveto
42073.6 29534.9 lineto
stroke
newpath
42073.6 29534.9 moveto
42111.1 29572.4 lineto
stroke
newpath
42411.1 29197.4 moveto
42411.1 28672.5 lineto
stroke
newpath
42411.1 29122.4 moveto
42448.6 29159.9 lineto
stroke
newpath
42448.6 29159.9 moveto
42523.6 29197.4 lineto
stroke
newpath
42523.6 29197.4 moveto
42636.1 29197.4 lineto
stroke
newpath
42636.1 29197.4 moveto
42711.1 29159.9 lineto
stroke
newpath
42711.1 29159.9 moveto
42748.6 29084.9 lineto
stroke
newpath
42748.6 29084.9 moveto
42748.6 28672.5 lineto
stroke
newpath
43236 28672.5 moveto
43161 28710 lineto
stroke
newpath
43161 28710 moveto
43123.5 28747.5 lineto
stroke
newpath
43123.5 28747.5 moveto
43086 28822.5 lineto
stroke
newpath
43086 28822.5 moveto
43086 29047.4 lineto
stroke
newpath
43086 29047.4 moveto
43123.5 29122.4 lineto
stroke
newpath
43123.5 29122.4 moveto
43161 29159.9 lineto
stroke
newpath
43161 29159.9 moveto
43236 29197.4 lineto
stroke
newpath
43236 29197.4 moveto
43348.5 29197.4 lineto
stroke
newpath
43348.5 29197.4 moveto
43423.5 29159.9 lineto
stroke
newpath
43423.5 29159.9 moveto
43461 29122.4 lineto
stroke
newpath
43461 29122.4 moveto
43498.5 29047.4 lineto
stroke
newpath
43498.5 29047.4 moveto
43498.5 28822.5 lineto
stroke
newpath
43498.5 28822.5 moveto
43461 28747.5 lineto
stroke
newpath
43461 28747.5 moveto
43423.5 28710 lineto
stroke
newpath
43423.5 28710 moveto
43348.5 28672.5 lineto
stroke
newpath
43348.5 28672.5 moveto
43236 28672.5 lineto
stroke
newpath
43723.4 29197.4 moveto
44023.4 29197.4 lineto
stroke
newpath
43835.9 29459.9 moveto
43835.9 28785 lineto
stroke
newpath
43835.9 28785 moveto
43873.4 28710 lineto
stroke
newpath
43873.4 28710 moveto
43948.4 28672.5 lineto
stroke
newpath
43948.4 28672.5 moveto
44023.4 28672.5 lineto
stroke
newpath
44758.3 29197.4 moveto
44758.3 28410 lineto
stroke
newpath
44758.3 29159.9 moveto
44833.3 29197.4 lineto
stroke
newpath
44833.3 29197.4 moveto
44983.3 29197.4 lineto
stroke
newpath
44983.3 29197.4 moveto
45058.3 29159.9 lineto
stroke
newpath
45058.3 29159.9 moveto
45095.8 29122.4 lineto
stroke
newpath
45095.8 29122.4 moveto
45133.3 29047.4 lineto
stroke
newpath
45133.3 29047.4 moveto
45133.3 28822.5 lineto
stroke
newpath
45133.3 28822.5 moveto
45095.8 28747.5 lineto
stroke
newpath
45095.8 28747.5 moveto
45058.3 28710 lineto
stroke
newpath
45058.3 28710 moveto
44983.3 28672.5 lineto
stroke
newpath
44983.3 28672.5 moveto
44833.3 28672.5 lineto
stroke
newpath
44833.3 28672.5 moveto
44758.3 28710 lineto
stroke
newpath
45583.2 28672.5 moveto
45508.2 28710 lineto
stroke
newpath
45508.2 28710 moveto
45470.7 28785 lineto
stroke
newpath
45470.7 28785 moveto
45470.7 29459.9 lineto
stroke
newpath
46220.6 28672.5 moveto
46220.6 29084.9 lineto
stroke
newpath
46220.6 29084.9 moveto
46183.1 29159.9 lineto
stroke
newpath
46183.1 29159.9 moveto
46108.1 29197.4 lineto
stroke
newpath
46108.1 29197.4 moveto
45958.2 29197.4 lineto
stroke
newpath
45958.2 29197.4 moveto
45883.2 29159.9 lineto
stroke
newpath
46220.6 28710 moveto
46145.6 28672.5 lineto
stroke
newpath
46145.6 28672.5 moveto
45958.2 28672.5 lineto
stroke
newpath
45958.2 28672.5 moveto
45883.2 28710 lineto
stroke
newpath
45883.2 28710 moveto
45845.7 28785 lineto
stroke
newpath
45845.7 28785 moveto
45845.7 28860 lineto
stroke
newpath
45845.7 28860 moveto
45883.2 28935 lineto
stroke
newpath
45883.2 28935 moveto
45958.2 28972.5 lineto
stroke
newpath
45958.2 28972.5 moveto
46145.6 28972.5 lineto
stroke
newpath
46145.6 28972.5 moveto
46220.6 29009.9 lineto
stroke
newpath
46483.1 29197.4 moveto
46783.1 29197.4 lineto
stroke
newpath
46595.6 29459.9 moveto
46595.6 28785 lineto
stroke
newpath
46595.6 28785 moveto
46633.1 28710 lineto
stroke
newpath
46633.1 28710 moveto
46708.1 28672.5 lineto
stroke
newpath
46708.1 28672.5 moveto
46783.1 28672.5 lineto
stroke
newpath
47345.5 28710 moveto
47270.5 28672.5 lineto
stroke
newpath
47270.5 28672.5 moveto
47120.5 28672.5 lineto
stroke
newpath
47120.5 28672.5 moveto
47045.5 28710 lineto
stroke
newpath
47045.5 28710 moveto
47008 28785 lineto
stroke
newpath
47008 28785 moveto
47008 29084.9 lineto
stroke
newpath
47008 29084.9 moveto
47045.5 29159.9 lineto
stroke
newpath
47045.5 29159.9 moveto
47120.5 29197.4 lineto
stroke
newpath
47120.5 29197.4 moveto
47270.5 29197.4 lineto
stroke
newpath
47270.5 29197.4 moveto
47345.5 29159.9 lineto
stroke
newpath
47345.5 29159.9 moveto
47383 29084.9 lineto
stroke
newpath
47383 29084.9 moveto
47383 29009.9 lineto
stroke
newpath
47383 29009.9 moveto
47008 28935 lineto
stroke
newpath
48057.9 28672.5 moveto
48057.9 29459.9 lineto
stroke
newpath
48057.9 28710 moveto
47982.9 28672.5 lineto
stroke
newpath
47982.9 28672.5 moveto
47832.9 28672.5 lineto
stroke
newpath
47832.9 28672.5 moveto
47757.9 28710 lineto
stroke
newpath
47757.9 28710 moveto
47720.4 28747.5 lineto
stroke
newpath
47720.4 28747.5 moveto
47682.9 28822.5 lineto
stroke
newpath
47682.9 28822.5 moveto
47682.9 29047.4 lineto
stroke
newpath
47682.9 29047.4 moveto
47720.4 29122.4 lineto
stroke
newpath
47720.4 29122.4 moveto
47757.9 29159.9 lineto
stroke
newpath
47757.9 29159.9 moveto
47832.9 29197.4 lineto
stroke
newpath
47832.9 29197.4 moveto
47982.9 29197.4 lineto
stroke
newpath
47982.9 29197.4 moveto
48057.9 29159.9 lineto
stroke
newpath
48357.9 28372.5 moveto
48395.4 28410 lineto
stroke
newpath
48395.4 28410 moveto
48470.3 28522.5 lineto
stroke
newpath
48470.3 28522.5 moveto
48507.8 28597.5 lineto
stroke
newpath
48507.8 28597.5 moveto
48545.3 28710 lineto
stroke
newpath
48545.3 28710 moveto
48582.8 28897.5 lineto
stroke
newpath
48582.8 28897.5 moveto
48582.8 29047.4 lineto
stroke
newpath
48582.8 29047.4 moveto
48545.3 29234.9 lineto
stroke
newpath
48545.3 29234.9 moveto
48507.8 29347.4 lineto
stroke
newpath
48507.8 29347.4 moveto
48470.3 29422.4 lineto
stroke
newpath
48470.3 29422.4 moveto
48395.4 29534.9 lineto
stroke
newpath
48395.4 29534.9 moveto
48357.9 29572.4 lineto
stroke
showpage
grestore
%%EOF
