
(kicad_symbol_lib (version 20211014) (generator kicad_symbol_editor)
  (symbol "DPS310" (pin_names (offset 1.016)) (in_bom yes) (on_board yes)
    (property "Reference" "U" (id 0) (at -10.16 13.462 0)
      (effects (font (size 1.27 1.27)) (justify bottom left))
    )
    (property "Value" "DPS310" (id 1) (at -10.16 -17.78 0)
      (effects (font (size 1.27 1.27)) (justify bottom left))
    )
    (property "Footprint" "DPS310:XDCR_DPS310" (id 2) (at 0 0 0)
      (effects (font (size 1.27 1.27)) (justify bottom) hide)
    )
    (property "MF" "Infineon Technologies" (id 4) (at 0 0 0)
      (effects (font (size 1.27 1.27)) (justify bottom) hide)
    )
    (property "DESCRIPTION" "The DPS310 is a miniaturized Digital Barometric Air Pressure Sensor with a high accuracy and a low current consumption, capable of measuring both pressure and temperature." (id 5) (at 0 0 0)
      (effects (font (size 1.27 1.27)) (justify bottom) hide)
    )
    (property "PACKAGE" "VFLGA-8 Infineon Technologies" (id 6) (at 0 0 0)
      (effects (font (size 1.27 1.27)) (justify bottom) hide)
    )
    (property "PRICE" "None" (id 7) (at 0 0 0)
      (effects (font (size 1.27 1.27)) (justify bottom) hide)
    )
    (property "Package" "VFLGA-8 Infineon Technologies" (id 8) (at 0 0 0)
      (effects (font (size 1.27 1.27)) (justify bottom) hide)
    )
    (property "Check_prices" "https://www.snapeda.com/parts/DPS310/Infineon+Technologies/view-part/?ref=eda" (id 9) (at 0 0 0)
      (effects (font (size 1.27 1.27)) (justify bottom) hide)
    )
    (property "Price" "None" (id 10) (at 0 0 0)
      (effects (font (size 1.27 1.27)) (justify bottom) hide)
    )
    (property "SnapEDA_Link" "https://www.snapeda.com/parts/DPS310/Infineon+Technologies/view-part/?ref=snap" (id 11) (at 0 0 0)
      (effects (font (size 1.27 1.27)) (justify bottom) hide)
    )
    (property "MP" "DPS310" (id 12) (at 0 0 0)
      (effects (font (size 1.27 1.27)) (justify bottom) hide)
    )
    (property "Availability" "In Stock" (id 13) (at 0 0 0)
      (effects (font (size 1.27 1.27)) (justify bottom) hide)
    )
    (property "AVAILABILITY" "Unavailable" (id 14) (at 0 0 0)
      (effects (font (size 1.27 1.27)) (justify bottom) hide)
    )
    (property "Description" "\nPressure Sensor 4.35PSI ~ 17.4PSI (30kPa ~ 120kPa) Vented Gauge - 24 b 8-VFLGA\n" (id 15) (at 0 0 0)
      (effects (font (size 1.27 1.27)) (justify bottom) hide)
    )
    (symbol "DPS310_0_0"
      (rectangle (start -10.16 -15.24) (end 10.16 12.7)
        (stroke (width 0.254)) (fill (type background))
      )
      (pin power_in line (at 15.24 7.62 180.0) (length 5.08)
        (name "VDD"
          (effects (font (size 1.016 1.016)))
        )
        (number "8"
          (effects (font (size 1.016 1.016)))
        )
      )
      (pin power_in line (at 15.24 -10.16 180.0) (length 5.08)
        (name "GND"
          (effects (font (size 1.016 1.016)))
        )
        (number "1"
          (effects (font (size 1.016 1.016)))
        )
      )
      (pin input line (at -15.24 2.54 0) (length 5.08)
        (name "~{CSB}"
          (effects (font (size 1.016 1.016)))
        )
        (number "2"
          (effects (font (size 1.016 1.016)))
        )
      )
      (pin bidirectional line (at -15.24 -2.54 0) (length 5.08)
        (name "SDI"
          (effects (font (size 1.016 1.016)))
        )
        (number "3"
          (effects (font (size 1.016 1.016)))
        )
      )
      (pin input clock (at -15.24 0.0 0) (length 5.08)
        (name "SCK"
          (effects (font (size 1.016 1.016)))
        )
        (number "4"
          (effects (font (size 1.016 1.016)))
        )
      )
      (pin output line (at -15.24 -5.08 0) (length 5.08)
        (name "SDO"
          (effects (font (size 1.016 1.016)))
        )
        (number "5"
          (effects (font (size 1.016 1.016)))
        )
      )
      (pin power_in line (at 15.24 10.16 180.0) (length 5.08)
        (name "VDDIO"
          (effects (font (size 1.016 1.016)))
        )
        (number "6"
          (effects (font (size 1.016 1.016)))
        )
      )
      (pin power_in line (at 15.24 -12.7 180.0) (length 5.08)
        (name "GND__1"
          (effects (font (size 1.016 1.016)))
        )
        (number "7"
          (effects (font (size 1.016 1.016)))
        )
      )
    )
  )
)