
(footprint XDCR_DPS310 (layer F.Cu) (tedit 655E086A)
  (descr "")
  (attr smd)
  (fp_text reference REF** (at 0.032 -2.4064 0) (layer F.SilkS)
    (effects (font (size 0.64 0.64) (thickness 0.15)))
  )
  (fp_text value XDCR_DPS310 (at 2.4704 2.3936 0) (layer F.Fab)
    (effects (font (size 0.64 0.64) (thickness 0.15)))
  )
  (pad 8 smd rect (at -0.975 0.725) (size 0.35 0.35) (layers F.Cu F.Mask) (solder_mask_margin 0.102))
  (pad 7 smd rect (at -0.325 0.725) (size 0.35 0.35) (layers F.Cu F.Mask) (solder_mask_margin 0.102))
  (pad 6 smd rect (at 0.325 0.725) (size 0.35 0.35) (layers F.Cu F.Mask) (solder_mask_margin 0.102))
  (pad 5 smd rect (at 0.975 0.725) (size 0.35 0.35) (layers F.Cu F.Mask) (solder_mask_margin 0.102))
  (pad 1 smd rect (at -0.975 -0.725) (size 0.35 0.35) (layers F.Cu F.Mask) (solder_mask_margin 0.102))
  (pad 2 smd rect (at -0.325 -0.725) (size 0.35 0.35) (layers F.Cu F.Mask) (solder_mask_margin 0.102))
  (pad 3 smd rect (at 0.325 -0.725) (size 0.35 0.35) (layers F.Cu F.Mask) (solder_mask_margin 0.102))
  (pad 4 smd rect (at 0.975 -0.725) (size 0.35 0.35) (layers F.Cu F.Mask) (solder_mask_margin 0.102))
  (fp_line (start -1.3 1.05) (end -1.3 -1.05) (layer F.Fab) (width 0.127))
  (fp_line (start -1.3 -1.05) (end 1.3 -1.05) (layer F.Fab) (width 0.127))
  (fp_line (start 1.3 -1.05) (end 1.3 1.05) (layer F.Fab) (width 0.127))
  (fp_line (start 1.3 1.05) (end -1.3 1.05) (layer F.Fab) (width 0.127))
  (fp_line (start -0.885 1.2135) (end -1.4635 1.2135) (layer F.SilkS) (width 0.127))
  (fp_line (start -1.4635 1.2135) (end -1.4635 0.635) (layer F.SilkS) (width 0.127))
  (fp_line (start -1.4635 -0.635) (end -1.4635 -1.2135) (layer F.SilkS) (width 0.127))
  (fp_line (start -0.885 -1.2135) (end -1.4635 -1.2135) (layer F.SilkS) (width 0.127))
  (fp_line (start 1.4635 1.2135) (end 0.885 1.2135) (layer F.SilkS) (width 0.127))
  (fp_line (start 1.4635 1.2135) (end 1.4635 0.635) (layer F.SilkS) (width 0.127))
  (fp_line (start 1.4635 -1.2135) (end 0.885 -1.2135) (layer F.SilkS) (width 0.127))
  (fp_line (start 1.4635 -0.635) (end 1.4635 -1.2135) (layer F.SilkS) (width 0.127))
  (fp_line (start -1.55 1.3) (end -1.55 -1.3) (layer F.CrtYd) (width 0.05))
  (fp_line (start -1.55 -1.3) (end 1.55 -1.3) (layer F.CrtYd) (width 0.05))
  (fp_line (start 1.55 -1.3) (end 1.55 1.3) (layer F.CrtYd) (width 0.05))
  (fp_line (start 1.55 1.3) (end -1.55 1.3) (layer F.CrtYd) (width 0.05))
  (fp_circle (center -2.0 -0.75) (end -1.9 -0.75) (layer F.Fab) (width 0.2))
  (fp_circle (center -2.0 -0.75) (end -1.9 -0.75) (layer F.SilkS) (width 0.2))
  (fp_poly
    (pts
      (xy 0.325 -0.9)
      (xy 0.316 -0.9)
      (xy 0.307 -0.899)
      (xy 0.298 -0.898)
      (xy 0.289 -0.896)
      (xy 0.28 -0.894)
      (xy 0.271 -0.891)
      (xy 0.262 -0.888)
      (xy 0.254 -0.885)
      (xy 0.246 -0.881)
      (xy 0.238 -0.877)
      (xy 0.23 -0.872)
      (xy 0.222 -0.867)
      (xy 0.215 -0.861)
      (xy 0.208 -0.855)
      (xy 0.201 -0.849)
      (xy 0.195 -0.842)
      (xy 0.189 -0.835)
      (xy 0.183 -0.828)
      (xy 0.178 -0.82)
      (xy 0.173 -0.813)
      (xy 0.169 -0.804)
      (xy 0.165 -0.796)
      (xy 0.162 -0.788)
      (xy 0.159 -0.779)
      (xy 0.156 -0.77)
      (xy 0.154 -0.761)
      (xy 0.152 -0.752)
      (xy 0.151 -0.743)
      (xy 0.15 -0.734)
      (xy 0.15 -0.725)
      (xy 0.15 -0.716)
      (xy 0.151 -0.707)
      (xy 0.152 -0.698)
      (xy 0.154 -0.689)
      (xy 0.156 -0.68)
      (xy 0.159 -0.671)
      (xy 0.162 -0.662)
      (xy 0.165 -0.654)
      (xy 0.169 -0.646)
      (xy 0.173 -0.637)
      (xy 0.178 -0.63)
      (xy 0.183 -0.622)
      (xy 0.189 -0.615)
      (xy 0.195 -0.608)
      (xy 0.201 -0.601)
      (xy 0.208 -0.595)
      (xy 0.215 -0.589)
      (xy 0.222 -0.583)
      (xy 0.23 -0.578)
      (xy 0.237 -0.573)
      (xy 0.246 -0.569)
      (xy 0.254 -0.565)
      (xy 0.262 -0.562)
      (xy 0.271 -0.559)
      (xy 0.28 -0.556)
      (xy 0.289 -0.554)
      (xy 0.298 -0.552)
      (xy 0.307 -0.551)
      (xy 0.316 -0.55)
      (xy 0.325 -0.55)
      (xy 0.334 -0.55)
      (xy 0.343 -0.551)
      (xy 0.352 -0.552)
      (xy 0.361 -0.554)
      (xy 0.37 -0.556)
      (xy 0.379 -0.559)
      (xy 0.388 -0.562)
      (xy 0.396 -0.565)
      (xy 0.404 -0.569)
      (xy 0.412 -0.573)
      (xy 0.42 -0.578)
      (xy 0.428 -0.583)
      (xy 0.435 -0.589)
      (xy 0.442 -0.595)
      (xy 0.449 -0.601)
      (xy 0.455 -0.608)
      (xy 0.461 -0.615)
      (xy 0.467 -0.622)
      (xy 0.472 -0.63)
      (xy 0.477 -0.637)
      (xy 0.481 -0.646)
      (xy 0.485 -0.654)
      (xy 0.488 -0.662)
      (xy 0.491 -0.671)
      (xy 0.494 -0.68)
      (xy 0.496 -0.689)
      (xy 0.498 -0.698)
      (xy 0.499 -0.707)
      (xy 0.5 -0.716)
      (xy 0.5 -0.725)
      (xy 0.5 -0.734)
      (xy 0.499 -0.743)
      (xy 0.498 -0.752)
      (xy 0.496 -0.761)
      (xy 0.494 -0.77)
      (xy 0.491 -0.779)
      (xy 0.488 -0.788)
      (xy 0.485 -0.796)
      (xy 0.481 -0.804)
      (xy 0.477 -0.813)
      (xy 0.472 -0.82)
      (xy 0.467 -0.828)
      (xy 0.461 -0.835)
      (xy 0.455 -0.842)
      (xy 0.449 -0.849)
      (xy 0.442 -0.855)
      (xy 0.435 -0.861)
      (xy 0.428 -0.867)
      (xy 0.42 -0.872)
      (xy 0.412 -0.877)
      (xy 0.404 -0.881)
      (xy 0.396 -0.885)
      (xy 0.388 -0.888)
      (xy 0.379 -0.891)
      (xy 0.37 -0.894)
      (xy 0.361 -0.896)
      (xy 0.352 -0.898)
      (xy 0.343 -0.899)
      (xy 0.334 -0.9)
      (xy 0.325 -0.9)
    ) (layer F.Paste) (width 0.001)
  )
  (fp_poly
    (pts
      (xy 0.975 -0.9)
      (xy 0.966 -0.9)
      (xy 0.957 -0.899)
      (xy 0.948 -0.898)
      (xy 0.939 -0.896)
      (xy 0.93 -0.894)
      (xy 0.921 -0.891)
      (xy 0.912 -0.888)
      (xy 0.904 -0.885)
      (xy 0.896 -0.881)
      (xy 0.887 -0.877)
      (xy 0.88 -0.872)
      (xy 0.872 -0.867)
      (xy 0.865 -0.861)
      (xy 0.858 -0.855)
      (xy 0.851 -0.849)
      (xy 0.845 -0.842)
      (xy 0.839 -0.835)
      (xy 0.833 -0.828)
      (xy 0.828 -0.82)
      (xy 0.823 -0.813)
      (xy 0.819 -0.804)
      (xy 0.815 -0.796)
      (xy 0.812 -0.788)
      (xy 0.809 -0.779)
      (xy 0.806 -0.77)
      (xy 0.804 -0.761)
      (xy 0.802 -0.752)
      (xy 0.801 -0.743)
      (xy 0.8 -0.734)
      (xy 0.8 -0.725)
      (xy 0.8 -0.716)
      (xy 0.801 -0.707)
      (xy 0.802 -0.698)
      (xy 0.804 -0.689)
      (xy 0.806 -0.68)
      (xy 0.809 -0.671)
      (xy 0.812 -0.662)
      (xy 0.815 -0.654)
      (xy 0.819 -0.646)
      (xy 0.823 -0.637)
      (xy 0.828 -0.63)
      (xy 0.833 -0.622)
      (xy 0.839 -0.615)
      (xy 0.845 -0.608)
      (xy 0.851 -0.601)
      (xy 0.858 -0.595)
      (xy 0.865 -0.589)
      (xy 0.872 -0.583)
      (xy 0.88 -0.578)
      (xy 0.887 -0.573)
      (xy 0.896 -0.569)
      (xy 0.904 -0.565)
      (xy 0.912 -0.562)
      (xy 0.921 -0.559)
      (xy 0.93 -0.556)
      (xy 0.939 -0.554)
      (xy 0.948 -0.552)
      (xy 0.957 -0.551)
      (xy 0.966 -0.55)
      (xy 0.975 -0.55)
      (xy 0.984 -0.55)
      (xy 0.993 -0.551)
      (xy 1.002 -0.552)
      (xy 1.011 -0.554)
      (xy 1.02 -0.556)
      (xy 1.029 -0.559)
      (xy 1.038 -0.562)
      (xy 1.046 -0.565)
      (xy 1.054 -0.569)
      (xy 1.063 -0.573)
      (xy 1.07 -0.578)
      (xy 1.078 -0.583)
      (xy 1.085 -0.589)
      (xy 1.092 -0.595)
      (xy 1.099 -0.601)
      (xy 1.105 -0.608)
      (xy 1.111 -0.615)
      (xy 1.117 -0.622)
      (xy 1.122 -0.63)
      (xy 1.127 -0.637)
      (xy 1.131 -0.646)
      (xy 1.135 -0.654)
      (xy 1.138 -0.662)
      (xy 1.141 -0.671)
      (xy 1.144 -0.68)
      (xy 1.146 -0.689)
      (xy 1.148 -0.698)
      (xy 1.149 -0.707)
      (xy 1.15 -0.716)
      (xy 1.15 -0.725)
      (xy 1.15 -0.734)
      (xy 1.149 -0.743)
      (xy 1.148 -0.752)
      (xy 1.146 -0.761)
      (xy 1.144 -0.77)
      (xy 1.141 -0.779)
      (xy 1.138 -0.788)
      (xy 1.135 -0.796)
      (xy 1.131 -0.804)
      (xy 1.127 -0.813)
      (xy 1.122 -0.82)
      (xy 1.117 -0.828)
      (xy 1.111 -0.835)
      (xy 1.105 -0.842)
      (xy 1.099 -0.849)
      (xy 1.092 -0.855)
      (xy 1.085 -0.861)
      (xy 1.078 -0.867)
      (xy 1.07 -0.872)
      (xy 1.063 -0.877)
      (xy 1.054 -0.881)
      (xy 1.046 -0.885)
      (xy 1.038 -0.888)
      (xy 1.029 -0.891)
      (xy 1.02 -0.894)
      (xy 1.011 -0.896)
      (xy 1.002 -0.898)
      (xy 0.993 -0.899)
      (xy 0.984 -0.9)
      (xy 0.975 -0.9)
    ) (layer F.Paste) (width 0.001)
  )
  (fp_poly
    (pts
      (xy -0.325 -0.9)
      (xy -0.334 -0.9)
      (xy -0.343 -0.899)
      (xy -0.352 -0.898)
      (xy -0.361 -0.896)
      (xy -0.37 -0.894)
      (xy -0.379 -0.891)
      (xy -0.388 -0.888)
      (xy -0.396 -0.885)
      (xy -0.404 -0.881)
      (xy -0.412 -0.877)
      (xy -0.42 -0.872)
      (xy -0.428 -0.867)
      (xy -0.435 -0.861)
      (xy -0.442 -0.855)
      (xy -0.449 -0.849)
      (xy -0.455 -0.842)
      (xy -0.461 -0.835)
      (xy -0.467 -0.828)
      (xy -0.472 -0.82)
      (xy -0.477 -0.813)
      (xy -0.481 -0.804)
      (xy -0.485 -0.796)
      (xy -0.488 -0.788)
      (xy -0.491 -0.779)
      (xy -0.494 -0.77)
      (xy -0.496 -0.761)
      (xy -0.498 -0.752)
      (xy -0.499 -0.743)
      (xy -0.5 -0.734)
      (xy -0.5 -0.725)
      (xy -0.5 -0.716)
      (xy -0.499 -0.707)
      (xy -0.498 -0.698)
      (xy -0.496 -0.689)
      (xy -0.494 -0.68)
      (xy -0.491 -0.671)
      (xy -0.488 -0.662)
      (xy -0.485 -0.654)
      (xy -0.481 -0.646)
      (xy -0.477 -0.637)
      (xy -0.472 -0.63)
      (xy -0.467 -0.622)
      (xy -0.461 -0.615)
      (xy -0.455 -0.608)
      (xy -0.449 -0.601)
      (xy -0.442 -0.595)
      (xy -0.435 -0.589)
      (xy -0.428 -0.583)
      (xy -0.42 -0.578)
      (xy -0.413 -0.573)
      (xy -0.404 -0.569)
      (xy -0.396 -0.565)
      (xy -0.388 -0.562)
      (xy -0.379 -0.559)
      (xy -0.37 -0.556)
      (xy -0.361 -0.554)
      (xy -0.352 -0.552)
      (xy -0.343 -0.551)
      (xy -0.334 -0.55)
      (xy -0.325 -0.55)
      (xy -0.316 -0.55)
      (xy -0.307 -0.551)
      (xy -0.298 -0.552)
      (xy -0.289 -0.554)
      (xy -0.28 -0.556)
      (xy -0.271 -0.559)
      (xy -0.262 -0.562)
      (xy -0.254 -0.565)
      (xy -0.246 -0.569)
      (xy -0.237 -0.573)
      (xy -0.23 -0.578)
      (xy -0.222 -0.583)
      (xy -0.215 -0.589)
      (xy -0.208 -0.595)
      (xy -0.201 -0.601)
      (xy -0.195 -0.608)
      (xy -0.189 -0.615)
      (xy -0.183 -0.622)
      (xy -0.178 -0.63)
      (xy -0.173 -0.637)
      (xy -0.169 -0.646)
      (xy -0.165 -0.654)
      (xy -0.162 -0.662)
      (xy -0.159 -0.671)
      (xy -0.156 -0.68)
      (xy -0.154 -0.689)
      (xy -0.152 -0.698)
      (xy -0.151 -0.707)
      (xy -0.15 -0.716)
      (xy -0.15 -0.725)
      (xy -0.15 -0.734)
      (xy -0.151 -0.743)
      (xy -0.152 -0.752)
      (xy -0.154 -0.761)
      (xy -0.156 -0.77)
      (xy -0.159 -0.779)
      (xy -0.162 -0.788)
      (xy -0.165 -0.796)
      (xy -0.169 -0.804)
      (xy -0.173 -0.813)
      (xy -0.178 -0.82)
      (xy -0.183 -0.828)
      (xy -0.189 -0.835)
      (xy -0.195 -0.842)
      (xy -0.201 -0.849)
      (xy -0.208 -0.855)
      (xy -0.215 -0.861)
      (xy -0.222 -0.867)
      (xy -0.23 -0.872)
      (xy -0.238 -0.877)
      (xy -0.246 -0.881)
      (xy -0.254 -0.885)
      (xy -0.262 -0.888)
      (xy -0.271 -0.891)
      (xy -0.28 -0.894)
      (xy -0.289 -0.896)
      (xy -0.298 -0.898)
      (xy -0.307 -0.899)
      (xy -0.316 -0.9)
      (xy -0.325 -0.9)
    ) (layer F.Paste) (width 0.001)
  )
  (fp_poly
    (pts
      (xy -0.975 -0.9)
      (xy -0.984 -0.9)
      (xy -0.993 -0.899)
      (xy -1.002 -0.898)
      (xy -1.011 -0.896)
      (xy -1.02 -0.894)
      (xy -1.029 -0.891)
      (xy -1.038 -0.888)
      (xy -1.046 -0.885)
      (xy -1.054 -0.881)
      (xy -1.063 -0.877)
      (xy -1.07 -0.872)
      (xy -1.078 -0.867)
      (xy -1.085 -0.861)
      (xy -1.092 -0.855)
      (xy -1.099 -0.849)
      (xy -1.105 -0.842)
      (xy -1.111 -0.835)
      (xy -1.117 -0.828)
      (xy -1.122 -0.82)
      (xy -1.127 -0.813)
      (xy -1.131 -0.804)
      (xy -1.135 -0.796)
      (xy -1.138 -0.788)
      (xy -1.141 -0.779)
      (xy -1.144 -0.77)
      (xy -1.146 -0.761)
      (xy -1.148 -0.752)
      (xy -1.149 -0.743)
      (xy -1.15 -0.734)
      (xy -1.15 -0.725)
      (xy -1.15 -0.716)
      (xy -1.149 -0.707)
      (xy -1.148 -0.698)
      (xy -1.146 -0.689)
      (xy -1.144 -0.68)
      (xy -1.141 -0.671)
      (xy -1.138 -0.662)
      (xy -1.135 -0.654)
      (xy -1.131 -0.646)
      (xy -1.127 -0.637)
      (xy -1.122 -0.63)
      (xy -1.117 -0.622)
      (xy -1.111 -0.615)
      (xy -1.105 -0.608)
      (xy -1.099 -0.601)
      (xy -1.092 -0.595)
      (xy -1.085 -0.589)
      (xy -1.078 -0.583)
      (xy -1.07 -0.578)
      (xy -1.063 -0.573)
      (xy -1.054 -0.569)
      (xy -1.046 -0.565)
      (xy -1.038 -0.562)
      (xy -1.029 -0.559)
      (xy -1.02 -0.556)
      (xy -1.011 -0.554)
      (xy -1.002 -0.552)
      (xy -0.993 -0.551)
      (xy -0.984 -0.55)
      (xy -0.975 -0.55)
      (xy -0.966 -0.55)
      (xy -0.957 -0.551)
      (xy -0.948 -0.552)
      (xy -0.939 -0.554)
      (xy -0.93 -0.556)
      (xy -0.921 -0.559)
      (xy -0.912 -0.562)
      (xy -0.904 -0.565)
      (xy -0.896 -0.569)
      (xy -0.887 -0.573)
      (xy -0.88 -0.578)
      (xy -0.872 -0.583)
      (xy -0.865 -0.589)
      (xy -0.858 -0.595)
      (xy -0.851 -0.601)
      (xy -0.845 -0.608)
      (xy -0.839 -0.615)
      (xy -0.833 -0.622)
      (xy -0.828 -0.63)
      (xy -0.823 -0.637)
      (xy -0.819 -0.646)
      (xy -0.815 -0.654)
      (xy -0.812 -0.662)
      (xy -0.809 -0.671)
      (xy -0.806 -0.68)
      (xy -0.804 -0.689)
      (xy -0.802 -0.698)
      (xy -0.801 -0.707)
      (xy -0.8 -0.716)
      (xy -0.8 -0.725)
      (xy -0.8 -0.734)
      (xy -0.801 -0.743)
      (xy -0.802 -0.752)
      (xy -0.804 -0.761)
      (xy -0.806 -0.77)
      (xy -0.809 -0.779)
      (xy -0.812 -0.788)
      (xy -0.815 -0.796)
      (xy -0.819 -0.804)
      (xy -0.823 -0.813)
      (xy -0.828 -0.82)
      (xy -0.833 -0.828)
      (xy -0.839 -0.835)
      (xy -0.845 -0.842)
      (xy -0.851 -0.849)
      (xy -0.858 -0.855)
      (xy -0.865 -0.861)
      (xy -0.872 -0.867)
      (xy -0.88 -0.872)
      (xy -0.887 -0.877)
      (xy -0.896 -0.881)
      (xy -0.904 -0.885)
      (xy -0.912 -0.888)
      (xy -0.921 -0.891)
      (xy -0.93 -0.894)
      (xy -0.939 -0.896)
      (xy -0.948 -0.898)
      (xy -0.957 -0.899)
      (xy -0.966 -0.9)
      (xy -0.975 -0.9)
    ) (layer F.Paste) (width 0.001)
  )
  (fp_poly
    (pts
      (xy 0.325 0.55)
      (xy 0.316 0.55)
      (xy 0.307 0.551)
      (xy 0.298 0.552)
      (xy 0.289 0.554)
      (xy 0.28 0.556)
      (xy 0.271 0.559)
      (xy 0.262 0.562)
      (xy 0.254 0.565)
      (xy 0.246 0.569)
      (xy 0.237 0.573)
      (xy 0.23 0.578)
      (xy 0.222 0.583)
      (xy 0.215 0.589)
      (xy 0.208 0.595)
      (xy 0.201 0.601)
      (xy 0.195 0.608)
      (xy 0.189 0.615)
      (xy 0.183 0.622)
      (xy 0.178 0.63)
      (xy 0.173 0.637)
      (xy 0.169 0.646)
      (xy 0.165 0.654)
      (xy 0.162 0.662)
      (xy 0.159 0.671)
      (xy 0.156 0.68)
      (xy 0.154 0.689)
      (xy 0.152 0.698)
      (xy 0.151 0.707)
      (xy 0.15 0.716)
      (xy 0.15 0.725)
      (xy 0.15 0.734)
      (xy 0.151 0.743)
      (xy 0.152 0.752)
      (xy 0.154 0.761)
      (xy 0.156 0.77)
      (xy 0.159 0.779)
      (xy 0.162 0.788)
      (xy 0.165 0.796)
      (xy 0.169 0.804)
      (xy 0.173 0.813)
      (xy 0.178 0.82)
      (xy 0.183 0.828)
      (xy 0.189 0.835)
      (xy 0.195 0.842)
      (xy 0.201 0.849)
      (xy 0.208 0.855)
      (xy 0.215 0.861)
      (xy 0.222 0.867)
      (xy 0.23 0.872)
      (xy 0.237 0.877)
      (xy 0.246 0.881)
      (xy 0.254 0.885)
      (xy 0.262 0.888)
      (xy 0.271 0.891)
      (xy 0.28 0.894)
      (xy 0.289 0.896)
      (xy 0.298 0.898)
      (xy 0.307 0.899)
      (xy 0.316 0.9)
      (xy 0.325 0.9)
      (xy 0.334 0.9)
      (xy 0.343 0.899)
      (xy 0.352 0.898)
      (xy 0.361 0.896)
      (xy 0.37 0.894)
      (xy 0.379 0.891)
      (xy 0.388 0.888)
      (xy 0.396 0.885)
      (xy 0.404 0.881)
      (xy 0.412 0.877)
      (xy 0.42 0.872)
      (xy 0.428 0.867)
      (xy 0.435 0.861)
      (xy 0.442 0.855)
      (xy 0.449 0.849)
      (xy 0.455 0.842)
      (xy 0.461 0.835)
      (xy 0.467 0.828)
      (xy 0.472 0.82)
      (xy 0.477 0.813)
      (xy 0.481 0.804)
      (xy 0.485 0.796)
      (xy 0.488 0.788)
      (xy 0.491 0.779)
      (xy 0.494 0.77)
      (xy 0.496 0.761)
      (xy 0.498 0.752)
      (xy 0.499 0.743)
      (xy 0.5 0.734)
      (xy 0.5 0.725)
      (xy 0.5 0.716)
      (xy 0.499 0.707)
      (xy 0.498 0.698)
      (xy 0.496 0.689)
      (xy 0.494 0.68)
      (xy 0.491 0.671)
      (xy 0.488 0.662)
      (xy 0.485 0.654)
      (xy 0.481 0.646)
      (xy 0.477 0.637)
      (xy 0.472 0.63)
      (xy 0.467 0.622)
      (xy 0.461 0.615)
      (xy 0.455 0.608)
      (xy 0.449 0.601)
      (xy 0.442 0.595)
      (xy 0.435 0.589)
      (xy 0.428 0.583)
      (xy 0.42 0.578)
      (xy 0.412 0.573)
      (xy 0.404 0.569)
      (xy 0.396 0.565)
      (xy 0.388 0.562)
      (xy 0.379 0.559)
      (xy 0.37 0.556)
      (xy 0.361 0.554)
      (xy 0.352 0.552)
      (xy 0.343 0.551)
      (xy 0.334 0.55)
      (xy 0.325 0.55)
    ) (layer F.Paste) (width 0.001)
  )
  (fp_poly
    (pts
      (xy 0.975 0.55)
      (xy 0.966 0.55)
      (xy 0.957 0.551)
      (xy 0.948 0.552)
      (xy 0.939 0.554)
      (xy 0.93 0.556)
      (xy 0.921 0.559)
      (xy 0.912 0.562)
      (xy 0.904 0.565)
      (xy 0.896 0.569)
      (xy 0.887 0.573)
      (xy 0.88 0.578)
      (xy 0.872 0.583)
      (xy 0.865 0.589)
      (xy 0.858 0.595)
      (xy 0.851 0.601)
      (xy 0.845 0.608)
      (xy 0.839 0.615)
      (xy 0.833 0.622)
      (xy 0.828 0.63)
      (xy 0.823 0.637)
      (xy 0.819 0.646)
      (xy 0.815 0.654)
      (xy 0.812 0.662)
      (xy 0.809 0.671)
      (xy 0.806 0.68)
      (xy 0.804 0.689)
      (xy 0.802 0.698)
      (xy 0.801 0.707)
      (xy 0.8 0.716)
      (xy 0.8 0.725)
      (xy 0.8 0.734)
      (xy 0.801 0.743)
      (xy 0.802 0.752)
      (xy 0.804 0.761)
      (xy 0.806 0.77)
      (xy 0.809 0.779)
      (xy 0.812 0.788)
      (xy 0.815 0.796)
      (xy 0.819 0.804)
      (xy 0.823 0.813)
      (xy 0.828 0.82)
      (xy 0.833 0.828)
      (xy 0.839 0.835)
      (xy 0.845 0.842)
      (xy 0.851 0.849)
      (xy 0.858 0.855)
      (xy 0.865 0.861)
      (xy 0.872 0.867)
      (xy 0.88 0.872)
      (xy 0.887 0.877)
      (xy 0.896 0.881)
      (xy 0.904 0.885)
      (xy 0.912 0.888)
      (xy 0.921 0.891)
      (xy 0.93 0.894)
      (xy 0.939 0.896)
      (xy 0.948 0.898)
      (xy 0.957 0.899)
      (xy 0.966 0.9)
      (xy 0.975 0.9)
      (xy 0.984 0.9)
      (xy 0.993 0.899)
      (xy 1.002 0.898)
      (xy 1.011 0.896)
      (xy 1.02 0.894)
      (xy 1.029 0.891)
      (xy 1.038 0.888)
      (xy 1.046 0.885)
      (xy 1.054 0.881)
      (xy 1.063 0.877)
      (xy 1.07 0.872)
      (xy 1.078 0.867)
      (xy 1.085 0.861)
      (xy 1.092 0.855)
      (xy 1.099 0.849)
      (xy 1.105 0.842)
      (xy 1.111 0.835)
      (xy 1.117 0.828)
      (xy 1.122 0.82)
      (xy 1.127 0.813)
      (xy 1.131 0.804)
      (xy 1.135 0.796)
      (xy 1.138 0.788)
      (xy 1.141 0.779)
      (xy 1.144 0.77)
      (xy 1.146 0.761)
      (xy 1.148 0.752)
      (xy 1.149 0.743)
      (xy 1.15 0.734)
      (xy 1.15 0.725)
      (xy 1.15 0.716)
      (xy 1.149 0.707)
      (xy 1.148 0.698)
      (xy 1.146 0.689)
      (xy 1.144 0.68)
      (xy 1.141 0.671)
      (xy 1.138 0.662)
      (xy 1.135 0.654)
      (xy 1.131 0.646)
      (xy 1.127 0.637)
      (xy 1.122 0.63)
      (xy 1.117 0.622)
      (xy 1.111 0.615)
      (xy 1.105 0.608)
      (xy 1.099 0.601)
      (xy 1.092 0.595)
      (xy 1.085 0.589)
      (xy 1.078 0.583)
      (xy 1.07 0.578)
      (xy 1.063 0.573)
      (xy 1.054 0.569)
      (xy 1.046 0.565)
      (xy 1.038 0.562)
      (xy 1.029 0.559)
      (xy 1.02 0.556)
      (xy 1.011 0.554)
      (xy 1.002 0.552)
      (xy 0.993 0.551)
      (xy 0.984 0.55)
      (xy 0.975 0.55)
    ) (layer F.Paste) (width 0.001)
  )
  (fp_poly
    (pts
      (xy -0.325 0.55)
      (xy -0.334 0.55)
      (xy -0.343 0.551)
      (xy -0.352 0.552)
      (xy -0.361 0.554)
      (xy -0.37 0.556)
      (xy -0.379 0.559)
      (xy -0.388 0.562)
      (xy -0.396 0.565)
      (xy -0.404 0.569)
      (xy -0.412 0.573)
      (xy -0.42 0.578)
      (xy -0.428 0.583)
      (xy -0.435 0.589)
      (xy -0.442 0.595)
      (xy -0.449 0.601)
      (xy -0.455 0.608)
      (xy -0.461 0.615)
      (xy -0.467 0.622)
      (xy -0.472 0.63)
      (xy -0.477 0.637)
      (xy -0.481 0.646)
      (xy -0.485 0.654)
      (xy -0.488 0.662)
      (xy -0.491 0.671)
      (xy -0.494 0.68)
      (xy -0.496 0.689)
      (xy -0.498 0.698)
      (xy -0.499 0.707)
      (xy -0.5 0.716)
      (xy -0.5 0.725)
      (xy -0.5 0.734)
      (xy -0.499 0.743)
      (xy -0.498 0.752)
      (xy -0.496 0.761)
      (xy -0.494 0.77)
      (xy -0.491 0.779)
      (xy -0.488 0.788)
      (xy -0.485 0.796)
      (xy -0.481 0.804)
      (xy -0.477 0.813)
      (xy -0.472 0.82)
      (xy -0.467 0.828)
      (xy -0.461 0.835)
      (xy -0.455 0.842)
      (xy -0.449 0.849)
      (xy -0.442 0.855)
      (xy -0.435 0.861)
      (xy -0.428 0.867)
      (xy -0.42 0.872)
      (xy -0.413 0.877)
      (xy -0.404 0.881)
      (xy -0.396 0.885)
      (xy -0.388 0.888)
      (xy -0.379 0.891)
      (xy -0.37 0.894)
      (xy -0.361 0.896)
      (xy -0.352 0.898)
      (xy -0.343 0.899)
      (xy -0.334 0.9)
      (xy -0.325 0.9)
      (xy -0.316 0.9)
      (xy -0.307 0.899)
      (xy -0.298 0.898)
      (xy -0.289 0.896)
      (xy -0.28 0.894)
      (xy -0.271 0.891)
      (xy -0.262 0.888)
      (xy -0.254 0.885)
      (xy -0.246 0.881)
      (xy -0.238 0.877)
      (xy -0.23 0.872)
      (xy -0.222 0.867)
      (xy -0.215 0.861)
      (xy -0.208 0.855)
      (xy -0.201 0.849)
      (xy -0.195 0.842)
      (xy -0.189 0.835)
      (xy -0.183 0.828)
      (xy -0.178 0.82)
      (xy -0.173 0.813)
      (xy -0.169 0.804)
      (xy -0.165 0.796)
      (xy -0.162 0.788)
      (xy -0.159 0.779)
      (xy -0.156 0.77)
      (xy -0.154 0.761)
      (xy -0.152 0.752)
      (xy -0.151 0.743)
      (xy -0.15 0.734)
      (xy -0.15 0.725)
      (xy -0.15 0.716)
      (xy -0.151 0.707)
      (xy -0.152 0.698)
      (xy -0.154 0.689)
      (xy -0.156 0.68)
      (xy -0.159 0.671)
      (xy -0.162 0.662)
      (xy -0.165 0.654)
      (xy -0.169 0.646)
      (xy -0.173 0.637)
      (xy -0.178 0.63)
      (xy -0.183 0.622)
      (xy -0.189 0.615)
      (xy -0.195 0.608)
      (xy -0.201 0.601)
      (xy -0.208 0.595)
      (xy -0.215 0.589)
      (xy -0.222 0.583)
      (xy -0.23 0.578)
      (xy -0.237 0.573)
      (xy -0.246 0.569)
      (xy -0.254 0.565)
      (xy -0.262 0.562)
      (xy -0.271 0.559)
      (xy -0.28 0.556)
      (xy -0.289 0.554)
      (xy -0.298 0.552)
      (xy -0.307 0.551)
      (xy -0.316 0.55)
      (xy -0.325 0.55)
    ) (layer F.Paste) (width 0.001)
  )
  (fp_poly
    (pts
      (xy -0.975 0.55)
      (xy -0.984 0.55)
      (xy -0.993 0.551)
      (xy -1.002 0.552)
      (xy -1.011 0.554)
      (xy -1.02 0.556)
      (xy -1.029 0.559)
      (xy -1.038 0.562)
      (xy -1.046 0.565)
      (xy -1.054 0.569)
      (xy -1.063 0.573)
      (xy -1.07 0.578)
      (xy -1.078 0.583)
      (xy -1.085 0.589)
      (xy -1.092 0.595)
      (xy -1.099 0.601)
      (xy -1.105 0.608)
      (xy -1.111 0.615)
      (xy -1.117 0.622)
      (xy -1.122 0.63)
      (xy -1.127 0.637)
      (xy -1.131 0.646)
      (xy -1.135 0.654)
      (xy -1.138 0.662)
      (xy -1.141 0.671)
      (xy -1.144 0.68)
      (xy -1.146 0.689)
      (xy -1.148 0.698)
      (xy -1.149 0.707)
      (xy -1.15 0.716)
      (xy -1.15 0.725)
      (xy -1.15 0.734)
      (xy -1.149 0.743)
      (xy -1.148 0.752)
      (xy -1.146 0.761)
      (xy -1.144 0.77)
      (xy -1.141 0.779)
      (xy -1.138 0.788)
      (xy -1.135 0.796)
      (xy -1.131 0.804)
      (xy -1.127 0.813)
      (xy -1.122 0.82)
      (xy -1.117 0.828)
      (xy -1.111 0.835)
      (xy -1.105 0.842)
      (xy -1.099 0.849)
      (xy -1.092 0.855)
      (xy -1.085 0.861)
      (xy -1.078 0.867)
      (xy -1.07 0.872)
      (xy -1.063 0.877)
      (xy -1.054 0.881)
      (xy -1.046 0.885)
      (xy -1.038 0.888)
      (xy -1.029 0.891)
      (xy -1.02 0.894)
      (xy -1.011 0.896)
      (xy -1.002 0.898)
      (xy -0.993 0.899)
      (xy -0.984 0.9)
      (xy -0.975 0.9)
      (xy -0.966 0.9)
      (xy -0.957 0.899)
      (xy -0.948 0.898)
      (xy -0.939 0.896)
      (xy -0.93 0.894)
      (xy -0.921 0.891)
      (xy -0.912 0.888)
      (xy -0.904 0.885)
      (xy -0.896 0.881)
      (xy -0.887 0.877)
      (xy -0.88 0.872)
      (xy -0.872 0.867)
      (xy -0.865 0.861)
      (xy -0.858 0.855)
      (xy -0.851 0.849)
      (xy -0.845 0.842)
      (xy -0.839 0.835)
      (xy -0.833 0.828)
      (xy -0.828 0.82)
      (xy -0.823 0.813)
      (xy -0.819 0.804)
      (xy -0.815 0.796)
      (xy -0.812 0.788)
      (xy -0.809 0.779)
      (xy -0.806 0.77)
      (xy -0.804 0.761)
      (xy -0.802 0.752)
      (xy -0.801 0.743)
      (xy -0.8 0.734)
      (xy -0.8 0.725)
      (xy -0.8 0.716)
      (xy -0.801 0.707)
      (xy -0.802 0.698)
      (xy -0.804 0.689)
      (xy -0.806 0.68)
      (xy -0.809 0.671)
      (xy -0.812 0.662)
      (xy -0.815 0.654)
      (xy -0.819 0.646)
      (xy -0.823 0.637)
      (xy -0.828 0.63)
      (xy -0.833 0.622)
      (xy -0.839 0.615)
      (xy -0.845 0.608)
      (xy -0.851 0.601)
      (xy -0.858 0.595)
      (xy -0.865 0.589)
      (xy -0.872 0.583)
      (xy -0.88 0.578)
      (xy -0.887 0.573)
      (xy -0.896 0.569)
      (xy -0.904 0.565)
      (xy -0.912 0.562)
      (xy -0.921 0.559)
      (xy -0.93 0.556)
      (xy -0.939 0.554)
      (xy -0.948 0.552)
      (xy -0.957 0.551)
      (xy -0.966 0.55)
      (xy -0.975 0.55)
    ) (layer F.Paste) (width 0.001)
  )
)