(kicad_sch (version 20230121) (generator eeschema)

  (uuid 42f5051d-e67b-4c3a-bcda-a115933f38a6)

  (paper "A4")

  (lib_symbols
    (symbol "CM4IO:ComputeModule4-CM4" (in_bom yes) (on_board yes)
      (property "Reference" "Module" (at 113.03 -68.58 0)
        (effects (font (size 1.27 1.27)))
      )
      (property "Value" "ComputeModule4-CM4" (at 140.97 2.54 0)
        (effects (font (size 1.27 1.27)))
      )
      (property "Footprint" "CM4IO:Raspberry-Pi-4-Compute-Module" (at 142.24 -26.67 0)
        (effects (font (size 1.27 1.27)) hide)
      )
      (property "Datasheet" "" (at 142.24 -26.67 0)
        (effects (font (size 1.27 1.27)) hide)
      )
      (property "Field4" "Hirose" (at 0 0 0)
        (effects (font (size 1.27 1.27)))
      )
      (property "Field5" "2x DF40C-100DS-0.4V" (at 0 -2.54 0)
        (effects (font (size 1.27 1.27)))
      )
      (symbol "ComputeModule4-CM4_1_0"
        (text "GPIO" (at 0 6.35 0)
          (effects (font (size 1.27 1.27)))
        )
      )
      (symbol "ComputeModule4-CM4_1_1"
        (rectangle (start -30.48 -71.12) (end 25.4 58.42)
          (stroke (width 0) (type default))
          (fill (type none))
        )
        (text "600mA Max" (at -8.89 -53.34 0)
          (effects (font (size 1.27 1.27)))
        )
        (text "600mA Max" (at -8.89 -48.26 0)
          (effects (font (size 1.27 1.27)))
        )
        (text "NB SD signals are only available" (at -1.27 -27.94 0)
          (effects (font (size 1.27 1.27)))
        )
        (text "on modules without eMMC" (at -1.27 -30.48 0)
          (effects (font (size 1.27 1.27)))
        )
        (pin power_in line (at 27.94 55.88 180) (length 2.54)
          (name "GND" (effects (font (size 1.27 1.27))))
          (number "1" (effects (font (size 1.27 1.27))))
        )
        (pin passive line (at -33.02 45.72 0) (length 2.54)
          (name "Ethernet_Pair0_N" (effects (font (size 1.27 1.27))))
          (number "10" (effects (font (size 1.27 1.27))))
        )
        (pin output line (at -33.02 -68.58 0) (length 2.54)
          (name "nEXTRST" (effects (font (size 1.27 1.27))))
          (number "100" (effects (font (size 1.27 1.27))))
        )
        (pin passive line (at 27.94 43.18 180) (length 2.54)
          (name "Ethernet_Pair2_P" (effects (font (size 1.27 1.27))))
          (number "11" (effects (font (size 1.27 1.27))))
        )
        (pin passive line (at -33.02 43.18 0) (length 2.54)
          (name "Ethernet_Pair0_P" (effects (font (size 1.27 1.27))))
          (number "12" (effects (font (size 1.27 1.27))))
        )
        (pin power_in line (at 27.94 40.64 180) (length 2.54)
          (name "GND" (effects (font (size 1.27 1.27))))
          (number "13" (effects (font (size 1.27 1.27))))
        )
        (pin power_in line (at -33.02 40.64 0) (length 2.54)
          (name "GND" (effects (font (size 1.27 1.27))))
          (number "14" (effects (font (size 1.27 1.27))))
        )
        (pin output line (at 27.94 38.1 180) (length 2.54)
          (name "Ethernet_nLED3(3.3v)" (effects (font (size 1.27 1.27))))
          (number "15" (effects (font (size 1.27 1.27))))
        )
        (pin input line (at -33.02 38.1 0) (length 2.54)
          (name "Ethernet_SYNC_IN(1.8v)" (effects (font (size 1.27 1.27))))
          (number "16" (effects (font (size 1.27 1.27))))
        )
        (pin output line (at 27.94 35.56 180) (length 2.54)
          (name "Ethernet_nLED2(3.3v)" (effects (font (size 1.27 1.27))))
          (number "17" (effects (font (size 1.27 1.27))))
        )
        (pin input line (at -33.02 35.56 0) (length 2.54)
          (name "Ethernet_SYNC_OUT(1.8v)" (effects (font (size 1.27 1.27))))
          (number "18" (effects (font (size 1.27 1.27))))
        )
        (pin output line (at 27.94 33.02 180) (length 2.54)
          (name "Ethernet_nLED1(3.3v)" (effects (font (size 1.27 1.27))))
          (number "19" (effects (font (size 1.27 1.27))))
        )
        (pin power_in line (at -33.02 55.88 0) (length 2.54)
          (name "GND" (effects (font (size 1.27 1.27))))
          (number "2" (effects (font (size 1.27 1.27))))
        )
        (pin passive line (at -33.02 33.02 0) (length 2.54)
          (name "EEPROM_nWP" (effects (font (size 1.27 1.27))))
          (number "20" (effects (font (size 1.27 1.27))))
        )
        (pin open_collector line (at 27.94 30.48 180) (length 2.54)
          (name "PI_nLED_Activity" (effects (font (size 1.27 1.27))))
          (number "21" (effects (font (size 1.27 1.27))))
        )
        (pin power_in line (at -33.02 30.48 0) (length 2.54)
          (name "GND" (effects (font (size 1.27 1.27))))
          (number "22" (effects (font (size 1.27 1.27))))
        )
        (pin power_in line (at 27.94 27.94 180) (length 2.54)
          (name "GND" (effects (font (size 1.27 1.27))))
          (number "23" (effects (font (size 1.27 1.27))))
        )
        (pin passive line (at -33.02 27.94 0) (length 2.54)
          (name "GPIO26" (effects (font (size 1.27 1.27))))
          (number "24" (effects (font (size 1.27 1.27))))
        )
        (pin passive line (at 27.94 25.4 180) (length 2.54)
          (name "GPIO21" (effects (font (size 1.27 1.27))))
          (number "25" (effects (font (size 1.27 1.27))))
        )
        (pin passive line (at -33.02 25.4 0) (length 2.54)
          (name "GPIO19" (effects (font (size 1.27 1.27))))
          (number "26" (effects (font (size 1.27 1.27))))
        )
        (pin passive line (at 27.94 22.86 180) (length 2.54)
          (name "GPIO20" (effects (font (size 1.27 1.27))))
          (number "27" (effects (font (size 1.27 1.27))))
        )
        (pin passive line (at -33.02 22.86 0) (length 2.54)
          (name "GPIO13" (effects (font (size 1.27 1.27))))
          (number "28" (effects (font (size 1.27 1.27))))
        )
        (pin passive line (at 27.94 20.32 180) (length 2.54)
          (name "GPIO16" (effects (font (size 1.27 1.27))))
          (number "29" (effects (font (size 1.27 1.27))))
        )
        (pin passive line (at 27.94 53.34 180) (length 2.54)
          (name "Ethernet_Pair3_P" (effects (font (size 1.27 1.27))))
          (number "3" (effects (font (size 1.27 1.27))))
        )
        (pin passive line (at -33.02 20.32 0) (length 2.54)
          (name "GPIO6" (effects (font (size 1.27 1.27))))
          (number "30" (effects (font (size 1.27 1.27))))
        )
        (pin passive line (at 27.94 17.78 180) (length 2.54)
          (name "GPIO12" (effects (font (size 1.27 1.27))))
          (number "31" (effects (font (size 1.27 1.27))))
        )
        (pin power_in line (at -33.02 17.78 0) (length 2.54)
          (name "GND" (effects (font (size 1.27 1.27))))
          (number "32" (effects (font (size 1.27 1.27))))
        )
        (pin power_in line (at 27.94 15.24 180) (length 2.54)
          (name "GND" (effects (font (size 1.27 1.27))))
          (number "33" (effects (font (size 1.27 1.27))))
        )
        (pin passive line (at -33.02 15.24 0) (length 2.54)
          (name "GPIO5" (effects (font (size 1.27 1.27))))
          (number "34" (effects (font (size 1.27 1.27))))
        )
        (pin passive line (at 27.94 12.7 180) (length 2.54)
          (name "ID_SC" (effects (font (size 1.27 1.27))))
          (number "35" (effects (font (size 1.27 1.27))))
        )
        (pin passive line (at -33.02 12.7 0) (length 2.54)
          (name "ID_SD" (effects (font (size 1.27 1.27))))
          (number "36" (effects (font (size 1.27 1.27))))
        )
        (pin passive line (at 27.94 10.16 180) (length 2.54)
          (name "GPIO7" (effects (font (size 1.27 1.27))))
          (number "37" (effects (font (size 1.27 1.27))))
        )
        (pin passive line (at -33.02 10.16 0) (length 2.54)
          (name "GPIO11" (effects (font (size 1.27 1.27))))
          (number "38" (effects (font (size 1.27 1.27))))
        )
        (pin passive line (at 27.94 7.62 180) (length 2.54)
          (name "GPIO8" (effects (font (size 1.27 1.27))))
          (number "39" (effects (font (size 1.27 1.27))))
        )
        (pin passive line (at -33.02 53.34 0) (length 2.54)
          (name "Ethernet_Pair1_P" (effects (font (size 1.27 1.27))))
          (number "4" (effects (font (size 1.27 1.27))))
        )
        (pin passive line (at -33.02 7.62 0) (length 2.54)
          (name "GPIO9" (effects (font (size 1.27 1.27))))
          (number "40" (effects (font (size 1.27 1.27))))
        )
        (pin passive line (at 27.94 5.08 180) (length 2.54)
          (name "GPIO25" (effects (font (size 1.27 1.27))))
          (number "41" (effects (font (size 1.27 1.27))))
        )
        (pin power_in line (at -33.02 5.08 0) (length 2.54)
          (name "GND" (effects (font (size 1.27 1.27))))
          (number "42" (effects (font (size 1.27 1.27))))
        )
        (pin power_in line (at 27.94 2.54 180) (length 2.54)
          (name "GND" (effects (font (size 1.27 1.27))))
          (number "43" (effects (font (size 1.27 1.27))))
        )
        (pin passive line (at -33.02 2.54 0) (length 2.54)
          (name "GPIO10" (effects (font (size 1.27 1.27))))
          (number "44" (effects (font (size 1.27 1.27))))
        )
        (pin passive line (at 27.94 0 180) (length 2.54)
          (name "GPIO24" (effects (font (size 1.27 1.27))))
          (number "45" (effects (font (size 1.27 1.27))))
        )
        (pin passive line (at -33.02 0 0) (length 2.54)
          (name "GPIO22" (effects (font (size 1.27 1.27))))
          (number "46" (effects (font (size 1.27 1.27))))
        )
        (pin passive line (at 27.94 -2.54 180) (length 2.54)
          (name "GPIO23" (effects (font (size 1.27 1.27))))
          (number "47" (effects (font (size 1.27 1.27))))
        )
        (pin passive line (at -33.02 -2.54 0) (length 2.54)
          (name "GPIO27" (effects (font (size 1.27 1.27))))
          (number "48" (effects (font (size 1.27 1.27))))
        )
        (pin passive line (at 27.94 -5.08 180) (length 2.54)
          (name "GPIO18" (effects (font (size 1.27 1.27))))
          (number "49" (effects (font (size 1.27 1.27))))
        )
        (pin passive line (at 27.94 50.8 180) (length 2.54)
          (name "Ethernet_Pair3_N" (effects (font (size 1.27 1.27))))
          (number "5" (effects (font (size 1.27 1.27))))
        )
        (pin passive line (at -33.02 -5.08 0) (length 2.54)
          (name "GPIO17" (effects (font (size 1.27 1.27))))
          (number "50" (effects (font (size 1.27 1.27))))
        )
        (pin passive line (at 27.94 -7.62 180) (length 2.54)
          (name "GPIO15" (effects (font (size 1.27 1.27))))
          (number "51" (effects (font (size 1.27 1.27))))
        )
        (pin power_in line (at -33.02 -7.62 0) (length 2.54)
          (name "GND" (effects (font (size 1.27 1.27))))
          (number "52" (effects (font (size 1.27 1.27))))
        )
        (pin power_in line (at 27.94 -10.16 180) (length 2.54)
          (name "GND" (effects (font (size 1.27 1.27))))
          (number "53" (effects (font (size 1.27 1.27))))
        )
        (pin passive line (at -33.02 -10.16 0) (length 2.54)
          (name "GPIO4" (effects (font (size 1.27 1.27))))
          (number "54" (effects (font (size 1.27 1.27))))
        )
        (pin passive line (at 27.94 -12.7 180) (length 2.54)
          (name "GPIO14" (effects (font (size 1.27 1.27))))
          (number "55" (effects (font (size 1.27 1.27))))
        )
        (pin passive line (at -33.02 -12.7 0) (length 2.54)
          (name "GPIO3" (effects (font (size 1.27 1.27))))
          (number "56" (effects (font (size 1.27 1.27))))
        )
        (pin passive line (at 27.94 -15.24 180) (length 2.54)
          (name "SD_CLK" (effects (font (size 1.27 1.27))))
          (number "57" (effects (font (size 1.27 1.27))))
        )
        (pin passive line (at -33.02 -15.24 0) (length 2.54)
          (name "GPIO2" (effects (font (size 1.27 1.27))))
          (number "58" (effects (font (size 1.27 1.27))))
        )
        (pin power_in line (at 27.94 -17.78 180) (length 2.54)
          (name "GND" (effects (font (size 1.27 1.27))))
          (number "59" (effects (font (size 1.27 1.27))))
        )
        (pin passive line (at -33.02 50.8 0) (length 2.54)
          (name "Ethernet_Pair1_N" (effects (font (size 1.27 1.27))))
          (number "6" (effects (font (size 1.27 1.27))))
        )
        (pin power_in line (at -33.02 -17.78 0) (length 2.54)
          (name "GND" (effects (font (size 1.27 1.27))))
          (number "60" (effects (font (size 1.27 1.27))))
        )
        (pin passive line (at 27.94 -20.32 180) (length 2.54)
          (name "SD_DAT3" (effects (font (size 1.27 1.27))))
          (number "61" (effects (font (size 1.27 1.27))))
        )
        (pin passive line (at -33.02 -20.32 0) (length 2.54)
          (name "SD_CMD" (effects (font (size 1.27 1.27))))
          (number "62" (effects (font (size 1.27 1.27))))
        )
        (pin passive line (at 27.94 -22.86 180) (length 2.54)
          (name "SD_DAT0" (effects (font (size 1.27 1.27))))
          (number "63" (effects (font (size 1.27 1.27))))
        )
        (pin passive line (at -33.02 -22.86 0) (length 2.54)
          (name "SD_DAT5" (effects (font (size 1.27 1.27))))
          (number "64" (effects (font (size 1.27 1.27))))
        )
        (pin power_in line (at 27.94 -25.4 180) (length 2.54)
          (name "GND" (effects (font (size 1.27 1.27))))
          (number "65" (effects (font (size 1.27 1.27))))
        )
        (pin power_in line (at -33.02 -25.4 0) (length 2.54)
          (name "GND" (effects (font (size 1.27 1.27))))
          (number "66" (effects (font (size 1.27 1.27))))
        )
        (pin passive line (at 27.94 -27.94 180) (length 2.54)
          (name "SD_DAT1" (effects (font (size 1.27 1.27))))
          (number "67" (effects (font (size 1.27 1.27))))
        )
        (pin passive line (at -33.02 -27.94 0) (length 2.54)
          (name "SD_DAT4" (effects (font (size 1.27 1.27))))
          (number "68" (effects (font (size 1.27 1.27))))
        )
        (pin passive line (at 27.94 -30.48 180) (length 2.54)
          (name "SD_DAT2" (effects (font (size 1.27 1.27))))
          (number "69" (effects (font (size 1.27 1.27))))
        )
        (pin power_in line (at 27.94 48.26 180) (length 2.54)
          (name "GND" (effects (font (size 1.27 1.27))))
          (number "7" (effects (font (size 1.27 1.27))))
        )
        (pin passive line (at -33.02 -30.48 0) (length 2.54)
          (name "SD_DAT7" (effects (font (size 1.27 1.27))))
          (number "70" (effects (font (size 1.27 1.27))))
        )
        (pin power_in line (at 27.94 -33.02 180) (length 2.54)
          (name "GND" (effects (font (size 1.27 1.27))))
          (number "71" (effects (font (size 1.27 1.27))))
        )
        (pin passive line (at -33.02 -33.02 0) (length 2.54)
          (name "SD_DAT6" (effects (font (size 1.27 1.27))))
          (number "72" (effects (font (size 1.27 1.27))))
        )
        (pin input line (at 27.94 -35.56 180) (length 2.54)
          (name "SD_VDD_Override" (effects (font (size 1.27 1.27))))
          (number "73" (effects (font (size 1.27 1.27))))
        )
        (pin power_in line (at -33.02 -35.56 0) (length 2.54)
          (name "GND" (effects (font (size 1.27 1.27))))
          (number "74" (effects (font (size 1.27 1.27))))
        )
        (pin output line (at 27.94 -38.1 180) (length 2.54)
          (name "SD_PWR_ON" (effects (font (size 1.27 1.27))))
          (number "75" (effects (font (size 1.27 1.27))))
        )
        (pin passive line (at -33.02 -38.1 0) (length 2.54)
          (name "Reserved" (effects (font (size 1.27 1.27))))
          (number "76" (effects (font (size 1.27 1.27))))
        )
        (pin power_in line (at 27.94 -40.64 180) (length 2.54)
          (name "+5v_(Input)" (effects (font (size 1.27 1.27))))
          (number "77" (effects (font (size 1.27 1.27))))
        )
        (pin power_in line (at -33.02 -40.64 0) (length 2.54)
          (name "GPIO_VREF(1.8v/3.3v_Input)" (effects (font (size 1.27 1.27))))
          (number "78" (effects (font (size 1.27 1.27))))
        )
        (pin power_in line (at 27.94 -43.18 180) (length 2.54)
          (name "+5v_(Input)" (effects (font (size 1.27 1.27))))
          (number "79" (effects (font (size 1.27 1.27))))
        )
        (pin power_in line (at -33.02 48.26 0) (length 2.54)
          (name "GND" (effects (font (size 1.27 1.27))))
          (number "8" (effects (font (size 1.27 1.27))))
        )
        (pin passive line (at -33.02 -43.18 0) (length 2.54)
          (name "SCL0" (effects (font (size 1.27 1.27))))
          (number "80" (effects (font (size 1.27 1.27))))
        )
        (pin power_in line (at 27.94 -45.72 180) (length 2.54)
          (name "+5v_(Input)" (effects (font (size 1.27 1.27))))
          (number "81" (effects (font (size 1.27 1.27))))
        )
        (pin passive line (at -33.02 -45.72 0) (length 2.54)
          (name "SDA0" (effects (font (size 1.27 1.27))))
          (number "82" (effects (font (size 1.27 1.27))))
        )
        (pin power_in line (at 27.94 -48.26 180) (length 2.54)
          (name "+5v_(Input)" (effects (font (size 1.27 1.27))))
          (number "83" (effects (font (size 1.27 1.27))))
        )
        (pin power_out line (at -33.02 -48.26 0) (length 2.54)
          (name "+3.3v_(Output)" (effects (font (size 1.27 1.27))))
          (number "84" (effects (font (size 1.27 1.27))))
        )
        (pin power_in line (at 27.94 -50.8 180) (length 2.54)
          (name "+5v_(Input)" (effects (font (size 1.27 1.27))))
          (number "85" (effects (font (size 1.27 1.27))))
        )
        (pin power_out line (at -33.02 -50.8 0) (length 2.54)
          (name "+3.3v_(Output)" (effects (font (size 1.27 1.27))))
          (number "86" (effects (font (size 1.27 1.27))))
        )
        (pin power_in line (at 27.94 -53.34 180) (length 2.54)
          (name "+5v_(Input)" (effects (font (size 1.27 1.27))))
          (number "87" (effects (font (size 1.27 1.27))))
        )
        (pin power_out line (at -33.02 -53.34 0) (length 2.54)
          (name "+1.8v_(Output)" (effects (font (size 1.27 1.27))))
          (number "88" (effects (font (size 1.27 1.27))))
        )
        (pin power_in line (at 27.94 -55.88 180) (length 2.54)
          (name "WiFi_nDisable" (effects (font (size 1.27 1.27))))
          (number "89" (effects (font (size 1.27 1.27))))
        )
        (pin passive line (at 27.94 45.72 180) (length 2.54)
          (name "Ethernet_Pair2_N" (effects (font (size 1.27 1.27))))
          (number "9" (effects (font (size 1.27 1.27))))
        )
        (pin power_out line (at -33.02 -55.88 0) (length 2.54)
          (name "+1.8v_(Output)" (effects (font (size 1.27 1.27))))
          (number "90" (effects (font (size 1.27 1.27))))
        )
        (pin power_in line (at 27.94 -58.42 180) (length 2.54)
          (name "BT_nDisable" (effects (font (size 1.27 1.27))))
          (number "91" (effects (font (size 1.27 1.27))))
        )
        (pin passive line (at -33.02 -58.42 0) (length 2.54)
          (name "RUN_PG" (effects (font (size 1.27 1.27))))
          (number "92" (effects (font (size 1.27 1.27))))
        )
        (pin input line (at 27.94 -60.96 180) (length 2.54)
          (name "nRPIBOOT" (effects (font (size 1.27 1.27))))
          (number "93" (effects (font (size 1.27 1.27))))
        )
        (pin passive line (at -33.02 -60.96 0) (length 2.54)
          (name "AnalogIP1" (effects (font (size 1.27 1.27))))
          (number "94" (effects (font (size 1.27 1.27))))
        )
        (pin output line (at 27.94 -63.5 180) (length 2.54)
          (name "nPI_LED_PWR" (effects (font (size 1.27 1.27))))
          (number "95" (effects (font (size 1.27 1.27))))
        )
        (pin passive line (at -33.02 -63.5 0) (length 2.54)
          (name "AnalogIP0" (effects (font (size 1.27 1.27))))
          (number "96" (effects (font (size 1.27 1.27))))
        )
        (pin passive line (at 27.94 -66.04 180) (length 2.54)
          (name "Camera_GPIO" (effects (font (size 1.27 1.27))))
          (number "97" (effects (font (size 1.27 1.27))))
        )
        (pin power_in line (at -33.02 -66.04 0) (length 2.54)
          (name "GND" (effects (font (size 1.27 1.27))))
          (number "98" (effects (font (size 1.27 1.27))))
        )
        (pin input line (at 27.94 -68.58 180) (length 2.54)
          (name "Global_EN" (effects (font (size 1.27 1.27))))
          (number "99" (effects (font (size 1.27 1.27))))
        )
      )
      (symbol "ComputeModule4-CM4_2_1"
        (rectangle (start 114.3 -66.04) (end 165.1 63.5)
          (stroke (width 0) (type default))
          (fill (type none))
        )
        (text "High Speed Serial" (at 140.97 0 0)
          (effects (font (size 1.27 1.27)))
        )
        (pin input line (at 170.18 60.96 180) (length 5.08)
          (name "USB_OTG_ID" (effects (font (size 1.27 1.27))))
          (number "101" (effects (font (size 1.27 1.27))))
        )
        (pin input line (at 109.22 60.96 0) (length 5.08)
          (name "PCIe_CLK_nREQ" (effects (font (size 1.27 1.27))))
          (number "102" (effects (font (size 1.27 1.27))))
        )
        (pin passive line (at 170.18 58.42 180) (length 5.08)
          (name "USB2_N" (effects (font (size 1.27 1.27))))
          (number "103" (effects (font (size 1.27 1.27))))
        )
        (pin passive line (at 109.22 58.42 0) (length 5.08)
          (name "Reserved" (effects (font (size 1.27 1.27))))
          (number "104" (effects (font (size 1.27 1.27))))
        )
        (pin passive line (at 170.18 55.88 180) (length 5.08)
          (name "USB2_P" (effects (font (size 1.27 1.27))))
          (number "105" (effects (font (size 1.27 1.27))))
        )
        (pin passive line (at 109.22 55.88 0) (length 5.08)
          (name "Reserved" (effects (font (size 1.27 1.27))))
          (number "106" (effects (font (size 1.27 1.27))))
        )
        (pin power_in line (at 170.18 53.34 180) (length 5.08)
          (name "GND" (effects (font (size 1.27 1.27))))
          (number "107" (effects (font (size 1.27 1.27))))
        )
        (pin power_in line (at 109.22 53.34 0) (length 5.08)
          (name "GND" (effects (font (size 1.27 1.27))))
          (number "108" (effects (font (size 1.27 1.27))))
        )
        (pin bidirectional line (at 170.18 50.8 180) (length 5.08)
          (name "PCIe_nRST" (effects (font (size 1.27 1.27))))
          (number "109" (effects (font (size 1.27 1.27))))
        )
        (pin output line (at 109.22 50.8 0) (length 5.08)
          (name "PCIe_CLK_P" (effects (font (size 1.27 1.27))))
          (number "110" (effects (font (size 1.27 1.27))))
        )
        (pin passive line (at 170.18 48.26 180) (length 5.08)
          (name "VDAC_COMP" (effects (font (size 1.27 1.27))))
          (number "111" (effects (font (size 1.27 1.27))))
        )
        (pin output line (at 109.22 48.26 0) (length 5.08)
          (name "PCIe_CLK_N" (effects (font (size 1.27 1.27))))
          (number "112" (effects (font (size 1.27 1.27))))
        )
        (pin power_in line (at 170.18 45.72 180) (length 5.08)
          (name "GND" (effects (font (size 1.27 1.27))))
          (number "113" (effects (font (size 1.27 1.27))))
        )
        (pin power_in line (at 109.22 45.72 0) (length 5.08)
          (name "GND" (effects (font (size 1.27 1.27))))
          (number "114" (effects (font (size 1.27 1.27))))
        )
        (pin input line (at 170.18 43.18 180) (length 5.08)
          (name "CAM1_D0_N" (effects (font (size 1.27 1.27))))
          (number "115" (effects (font (size 1.27 1.27))))
        )
        (pin input line (at 109.22 43.18 0) (length 5.08)
          (name "PCIe_RX_P" (effects (font (size 1.27 1.27))))
          (number "116" (effects (font (size 1.27 1.27))))
        )
        (pin input line (at 170.18 40.64 180) (length 5.08)
          (name "CAM1_D0_P" (effects (font (size 1.27 1.27))))
          (number "117" (effects (font (size 1.27 1.27))))
        )
        (pin input line (at 109.22 40.64 0) (length 5.08)
          (name "PCIe_RX_N" (effects (font (size 1.27 1.27))))
          (number "118" (effects (font (size 1.27 1.27))))
        )
        (pin power_in line (at 170.18 38.1 180) (length 5.08)
          (name "GND" (effects (font (size 1.27 1.27))))
          (number "119" (effects (font (size 1.27 1.27))))
        )
        (pin power_in line (at 109.22 38.1 0) (length 5.08)
          (name "GND" (effects (font (size 1.27 1.27))))
          (number "120" (effects (font (size 1.27 1.27))))
        )
        (pin input line (at 170.18 35.56 180) (length 5.08)
          (name "CAM1_D1_N" (effects (font (size 1.27 1.27))))
          (number "121" (effects (font (size 1.27 1.27))))
        )
        (pin output line (at 109.22 35.56 0) (length 5.08)
          (name "PCIe_TX_P" (effects (font (size 1.27 1.27))))
          (number "122" (effects (font (size 1.27 1.27))))
        )
        (pin input line (at 170.18 33.02 180) (length 5.08)
          (name "CAM1_D1_P" (effects (font (size 1.27 1.27))))
          (number "123" (effects (font (size 1.27 1.27))))
        )
        (pin output line (at 109.22 33.02 0) (length 5.08)
          (name "PCIe_TX_N" (effects (font (size 1.27 1.27))))
          (number "124" (effects (font (size 1.27 1.27))))
        )
        (pin power_in line (at 170.18 30.48 180) (length 5.08)
          (name "GND" (effects (font (size 1.27 1.27))))
          (number "125" (effects (font (size 1.27 1.27))))
        )
        (pin power_in line (at 109.22 30.48 0) (length 5.08)
          (name "GND" (effects (font (size 1.27 1.27))))
          (number "126" (effects (font (size 1.27 1.27))))
        )
        (pin input line (at 170.18 27.94 180) (length 5.08)
          (name "CAM1_C_N" (effects (font (size 1.27 1.27))))
          (number "127" (effects (font (size 1.27 1.27))))
        )
        (pin input line (at 109.22 27.94 0) (length 5.08)
          (name "CAM0_D0_N" (effects (font (size 1.27 1.27))))
          (number "128" (effects (font (size 1.27 1.27))))
        )
        (pin input line (at 170.18 25.4 180) (length 5.08)
          (name "CAM1_C_P" (effects (font (size 1.27 1.27))))
          (number "129" (effects (font (size 1.27 1.27))))
        )
        (pin input line (at 109.22 25.4 0) (length 5.08)
          (name "CAM0_D0_P" (effects (font (size 1.27 1.27))))
          (number "130" (effects (font (size 1.27 1.27))))
        )
        (pin power_in line (at 170.18 22.86 180) (length 5.08)
          (name "GND" (effects (font (size 1.27 1.27))))
          (number "131" (effects (font (size 1.27 1.27))))
        )
        (pin power_in line (at 109.22 22.86 0) (length 5.08)
          (name "GND" (effects (font (size 1.27 1.27))))
          (number "132" (effects (font (size 1.27 1.27))))
        )
        (pin input line (at 170.18 20.32 180) (length 5.08)
          (name "CAM1_D2_N" (effects (font (size 1.27 1.27))))
          (number "133" (effects (font (size 1.27 1.27))))
        )
        (pin input line (at 109.22 20.32 0) (length 5.08)
          (name "CAM0_D1_N" (effects (font (size 1.27 1.27))))
          (number "134" (effects (font (size 1.27 1.27))))
        )
        (pin input line (at 170.18 17.78 180) (length 5.08)
          (name "CAM1_D2_P" (effects (font (size 1.27 1.27))))
          (number "135" (effects (font (size 1.27 1.27))))
        )
        (pin input line (at 109.22 17.78 0) (length 5.08)
          (name "CAM0_D1_P" (effects (font (size 1.27 1.27))))
          (number "136" (effects (font (size 1.27 1.27))))
        )
        (pin power_in line (at 170.18 15.24 180) (length 5.08)
          (name "GND" (effects (font (size 1.27 1.27))))
          (number "137" (effects (font (size 1.27 1.27))))
        )
        (pin power_in line (at 109.22 15.24 0) (length 5.08)
          (name "GND" (effects (font (size 1.27 1.27))))
          (number "138" (effects (font (size 1.27 1.27))))
        )
        (pin input line (at 170.18 12.7 180) (length 5.08)
          (name "CAM1_D3_N" (effects (font (size 1.27 1.27))))
          (number "139" (effects (font (size 1.27 1.27))))
        )
        (pin input line (at 109.22 12.7 0) (length 5.08)
          (name "CAM0_C_N" (effects (font (size 1.27 1.27))))
          (number "140" (effects (font (size 1.27 1.27))))
        )
        (pin input line (at 170.18 10.16 180) (length 5.08)
          (name "CAM1_D3_P" (effects (font (size 1.27 1.27))))
          (number "141" (effects (font (size 1.27 1.27))))
        )
        (pin input line (at 109.22 10.16 0) (length 5.08)
          (name "CAM0_C_P" (effects (font (size 1.27 1.27))))
          (number "142" (effects (font (size 1.27 1.27))))
        )
        (pin input line (at 170.18 7.62 180) (length 5.08)
          (name "HDMI1_HOTPLUG" (effects (font (size 1.27 1.27))))
          (number "143" (effects (font (size 1.27 1.27))))
        )
        (pin power_in line (at 109.22 7.62 0) (length 5.08)
          (name "GND" (effects (font (size 1.27 1.27))))
          (number "144" (effects (font (size 1.27 1.27))))
        )
        (pin bidirectional line (at 170.18 5.08 180) (length 5.08)
          (name "HDMI1_SDA" (effects (font (size 1.27 1.27))))
          (number "145" (effects (font (size 1.27 1.27))))
        )
        (pin output line (at 109.22 5.08 0) (length 5.08)
          (name "HDMI1_TX2_P" (effects (font (size 1.27 1.27))))
          (number "146" (effects (font (size 1.27 1.27))))
        )
        (pin open_collector line (at 170.18 2.54 180) (length 5.08)
          (name "HDMI1_SCL" (effects (font (size 1.27 1.27))))
          (number "147" (effects (font (size 1.27 1.27))))
        )
        (pin output line (at 109.22 2.54 0) (length 5.08)
          (name "HDMI1_TX2_N" (effects (font (size 1.27 1.27))))
          (number "148" (effects (font (size 1.27 1.27))))
        )
        (pin open_collector line (at 170.18 0 180) (length 5.08)
          (name "HDMI1_CEC" (effects (font (size 1.27 1.27))))
          (number "149" (effects (font (size 1.27 1.27))))
        )
        (pin power_in line (at 109.22 0 0) (length 5.08)
          (name "GND" (effects (font (size 1.27 1.27))))
          (number "150" (effects (font (size 1.27 1.27))))
        )
        (pin open_collector line (at 170.18 -2.54 180) (length 5.08)
          (name "HDMI0_CEC" (effects (font (size 1.27 1.27))))
          (number "151" (effects (font (size 1.27 1.27))))
        )
        (pin output line (at 109.22 -2.54 0) (length 5.08)
          (name "HDMI1_TX1_P" (effects (font (size 1.27 1.27))))
          (number "152" (effects (font (size 1.27 1.27))))
        )
        (pin input line (at 170.18 -5.08 180) (length 5.08)
          (name "HDMI0_HOTPLUG" (effects (font (size 1.27 1.27))))
          (number "153" (effects (font (size 1.27 1.27))))
        )
        (pin output line (at 109.22 -5.08 0) (length 5.08)
          (name "HDMI1_TX1_N" (effects (font (size 1.27 1.27))))
          (number "154" (effects (font (size 1.27 1.27))))
        )
        (pin power_in line (at 170.18 -7.62 180) (length 5.08)
          (name "GND" (effects (font (size 1.27 1.27))))
          (number "155" (effects (font (size 1.27 1.27))))
        )
        (pin power_in line (at 109.22 -7.62 0) (length 5.08)
          (name "GND" (effects (font (size 1.27 1.27))))
          (number "156" (effects (font (size 1.27 1.27))))
        )
        (pin output line (at 170.18 -10.16 180) (length 5.08)
          (name "DSI0_D0_N" (effects (font (size 1.27 1.27))))
          (number "157" (effects (font (size 1.27 1.27))))
        )
        (pin output line (at 109.22 -10.16 0) (length 5.08)
          (name "HDMI1_TX0_P" (effects (font (size 1.27 1.27))))
          (number "158" (effects (font (size 1.27 1.27))))
        )
        (pin output line (at 170.18 -12.7 180) (length 5.08)
          (name "DSI0_D0_P" (effects (font (size 1.27 1.27))))
          (number "159" (effects (font (size 1.27 1.27))))
        )
        (pin output line (at 109.22 -12.7 0) (length 5.08)
          (name "HDMI1_TX0_N" (effects (font (size 1.27 1.27))))
          (number "160" (effects (font (size 1.27 1.27))))
        )
        (pin power_in line (at 170.18 -15.24 180) (length 5.08)
          (name "GND" (effects (font (size 1.27 1.27))))
          (number "161" (effects (font (size 1.27 1.27))))
        )
        (pin power_in line (at 109.22 -15.24 0) (length 5.08)
          (name "GND" (effects (font (size 1.27 1.27))))
          (number "162" (effects (font (size 1.27 1.27))))
        )
        (pin output line (at 170.18 -17.78 180) (length 5.08)
          (name "DSI0_D1_N" (effects (font (size 1.27 1.27))))
          (number "163" (effects (font (size 1.27 1.27))))
        )
        (pin output line (at 109.22 -17.78 0) (length 5.08)
          (name "HDMI1_CLK_P" (effects (font (size 1.27 1.27))))
          (number "164" (effects (font (size 1.27 1.27))))
        )
        (pin output line (at 170.18 -20.32 180) (length 5.08)
          (name "DSI0_D1_P" (effects (font (size 1.27 1.27))))
          (number "165" (effects (font (size 1.27 1.27))))
        )
        (pin output line (at 109.22 -20.32 0) (length 5.08)
          (name "HDMI1_CLK_N" (effects (font (size 1.27 1.27))))
          (number "166" (effects (font (size 1.27 1.27))))
        )
        (pin power_in line (at 170.18 -22.86 180) (length 5.08)
          (name "GND" (effects (font (size 1.27 1.27))))
          (number "167" (effects (font (size 1.27 1.27))))
        )
        (pin power_in line (at 109.22 -22.86 0) (length 5.08)
          (name "GND" (effects (font (size 1.27 1.27))))
          (number "168" (effects (font (size 1.27 1.27))))
        )
        (pin output line (at 170.18 -25.4 180) (length 5.08)
          (name "DSI0_C_N" (effects (font (size 1.27 1.27))))
          (number "169" (effects (font (size 1.27 1.27))))
        )
        (pin output line (at 109.22 -25.4 0) (length 5.08)
          (name "HDMI0_TX2_P" (effects (font (size 1.27 1.27))))
          (number "170" (effects (font (size 1.27 1.27))))
        )
        (pin output line (at 170.18 -27.94 180) (length 5.08)
          (name "DSI0_C_P" (effects (font (size 1.27 1.27))))
          (number "171" (effects (font (size 1.27 1.27))))
        )
        (pin output line (at 109.22 -27.94 0) (length 5.08)
          (name "HDMI0_TX2_N" (effects (font (size 1.27 1.27))))
          (number "172" (effects (font (size 1.27 1.27))))
        )
        (pin power_in line (at 170.18 -30.48 180) (length 5.08)
          (name "GND" (effects (font (size 1.27 1.27))))
          (number "173" (effects (font (size 1.27 1.27))))
        )
        (pin power_in line (at 109.22 -30.48 0) (length 5.08)
          (name "GND" (effects (font (size 1.27 1.27))))
          (number "174" (effects (font (size 1.27 1.27))))
        )
        (pin output line (at 170.18 -33.02 180) (length 5.08)
          (name "DSI1_D0_N" (effects (font (size 1.27 1.27))))
          (number "175" (effects (font (size 1.27 1.27))))
        )
        (pin output line (at 109.22 -33.02 0) (length 5.08)
          (name "HDMI0_TX1_P" (effects (font (size 1.27 1.27))))
          (number "176" (effects (font (size 1.27 1.27))))
        )
        (pin output line (at 170.18 -35.56 180) (length 5.08)
          (name "DSI1_D0_P" (effects (font (size 1.27 1.27))))
          (number "177" (effects (font (size 1.27 1.27))))
        )
        (pin output line (at 109.22 -35.56 0) (length 5.08)
          (name "HDMI0_TX1_N" (effects (font (size 1.27 1.27))))
          (number "178" (effects (font (size 1.27 1.27))))
        )
        (pin power_in line (at 170.18 -38.1 180) (length 5.08)
          (name "GND" (effects (font (size 1.27 1.27))))
          (number "179" (effects (font (size 1.27 1.27))))
        )
        (pin power_in line (at 109.22 -38.1 0) (length 5.08)
          (name "GND" (effects (font (size 1.27 1.27))))
          (number "180" (effects (font (size 1.27 1.27))))
        )
        (pin output line (at 170.18 -40.64 180) (length 5.08)
          (name "DSI1_D1_N" (effects (font (size 1.27 1.27))))
          (number "181" (effects (font (size 1.27 1.27))))
        )
        (pin output line (at 109.22 -40.64 0) (length 5.08)
          (name "HDMI0_TX0_P" (effects (font (size 1.27 1.27))))
          (number "182" (effects (font (size 1.27 1.27))))
        )
        (pin output line (at 170.18 -43.18 180) (length 5.08)
          (name "DSI1_D1_P" (effects (font (size 1.27 1.27))))
          (number "183" (effects (font (size 1.27 1.27))))
        )
        (pin output line (at 109.22 -43.18 0) (length 5.08)
          (name "HDMI0_TX0_N" (effects (font (size 1.27 1.27))))
          (number "184" (effects (font (size 1.27 1.27))))
        )
        (pin power_in line (at 170.18 -45.72 180) (length 5.08)
          (name "GND" (effects (font (size 1.27 1.27))))
          (number "185" (effects (font (size 1.27 1.27))))
        )
        (pin power_in line (at 109.22 -45.72 0) (length 5.08)
          (name "GND" (effects (font (size 1.27 1.27))))
          (number "186" (effects (font (size 1.27 1.27))))
        )
        (pin output line (at 170.18 -48.26 180) (length 5.08)
          (name "DSI1_C_N" (effects (font (size 1.27 1.27))))
          (number "187" (effects (font (size 1.27 1.27))))
        )
        (pin output line (at 109.22 -48.26 0) (length 5.08)
          (name "HDMI0_CLK_P" (effects (font (size 1.27 1.27))))
          (number "188" (effects (font (size 1.27 1.27))))
        )
        (pin output line (at 170.18 -50.8 180) (length 5.08)
          (name "DSI1_C_P" (effects (font (size 1.27 1.27))))
          (number "189" (effects (font (size 1.27 1.27))))
        )
        (pin output line (at 109.22 -50.8 0) (length 5.08)
          (name "HDMI0_CLK_N" (effects (font (size 1.27 1.27))))
          (number "190" (effects (font (size 1.27 1.27))))
        )
        (pin power_in line (at 170.18 -53.34 180) (length 5.08)
          (name "GND" (effects (font (size 1.27 1.27))))
          (number "191" (effects (font (size 1.27 1.27))))
        )
        (pin power_in line (at 109.22 -53.34 0) (length 5.08)
          (name "GND" (effects (font (size 1.27 1.27))))
          (number "192" (effects (font (size 1.27 1.27))))
        )
        (pin output line (at 170.18 -55.88 180) (length 5.08)
          (name "DSI1_D2_N" (effects (font (size 1.27 1.27))))
          (number "193" (effects (font (size 1.27 1.27))))
        )
        (pin output line (at 109.22 -55.88 0) (length 5.08)
          (name "DSI1_D3_N" (effects (font (size 1.27 1.27))))
          (number "194" (effects (font (size 1.27 1.27))))
        )
        (pin output line (at 170.18 -58.42 180) (length 5.08)
          (name "DSI1_D2_P" (effects (font (size 1.27 1.27))))
          (number "195" (effects (font (size 1.27 1.27))))
        )
        (pin output line (at 109.22 -58.42 0) (length 5.08)
          (name "DSI1_D3_P" (effects (font (size 1.27 1.27))))
          (number "196" (effects (font (size 1.27 1.27))))
        )
        (pin power_in line (at 170.18 -60.96 180) (length 5.08)
          (name "GND" (effects (font (size 1.27 1.27))))
          (number "197" (effects (font (size 1.27 1.27))))
        )
        (pin power_in line (at 109.22 -60.96 0) (length 5.08)
          (name "GND" (effects (font (size 1.27 1.27))))
          (number "198" (effects (font (size 1.27 1.27))))
        )
        (pin bidirectional line (at 170.18 -63.5 180) (length 5.08)
          (name "HDMI0_SDA" (effects (font (size 1.27 1.27))))
          (number "199" (effects (font (size 1.27 1.27))))
        )
        (pin open_collector line (at 109.22 -63.5 0) (length 5.08)
          (name "HDMI0_SCL" (effects (font (size 1.27 1.27))))
          (number "200" (effects (font (size 1.27 1.27))))
        )
      )
    )
    (symbol "GND_1" (power) (pin_names (offset 0)) (in_bom yes) (on_board yes)
      (property "Reference" "#PWR" (at 0 -6.35 0)
        (effects (font (size 1.27 1.27)) hide)
      )
      (property "Value" "GND_1" (at 0 -3.81 0)
        (effects (font (size 1.27 1.27)))
      )
      (property "Footprint" "" (at 0 0 0)
        (effects (font (size 1.27 1.27)) hide)
      )
      (property "Datasheet" "" (at 0 0 0)
        (effects (font (size 1.27 1.27)) hide)
      )
      (property "ki_keywords" "global power" (at 0 0 0)
        (effects (font (size 1.27 1.27)) hide)
      )
      (property "ki_description" "Power symbol creates a global label with name \"GND\" , ground" (at 0 0 0)
        (effects (font (size 1.27 1.27)) hide)
      )
      (symbol "GND_1_0_1"
        (polyline
          (pts
            (xy 0 0)
            (xy 0 -1.27)
            (xy 1.27 -1.27)
            (xy 0 -2.54)
            (xy -1.27 -1.27)
            (xy 0 -1.27)
          )
          (stroke (width 0) (type default))
          (fill (type none))
        )
      )
      (symbol "GND_1_1_1"
        (pin power_in line (at 0 0 270) (length 0) hide
          (name "GND" (effects (font (size 1.27 1.27))))
          (number "1" (effects (font (size 1.27 1.27))))
        )
      )
    )
  )

  (junction (at 29.21 152.4) (diameter 1.016) (color 0 0 0 0)
    (uuid 0294557a-aea8-42ad-9d61-f53aad66be7c)
  )
  (junction (at 92.71 45.72) (diameter 0) (color 0 0 0 0)
    (uuid 05e2e5ef-838c-410e-91e0-6b0a2e018803)
  )
  (junction (at 29.21 81.28) (diameter 1.016) (color 0 0 0 0)
    (uuid 07f585b1-8165-4382-a097-215c9591b0f1)
  )
  (junction (at 92.71 104.14) (diameter 1.016) (color 0 0 0 0)
    (uuid 0aec713b-058a-40f7-9f38-a3747bf50d8f)
  )
  (junction (at 92.71 96.52) (diameter 1.016) (color 0 0 0 0)
    (uuid 3a0bbce9-637e-4714-ba72-54ce1cafb579)
  )
  (junction (at 29.21 104.14) (diameter 1.016) (color 0 0 0 0)
    (uuid 3a115730-4020-4cf1-9832-29e486b7c61b)
  )
  (junction (at 29.21 111.76) (diameter 1.016) (color 0 0 0 0)
    (uuid 3adffef9-52c4-457a-989f-6f68facccbca)
  )
  (junction (at 91.44 129.54) (diameter 1.016) (color 0 0 0 0)
    (uuid 3ecc994e-6096-422b-91c0-9fe318eaebf0)
  )
  (junction (at 29.21 68.58) (diameter 1.016) (color 0 0 0 0)
    (uuid 4392ef6e-f633-4c48-90f3-3d4b1195cd6d)
  )
  (junction (at 92.71 58.42) (diameter 1.016) (color 0 0 0 0)
    (uuid 52121990-7eaa-41b3-8517-974b0e3207e7)
  )
  (junction (at 92.71 119.38) (diameter 1.016) (color 0 0 0 0)
    (uuid 53b3be27-3911-4c73-877b-54e3567e7996)
  )
  (junction (at 29.21 93.98) (diameter 1.016) (color 0 0 0 0)
    (uuid 567ec125-80d8-4e8c-a356-f6efd1980ff2)
  )
  (junction (at 29.21 38.1) (diameter 1.016) (color 0 0 0 0)
    (uuid 6e39c1be-78ba-4a1a-aa72-853120783379)
  )
  (junction (at 92.71 71.12) (diameter 1.016) (color 0 0 0 0)
    (uuid 730af5d1-e224-4442-820b-dbcdf6f12bbc)
  )
  (junction (at 92.71 83.82) (diameter 1.016) (color 0 0 0 0)
    (uuid 8d67f2b0-4c4f-4474-ab81-d0acdf635d77)
  )
  (junction (at 91.44 132.08) (diameter 1.016) (color 0 0 0 0)
    (uuid 9b45f486-8584-474d-a82d-4f90d26b13b4)
  )
  (junction (at 92.71 38.1) (diameter 1.016) (color 0 0 0 0)
    (uuid b52d6d4e-c96f-4894-a2ea-a6f8c298fa94)
  )
  (junction (at 92.71 111.76) (diameter 1.016) (color 0 0 0 0)
    (uuid b56d4102-68d9-4b2c-bcda-5d84dbc3d210)
  )
  (junction (at 29.21 55.88) (diameter 1.016) (color 0 0 0 0)
    (uuid c21bab11-5d61-41f4-be31-4afa22f7f48a)
  )
  (junction (at 29.21 121.92) (diameter 1.016) (color 0 0 0 0)
    (uuid cfa81ce0-c4ce-49f6-b1f1-12ea876afea3)
  )
  (junction (at 91.44 134.62) (diameter 1.016) (color 0 0 0 0)
    (uuid e05715df-027d-42e6-8f39-132283844e37)
  )
  (junction (at 91.44 137.16) (diameter 1.016) (color 0 0 0 0)
    (uuid e74ddd2e-c758-470c-95ff-e0b46fcb6512)
  )
  (junction (at 91.44 127) (diameter 0) (color 0 0 0 0)
    (uuid ed074b2c-26aa-4b6f-9fb1-76f32ef81d26)
  )
  (junction (at 29.21 45.72) (diameter 1.016) (color 0 0 0 0)
    (uuid f2e8c2ca-2457-48be-842c-410f37373096)
  )

  (no_connect (at 30.48 88.9) (uuid 09d56fdb-2c19-454e-9541-bc40585faa76))
  (no_connect (at 30.48 78.74) (uuid 191033f3-bb3f-4195-8bda-30bdb4559eec))
  (no_connect (at 30.48 66.04) (uuid 1cdb00e4-e377-4108-baf6-a1295892594d))
  (no_connect (at 91.44 124.46) (uuid 1d05154c-1fc5-4b64-a8aa-f88ddfdebe7a))
  (no_connect (at 30.48 134.62) (uuid 1e1458a1-fde2-4f8f-8db9-ce728975008f))
  (no_connect (at 30.48 119.38) (uuid 266793f6-eae7-487a-b399-8a95980b8062))
  (no_connect (at 30.48 142.24) (uuid 3231d770-38be-479d-9ca5-a446d2f40332))
  (no_connect (at 30.48 58.42) (uuid 42a9bea7-b4d7-4ef8-81d9-dbc217eaf4ca))
  (no_connect (at 30.48 83.82) (uuid 43d3ab72-1b14-4a75-a77c-1e94f72186fa))
  (no_connect (at 91.44 106.68) (uuid 48efea13-f2c2-422a-9391-22695ae1a13d))
  (no_connect (at 30.48 99.06) (uuid 4a0bd6c6-9883-4a7a-bcf2-8c360609890e))
  (no_connect (at 30.48 73.66) (uuid 4fbe9892-bfe0-49e1-a781-c90b25ce600d))
  (no_connect (at 91.44 73.66) (uuid 50cc43cd-43be-4ccc-803b-687331e8c963))
  (no_connect (at 91.44 76.2) (uuid 5a199d59-e121-476e-8c5e-7c96b7b14b76))
  (no_connect (at 91.44 109.22) (uuid 5c4416b1-076d-4f3f-acba-611b44e0b09a))
  (no_connect (at 91.44 53.34) (uuid 678df5ca-14fa-4afa-9760-e25bcdeaab21))
  (no_connect (at 30.48 71.12) (uuid 6c878447-e0b4-44a7-8685-3dcfa47a787a))
  (no_connect (at 30.48 124.46) (uuid 73ec1074-089e-46aa-ba29-aac7f4404694))
  (no_connect (at 91.44 114.3) (uuid 78479230-328d-410d-8301-f4bde1f8f656))
  (no_connect (at 30.48 109.22) (uuid 7df75bea-f5f5-4637-a30e-6b1c39fab5bc))
  (no_connect (at 30.48 101.6) (uuid 883036f2-83f0-4bc8-9766-183bdd8231db))
  (no_connect (at 30.48 76.2) (uuid 8baa9cff-91e2-4e15-9251-414500f8e511))
  (no_connect (at 30.48 96.52) (uuid 8c33e8f2-ccd6-42c5-ac8a-371e1be1581d))
  (no_connect (at 30.48 86.36) (uuid 9a24531b-e34b-4131-9bc4-ecbd028a8c0c))
  (no_connect (at 30.48 137.16) (uuid a2497779-229e-4953-87f3-920ba80f2f77))
  (no_connect (at 91.44 78.74) (uuid ac295e93-3a76-42c3-a64a-714ebfb22812))
  (no_connect (at 30.48 50.8) (uuid af074c74-5bf5-4556-b411-749ab0f6e6fe))
  (no_connect (at 30.48 114.3) (uuid beb441e7-d0d0-46f5-b7ba-ee3d18cffac2))
  (no_connect (at 30.48 106.68) (uuid c1e80acc-7c9e-4078-8780-b163c0c5fb14))
  (no_connect (at 30.48 116.84) (uuid c350e990-d1e4-4502-a9b6-76496dbd5bd7))
  (no_connect (at 30.48 139.7) (uuid c76459f0-53ae-43e8-a7ef-69f6c9d7cade))
  (no_connect (at 91.44 101.6) (uuid c93510ee-c9f2-419e-b2c0-079df42f5fa3))
  (no_connect (at 91.44 116.84) (uuid ceb9458d-cbdf-44d0-ac3c-c69a5d362953))
  (no_connect (at 91.44 121.92) (uuid d99f0a90-87ab-46a0-aec4-5c5e98caef5f))
  (no_connect (at 30.48 91.44) (uuid dfab0972-e838-498f-84fc-d92d8a070019))
  (no_connect (at 30.48 48.26) (uuid e7009abf-0e16-465a-83dc-257c4ea63f13))
  (no_connect (at 91.44 81.28) (uuid fad7a55d-474d-439c-83fb-f900c6116e79))

  (wire (pts (xy 30.48 152.4) (xy 29.21 152.4))
    (stroke (width 0) (type solid))
    (uuid 0230698f-79d4-4dc8-a22e-ea442740ce8f)
  )
  (wire (pts (xy 91.44 127) (xy 107.95 127))
    (stroke (width 0) (type solid))
    (uuid 06527c57-c4f7-4c00-acc3-f91fcfc65347)
  )
  (wire (pts (xy 91.44 96.52) (xy 92.71 96.52))
    (stroke (width 0) (type solid))
    (uuid 06c41667-8aa6-4667-821c-25837f2a9c55)
  )
  (wire (pts (xy 91.44 144.78) (xy 107.95 144.78))
    (stroke (width 0) (type solid))
    (uuid 08bf1e81-c965-4e3a-bb9a-d9538b293f05)
  )
  (wire (pts (xy 29.21 111.76) (xy 30.48 111.76))
    (stroke (width 0) (type solid))
    (uuid 0bf6e7e9-ec21-4bfd-b154-e1a0460717e1)
  )
  (wire (pts (xy 29.21 68.58) (xy 30.48 68.58))
    (stroke (width 0) (type solid))
    (uuid 0e7fec30-b44c-48b9-80ff-b88e340069b6)
  )
  (wire (pts (xy 91.44 149.86) (xy 107.95 149.86))
    (stroke (width 0) (type solid))
    (uuid 11fc3c4c-a4be-480d-96ad-65b375c19c96)
  )
  (wire (pts (xy 30.48 45.72) (xy 29.21 45.72))
    (stroke (width 0) (type solid))
    (uuid 1300fc77-5a7b-425e-b385-91db0cfb26af)
  )
  (wire (pts (xy 29.21 93.98) (xy 29.21 104.14))
    (stroke (width 0) (type solid))
    (uuid 1aaf098c-5f9f-4547-95f9-7d77f6c9cbbf)
  )
  (wire (pts (xy 30.48 60.96) (xy 17.78 60.96))
    (stroke (width 0) (type solid))
    (uuid 1bc2884f-2af2-42c6-ac72-5596a8ebf9e6)
  )
  (wire (pts (xy 92.71 104.14) (xy 92.71 111.76))
    (stroke (width 0) (type solid))
    (uuid 2026b129-d4fa-4e66-966f-3eb260f4f7d9)
  )
  (wire (pts (xy 29.21 81.28) (xy 30.48 81.28))
    (stroke (width 0) (type solid))
    (uuid 23dfebf9-2d21-4817-891e-c9a6f828d259)
  )
  (wire (pts (xy 104.14 40.64) (xy 91.44 40.64))
    (stroke (width 0) (type default))
    (uuid 252f4a71-a16c-4b83-a07a-aa439a5a84bb)
  )
  (wire (pts (xy 22.86 129.54) (xy 30.48 129.54))
    (stroke (width 0) (type default))
    (uuid 265aec3d-4ba0-4ecf-87d7-0009f66109c7)
  )
  (wire (pts (xy 29.21 38.1) (xy 29.21 45.72))
    (stroke (width 0) (type solid))
    (uuid 3106a99c-d899-4af6-b2df-6e97b6ca64de)
  )
  (wire (pts (xy 29.21 81.28) (xy 29.21 93.98))
    (stroke (width 0) (type solid))
    (uuid 3193c7d9-6851-4d68-84e8-62e8ee2620a4)
  )
  (wire (pts (xy 30.48 38.1) (xy 29.21 38.1))
    (stroke (width 0) (type solid))
    (uuid 31df9109-a6a9-48d8-9869-31c027be4fb0)
  )
  (wire (pts (xy 29.21 30.48) (xy 29.21 38.1))
    (stroke (width 0) (type solid))
    (uuid 322dda4b-0746-4f9b-bf76-f9ae8cc4e072)
  )
  (wire (pts (xy 91.44 45.72) (xy 92.71 45.72))
    (stroke (width 0) (type default))
    (uuid 3a48f505-2e31-46e7-b6e7-14a412478a2b)
  )
  (wire (pts (xy 17.78 43.18) (xy 30.48 43.18))
    (stroke (width 0) (type default))
    (uuid 3b451ca9-3bfe-422d-9fc3-3e9c1b79b809)
  )
  (wire (pts (xy 91.44 134.62) (xy 91.44 137.16))
    (stroke (width 0) (type solid))
    (uuid 3bf25b6e-9269-4eb0-a1bc-ed1309d94f1c)
  )
  (wire (pts (xy 29.21 68.58) (xy 29.21 81.28))
    (stroke (width 0) (type solid))
    (uuid 41ff654b-bf62-4e48-a030-14101f0402b6)
  )
  (wire (pts (xy 17.78 127) (xy 30.48 127))
    (stroke (width 0) (type solid))
    (uuid 42534ee5-ce2f-4e9a-a6f1-e7da0978ec9b)
  )
  (wire (pts (xy 92.71 38.1) (xy 92.71 45.72))
    (stroke (width 0) (type solid))
    (uuid 4882b9df-cb01-4ab6-923b-9f4a82762825)
  )
  (wire (pts (xy 22.86 132.08) (xy 30.48 132.08))
    (stroke (width 0) (type default))
    (uuid 4e23112d-8909-4deb-b3da-47e90b4312ec)
  )
  (wire (pts (xy 91.44 132.08) (xy 91.44 134.62))
    (stroke (width 0) (type solid))
    (uuid 52962907-9c54-4652-abfb-62d8da47adf9)
  )
  (wire (pts (xy 29.21 111.76) (xy 29.21 121.92))
    (stroke (width 0) (type solid))
    (uuid 56e93fbe-5af7-48e5-a65f-b026088e6ae8)
  )
  (wire (pts (xy 29.21 104.14) (xy 29.21 111.76))
    (stroke (width 0) (type solid))
    (uuid 56ef93a7-35bd-45c0-a193-d28f15232087)
  )
  (wire (pts (xy 104.14 33.02) (xy 91.44 33.02))
    (stroke (width 0) (type default))
    (uuid 58183361-b280-4ebb-a7a2-c86ddc203e46)
  )
  (wire (pts (xy 102.87 48.26) (xy 91.44 48.26))
    (stroke (width 0) (type default))
    (uuid 58f135fb-4cd3-4906-a62b-d209c5b595c6)
  )
  (wire (pts (xy 91.44 38.1) (xy 92.71 38.1))
    (stroke (width 0) (type solid))
    (uuid 5ad9fde0-8088-408c-b859-e415791d2692)
  )
  (wire (pts (xy 17.78 144.78) (xy 30.48 144.78))
    (stroke (width 0) (type solid))
    (uuid 5dda72df-d5da-406b-aceb-d49cb8c7538c)
  )
  (wire (pts (xy 92.71 71.12) (xy 92.71 83.82))
    (stroke (width 0) (type solid))
    (uuid 5f08ed1d-0db4-4ab7-bd2c-9990eb459e83)
  )
  (wire (pts (xy 91.44 58.42) (xy 92.71 58.42))
    (stroke (width 0) (type solid))
    (uuid 5fe07452-4a98-443a-b956-8ca52bcea229)
  )
  (wire (pts (xy 91.44 104.14) (xy 92.71 104.14))
    (stroke (width 0) (type solid))
    (uuid 606bc279-ca4d-410d-a554-0c3d9ac0442d)
  )
  (wire (pts (xy 17.78 147.32) (xy 30.48 147.32))
    (stroke (width 0) (type default))
    (uuid 608dd8b0-e378-4607-ad4a-d5248c015776)
  )
  (wire (pts (xy 92.71 83.82) (xy 92.71 96.52))
    (stroke (width 0) (type solid))
    (uuid 6468db40-3d43-4613-b9de-80401b8c1d1d)
  )
  (wire (pts (xy 29.21 55.88) (xy 30.48 55.88))
    (stroke (width 0) (type solid))
    (uuid 6504f6ae-3018-40db-a26a-99ddac2d6ac8)
  )
  (wire (pts (xy 92.71 45.72) (xy 92.71 58.42))
    (stroke (width 0) (type solid))
    (uuid 711280e6-273e-4ff3-b44d-8e46e20ea557)
  )
  (wire (pts (xy 29.21 93.98) (xy 30.48 93.98))
    (stroke (width 0) (type solid))
    (uuid 736ba7dc-aee7-4382-a7f5-bc0797098924)
  )
  (wire (pts (xy 91.44 137.16) (xy 91.44 139.7))
    (stroke (width 0) (type solid))
    (uuid 76e297a5-8678-4afd-9a95-ba119cca148f)
  )
  (wire (pts (xy 92.71 119.38) (xy 92.71 160.02))
    (stroke (width 0) (type solid))
    (uuid 77705d2a-6d0f-4da5-846b-ec71d9691088)
  )
  (wire (pts (xy 17.78 63.5) (xy 30.48 63.5))
    (stroke (width 0) (type default))
    (uuid 810c9816-2daa-432f-ab87-b25254ec2f2d)
  )
  (wire (pts (xy 17.78 154.94) (xy 30.48 154.94))
    (stroke (width 0) (type solid))
    (uuid 8d1a6048-f9b7-4a21-9d50-ffed81ad8922)
  )
  (wire (pts (xy 29.21 121.92) (xy 29.21 152.4))
    (stroke (width 0) (type solid))
    (uuid 92ecf9ef-aee3-455a-92cb-f8a2f3260c93)
  )
  (wire (pts (xy 91.44 127) (xy 91.44 129.54))
    (stroke (width 0) (type solid))
    (uuid 9b19ca81-83f5-4e48-80bd-fb604f52eaeb)
  )
  (wire (pts (xy 92.71 111.76) (xy 92.71 119.38))
    (stroke (width 0) (type solid))
    (uuid 9fd48177-822c-4612-a409-d62b97af9354)
  )
  (wire (pts (xy 29.21 45.72) (xy 29.21 55.88))
    (stroke (width 0) (type solid))
    (uuid ac35569a-1286-4244-abf6-2db5c849c972)
  )
  (wire (pts (xy 91.44 111.76) (xy 92.71 111.76))
    (stroke (width 0) (type solid))
    (uuid af97354a-2f2b-426a-98a7-2d331944b1aa)
  )
  (wire (pts (xy 29.21 121.92) (xy 30.48 121.92))
    (stroke (width 0) (type solid))
    (uuid b014ee14-59ca-450e-a75f-b5fbcecb67fc)
  )
  (wire (pts (xy 91.44 129.54) (xy 91.44 132.08))
    (stroke (width 0) (type solid))
    (uuid b84cea36-6581-4830-9a0b-2fcce7ee9c52)
  )
  (wire (pts (xy 30.48 30.48) (xy 29.21 30.48))
    (stroke (width 0) (type solid))
    (uuid c06d9678-4c5d-42f4-97ec-d2491ec4ae08)
  )
  (wire (pts (xy 91.44 147.32) (xy 107.95 147.32))
    (stroke (width 0) (type solid))
    (uuid c767672a-a324-4ec3-8017-49920abfda56)
  )
  (wire (pts (xy 29.21 55.88) (xy 29.21 68.58))
    (stroke (width 0) (type solid))
    (uuid cf11c96f-2260-4323-8f51-691cc30ed10a)
  )
  (wire (pts (xy 92.71 96.52) (xy 92.71 104.14))
    (stroke (width 0) (type solid))
    (uuid cfc9081d-428f-4f14-a7b6-8817de7e520c)
  )
  (wire (pts (xy 104.14 43.18) (xy 91.44 43.18))
    (stroke (width 0) (type default))
    (uuid d0627a4f-32c6-4cbb-8e8f-ce45f85c7d9a)
  )
  (wire (pts (xy 17.78 33.02) (xy 30.48 33.02))
    (stroke (width 0) (type default))
    (uuid d5100ce5-95e9-48af-9452-dba3b21edae2)
  )
  (wire (pts (xy 93.98 152.4) (xy 91.44 152.4))
    (stroke (width 0) (type default))
    (uuid d5d31a84-cd95-42b8-b0a4-cc0fa2b473f5)
  )
  (wire (pts (xy 17.78 149.86) (xy 30.48 149.86))
    (stroke (width 0) (type default))
    (uuid d86a4a0d-6c7f-4253-99ca-a4bbcc9d9845)
  )
  (wire (pts (xy 91.44 142.24) (xy 107.95 142.24))
    (stroke (width 0) (type solid))
    (uuid d8ecafdb-2f3c-4061-8e1d-fba9b400fd71)
  )
  (wire (pts (xy 92.71 30.48) (xy 92.71 38.1))
    (stroke (width 0) (type solid))
    (uuid d9fa6c88-4dcc-44c6-8d9d-0e7d45947a24)
  )
  (wire (pts (xy 91.44 119.38) (xy 92.71 119.38))
    (stroke (width 0) (type solid))
    (uuid da437b5e-5566-4ed3-b0ef-cbef43951076)
  )
  (wire (pts (xy 17.78 35.56) (xy 30.48 35.56))
    (stroke (width 0) (type default))
    (uuid e041da7b-bcb0-4d43-9375-02f9325f8a99)
  )
  (wire (pts (xy 102.87 50.8) (xy 91.44 50.8))
    (stroke (width 0) (type default))
    (uuid e0f45ce7-95de-4946-b63d-aee3af835e66)
  )
  (wire (pts (xy 17.78 40.64) (xy 30.48 40.64))
    (stroke (width 0) (type default))
    (uuid e16e0513-56b7-45ed-9b32-3cd400ebeb55)
  )
  (wire (pts (xy 92.71 58.42) (xy 92.71 71.12))
    (stroke (width 0) (type solid))
    (uuid eb25f402-a651-4987-b253-c8ebc232ddb3)
  )
  (wire (pts (xy 91.44 55.88) (xy 107.95 55.88))
    (stroke (width 0) (type default))
    (uuid ece3e3df-96e6-4ebc-95b2-07804d4e47c1)
  )
  (wire (pts (xy 91.44 83.82) (xy 92.71 83.82))
    (stroke (width 0) (type solid))
    (uuid ee8a5594-89ba-46a4-9de1-2bc5c3770c28)
  )
  (wire (pts (xy 91.44 71.12) (xy 92.71 71.12))
    (stroke (width 0) (type solid))
    (uuid f0812df4-e887-4db4-9add-38c6e78f63b9)
  )
  (wire (pts (xy 91.44 35.56) (xy 104.14 35.56))
    (stroke (width 0) (type default))
    (uuid f094dd5a-1bf6-4b03-b6fc-eaf71c842036)
  )
  (wire (pts (xy 17.78 53.34) (xy 30.48 53.34))
    (stroke (width 0) (type default))
    (uuid f5c7d5a6-68d4-4a24-b66c-bf04d379a4d6)
  )
  (wire (pts (xy 29.21 104.14) (xy 30.48 104.14))
    (stroke (width 0) (type solid))
    (uuid f60e578e-9416-4908-8182-b4c493f49739)
  )
  (wire (pts (xy 29.21 152.4) (xy 29.21 160.02))
    (stroke (width 0) (type solid))
    (uuid f613e9ff-064c-404d-adda-99067759fccf)
  )
  (wire (pts (xy 91.44 154.94) (xy 107.95 154.94))
    (stroke (width 0) (type solid))
    (uuid f6209c57-86d7-485d-9fc6-6dc6c0604d9a)
  )
  (wire (pts (xy 91.44 30.48) (xy 92.71 30.48))
    (stroke (width 0) (type solid))
    (uuid f64e4926-fb2c-413d-b2b8-2d25758a3706)
  )

  (text "Ethernet connector alternatives:\nhttps://www.digikey.de/de/products/detail/te-connectivity-amp-connectors/1888250-1/1835963?s=N4IgTCBcDaIAQEYAcKwFYAMBaBIC6AvkA\nhttps://www.mouser.de/ProductDetail/Hirose-Connector/IX60G-B-10P?qs=GedFDFLaBXGqJYZ1lG080Q%3D%3D&mgh=1&vip=1&gad_source=1&gclid=CjwKCAiAx_GqBhBQEiwAlDNAZiMKZMpxI8lsyQp06qnGV7SooaS5Gx_2FtFInx-_FuOrqP5ak5VePxoCb3UQAvD_BwE"
    (at 13.97 7.62 0)
    (effects (font (size 1.27 1.27)) (justify left bottom))
    (uuid 3b5460c3-c609-4bd2-8848-e846b4168638)
  )
  (text "TODO:\n- Debug Leds\n- jumpber\n- ethernet (transformer/capacitor)\n"
    (at 170.18 40.64 0)
    (effects (font (size 1.27 1.27)) (justify left bottom))
    (uuid 966905e2-bdf0-4688-b359-ac1d9b82c5f1)
  )

  (label "Global_EN" (at 107.95 154.94 180) (fields_autoplaced)
    (effects (font (size 1.27 1.27)) (justify right bottom))
    (uuid 0c4c9276-4f23-4ee1-a413-aca9d68b7453)
  )
  (label "EEPROM_nWP" (at 17.78 53.34 0) (fields_autoplaced)
    (effects (font (size 1.27 1.27)) (justify left bottom))
    (uuid 174d4cc0-452e-48c3-a762-9644ccb936d7)
  )
  (label "ETH_P1_N" (at 17.78 35.56 0) (fields_autoplaced)
    (effects (font (size 1.27 1.27)) (justify left bottom))
    (uuid 1aa53a35-5018-4ab8-bb93-bc191c74a27e)
  )
  (label "ETH_P3_P" (at 104.14 33.02 180) (fields_autoplaced)
    (effects (font (size 1.27 1.27)) (justify right bottom))
    (uuid 1d1f030c-87ab-4423-b1f8-384a0456c78f)
  )
  (label "+3.3V" (at 17.78 127 0) (fields_autoplaced)
    (effects (font (size 1.27 1.27)) (justify left bottom))
    (uuid 295929a7-ff5d-40b0-8297-39411f3c4a63)
  )
  (label "Run_PG" (at 17.78 144.78 0) (fields_autoplaced)
    (effects (font (size 1.27 1.27)) (justify left bottom))
    (uuid 323a73d1-8b3d-4b76-9df9-f0aa173a2a3b)
  )
  (label "ETH_P3_N" (at 104.14 35.56 180) (fields_autoplaced)
    (effects (font (size 1.27 1.27)) (justify right bottom))
    (uuid 3c5741b4-00a5-425e-9003-077b4f000230)
  )
  (label "ETH_P1_P" (at 17.78 33.02 0) (fields_autoplaced)
    (effects (font (size 1.27 1.27)) (justify left bottom))
    (uuid 3e12b3df-e592-4e7c-926b-f4fd10dc8438)
  )
  (label "SCL0" (at 22.86 129.54 0) (fields_autoplaced)
    (effects (font (size 1.27 1.27)) (justify left bottom))
    (uuid 3fc4c172-f89b-42d4-8967-121cc9cd8d17)
  )
  (label "ETH_P2_P" (at 104.14 43.18 180) (fields_autoplaced)
    (effects (font (size 1.27 1.27)) (justify right bottom))
    (uuid 43c654bf-e6c6-437b-a783-28b639ce5fe0)
  )
  (label "SDA0" (at 22.86 132.08 0) (fields_autoplaced)
    (effects (font (size 1.27 1.27)) (justify left bottom))
    (uuid 46178b23-9d95-41c3-914c-7f46e5c7fcac)
  )
  (label "PWM0_1" (at 17.78 63.5 0) (fields_autoplaced)
    (effects (font (size 1.27 1.27)) (justify left bottom))
    (uuid 4e0950ba-2851-48c0-b6c5-e0ac70182c76)
  )
  (label "ETH_P2_N" (at 104.14 40.64 180) (fields_autoplaced)
    (effects (font (size 1.27 1.27)) (justify right bottom))
    (uuid 5289f34e-2c16-40aa-8402-3157ed8e504a)
  )
  (label "rpi_nBoot" (at 107.95 147.32 180) (fields_autoplaced)
    (effects (font (size 1.27 1.27)) (justify right bottom))
    (uuid 56ce167f-1165-4cce-999c-d0f012c8e8a3)
  )
  (label "ETH_LED_Y" (at 102.87 50.8 180) (fields_autoplaced)
    (effects (font (size 1.27 1.27)) (justify right bottom))
    (uuid 5b0ceaca-5d67-4be7-ad78-cc1f8cfc2e56)
  )
  (label "ETH_P0_N" (at 17.78 40.64 0) (fields_autoplaced)
    (effects (font (size 1.27 1.27)) (justify left bottom))
    (uuid 5d587e15-449b-45f6-acfd-b48b3960cd4a)
  )
  (label "BT_nDisable" (at 107.95 144.78 180) (fields_autoplaced)
    (effects (font (size 1.27 1.27)) (justify right bottom))
    (uuid 66252ea1-9b7f-4eaa-b6dc-3288711971f0)
  )
  (label "SPI6_MISO" (at 17.78 60.96 0) (fields_autoplaced)
    (effects (font (size 1.27 1.27)) (justify left bottom))
    (uuid 6acee1f1-6f9c-4c33-a4ca-eef72a22958a)
  )
  (label "PI_nActivity_LED" (at 107.95 55.88 180) (fields_autoplaced)
    (effects (font (size 1.27 1.27)) (justify right bottom))
    (uuid 97ab1a56-db77-4ad6-bdef-59423ba8ba24)
  )
  (label "WL_nDisable" (at 107.95 142.24 180) (fields_autoplaced)
    (effects (font (size 1.27 1.27)) (justify right bottom))
    (uuid a5feb098-2c97-4df9-8594-1ee811fdddf5)
  )
  (label "ETH_P0_P" (at 17.78 43.18 0) (fields_autoplaced)
    (effects (font (size 1.27 1.27)) (justify left bottom))
    (uuid b8b06882-d324-4450-9fe3-7e523cc1d1a6)
  )
  (label "rpi_nPwrLED" (at 107.95 149.86 180) (fields_autoplaced)
    (effects (font (size 1.27 1.27)) (justify right bottom))
    (uuid c543d3e0-2540-4e03-8eb2-909aa1f3bb46)
  )
  (label "+5V" (at 107.95 127 180) (fields_autoplaced)
    (effects (font (size 1.27 1.27)) (justify right bottom))
    (uuid da5d6b09-910c-4f86-b5b4-df737255c59f)
  )
  (label "ETH_LED_G" (at 102.87 48.26 180) (fields_autoplaced)
    (effects (font (size 1.27 1.27)) (justify right bottom))
    (uuid f095307b-9203-4f13-af90-3281ccc9e028)
  )
  (label "nEXTRST" (at 17.78 154.94 0) (fields_autoplaced)
    (effects (font (size 1.27 1.27)) (justify left bottom))
    (uuid f8a8933d-4e09-4e01-aa3e-359d144db299)
  )

  (hierarchical_label "Camera_GPIO" (shape input) (at 93.98 152.4 0) (fields_autoplaced)
    (effects (font (size 1.27 1.27)) (justify left))
    (uuid 2df800da-8f4b-4bf9-bcf1-fec263562143)
  )
  (hierarchical_label "SCL0" (shape input) (at 22.86 129.54 180) (fields_autoplaced)
    (effects (font (size 1.27 1.27)) (justify right))
    (uuid 3c782a3a-5ba5-4a24-a4e8-7be01a19eb82)
  )
  (hierarchical_label "SDA0" (shape input) (at 22.86 132.08 180) (fields_autoplaced)
    (effects (font (size 1.27 1.27)) (justify right))
    (uuid 51acd489-6087-4cec-9647-9a8875eefdc6)
  )
  (hierarchical_label "IP1" (shape input) (at 17.78 147.32 180) (fields_autoplaced)
    (effects (font (size 1.27 1.27)) (justify right))
    (uuid 52924369-1c5e-4ee1-a69e-7c663af6a4f5)
  )
  (hierarchical_label "IP0" (shape input) (at 17.78 149.86 180) (fields_autoplaced)
    (effects (font (size 1.27 1.27)) (justify right))
    (uuid 5b5a607a-65d7-41f9-8a9c-c2e29edbd9db)
  )

  (symbol (lib_name "GND_1") (lib_id "power:GND") (at 29.21 160.02 0) (unit 1)
    (in_bom yes) (on_board yes) (dnp no) (fields_autoplaced)
    (uuid 23426936-e692-4bd8-a869-7217285b8b95)
    (property "Reference" "#PWR06" (at 29.21 166.37 0)
      (effects (font (size 1.27 1.27)) hide)
    )
    (property "Value" "GND" (at 29.21 165.1 0)
      (effects (font (size 1.27 1.27)))
    )
    (property "Footprint" "" (at 29.21 160.02 0)
      (effects (font (size 1.27 1.27)) hide)
    )
    (property "Datasheet" "" (at 29.21 160.02 0)
      (effects (font (size 1.27 1.27)) hide)
    )
    (pin "1" (uuid df9cb0c6-7cdc-4f76-b8c5-bd8e52185972))
    (instances
      (project "Payload"
        (path "/1538b795-14eb-461c-a8b0-b6a295a337db/f69d667c-4ca3-4161-84ff-64f64d99f362"
          (reference "#PWR06") (unit 1)
        )
        (path "/1538b795-14eb-461c-a8b0-b6a295a337db/d5f676e3-f036-4169-9b27-4120627d88bc"
          (reference "#PWR014") (unit 1)
        )
      )
      (project "Mainboard_V2"
        (path "/39a83c20-db9b-4453-92ec-2b7588f54278/8ad6ed53-91f9-4177-9c8b-52866f95726b"
          (reference "#PWR065") (unit 1)
        )
        (path "/39a83c20-db9b-4453-92ec-2b7588f54278/9aacd75a-0bd7-46f2-b9ff-2ea70792ae7f"
          (reference "#PWR03") (unit 1)
        )
      )
      (project "camera-companion-jacky"
        (path "/668ff29f-8356-4c9b-ace0-a71ab7b83a33/539fb2f5-d053-4ced-824f-6018432ab062"
          (reference "#PWR05") (unit 1)
        )
      )
    )
  )

  (symbol (lib_name "GND_1") (lib_id "power:GND") (at 92.71 160.02 0) (unit 1)
    (in_bom yes) (on_board yes) (dnp no) (fields_autoplaced)
    (uuid 46ea8135-a32d-4eb1-997b-e9043096c044)
    (property "Reference" "#PWR05" (at 92.71 166.37 0)
      (effects (font (size 1.27 1.27)) hide)
    )
    (property "Value" "GND" (at 92.71 165.1 0)
      (effects (font (size 1.27 1.27)))
    )
    (property "Footprint" "" (at 92.71 160.02 0)
      (effects (font (size 1.27 1.27)) hide)
    )
    (property "Datasheet" "" (at 92.71 160.02 0)
      (effects (font (size 1.27 1.27)) hide)
    )
    (pin "1" (uuid 149b52b1-dbb7-474c-acef-4155ec3429fb))
    (instances
      (project "Payload"
        (path "/1538b795-14eb-461c-a8b0-b6a295a337db/f69d667c-4ca3-4161-84ff-64f64d99f362"
          (reference "#PWR05") (unit 1)
        )
        (path "/1538b795-14eb-461c-a8b0-b6a295a337db/d5f676e3-f036-4169-9b27-4120627d88bc"
          (reference "#PWR015") (unit 1)
        )
      )
      (project "Mainboard_V2"
        (path "/39a83c20-db9b-4453-92ec-2b7588f54278/8ad6ed53-91f9-4177-9c8b-52866f95726b"
          (reference "#PWR065") (unit 1)
        )
        (path "/39a83c20-db9b-4453-92ec-2b7588f54278/9aacd75a-0bd7-46f2-b9ff-2ea70792ae7f"
          (reference "#PWR04") (unit 1)
        )
      )
      (project "camera-companion-jacky"
        (path "/668ff29f-8356-4c9b-ace0-a71ab7b83a33/539fb2f5-d053-4ced-824f-6018432ab062"
          (reference "#PWR06") (unit 1)
        )
      )
    )
  )

  (symbol (lib_id "CM4IO:ComputeModule4-CM4") (at 63.5 86.36 0) (unit 1)
    (in_bom yes) (on_board yes) (dnp no) (fields_autoplaced)
    (uuid 6b8800db-59f6-40d1-b47d-ba06c0fa8d3f)
    (property "Reference" "Module1" (at 60.96 17.78 0)
      (effects (font (size 1.27 1.27)))
    )
    (property "Value" "ComputeModule4-CM4" (at 60.96 20.32 0)
      (effects (font (size 1.27 1.27)))
    )
    (property "Footprint" "CM4IO:Raspberry-Pi-4-Compute-Module" (at 205.74 113.03 0)
      (effects (font (size 1.27 1.27)) hide)
    )
    (property "Datasheet" "" (at 205.74 113.03 0)
      (effects (font (size 1.27 1.27)) hide)
    )
    (property "Field4" "Hirose" (at 60.96 22.86 0)
      (effects (font (size 1.27 1.27)))
    )
    (property "Field5" "2x DF40C-100DS-0.4V" (at 60.96 25.4 0)
      (effects (font (size 1.27 1.27)))
    )
    (property "JLC Part Nr:" "C424649" (at 63.5 86.36 0)
      (effects (font (size 1.27 1.27)) hide)
    )
    (pin "123" (uuid 1d173e35-b42f-48c7-bd9c-880b3e2e3fb1))
    (pin "151" (uuid bd078d93-62d3-4908-8b2a-6cb634d860a8))
    (pin "154" (uuid 77901ba5-4cad-4d7f-83d7-8f82b8ccc5e0))
    (pin "102" (uuid 73096b87-46f2-4049-8dc8-29f6b58e92cd))
    (pin "30" (uuid 1f44013a-d25c-4efc-9729-991660b76b17))
    (pin "156" (uuid c3ecf41b-0ce2-4017-8cb4-38ec69bf195a))
    (pin "8" (uuid 32f7beae-a5e9-4e49-ba03-b21524eedd6a))
    (pin "59" (uuid 4d34d491-ecd1-4635-96ed-bab5ff83d22d))
    (pin "40" (uuid c98c0ac3-9bfe-4d38-870b-a4b223870317))
    (pin "62" (uuid 7ebef746-5f48-41f2-bcea-2c4411b63276))
    (pin "41" (uuid 383beb41-b240-4910-bb2f-541c648a6c71))
    (pin "169" (uuid 636907ad-363b-4b77-86ee-b877a93ff4bd))
    (pin "54" (uuid 965eef63-09b8-4dbb-ada5-64b9cb8042ce))
    (pin "126" (uuid 2651ee2b-3058-4385-8350-4a0b6bfa72d2))
    (pin "122" (uuid 22b0a51b-e108-4edb-8a1d-05511b73e946))
    (pin "176" (uuid 5d5f4878-b7eb-464f-9ab8-029ef75e6789))
    (pin "42" (uuid 02ba2982-210c-44bf-9548-6091c121fdc0))
    (pin "113" (uuid 6dcc7ee9-d40e-48c7-afd4-e3d7bc9211e8))
    (pin "128" (uuid 2f756786-34b9-4abd-a99c-4bc542b35e2c))
    (pin "197" (uuid 6fc5c5dc-55fd-4f88-8e06-0b4908f5db7c))
    (pin "5" (uuid dc537a12-d49d-42db-9d16-5d673e9f2f10))
    (pin "125" (uuid 9587240b-3f55-430f-9397-1a5aeef969ae))
    (pin "37" (uuid 16cfdc05-9646-4c0d-89c2-4c3b8cbbbe7c))
    (pin "50" (uuid fd813d7f-0cfa-42d6-96d3-dab99dac59e1))
    (pin "115" (uuid e8f7ab7f-6d9e-4a44-9323-7ca73e988a96))
    (pin "111" (uuid e6da2633-69e8-4496-95a8-f23cd0768868))
    (pin "52" (uuid 8da48f2e-e45e-451f-825e-1794901b5071))
    (pin "190" (uuid 1d6054cb-dda7-4654-9d39-79b21e846bf8))
    (pin "86" (uuid cd0bc766-ca44-44ca-b5c7-b051509ef355))
    (pin "127" (uuid 064f7006-1a9c-4284-91b2-0e7db4177f26))
    (pin "103" (uuid 91a61e1a-d1b0-423a-a3e7-0c4644e6cc18))
    (pin "6" (uuid d033e6cb-4717-41df-bca6-7883cc829fb7))
    (pin "53" (uuid 2e992b13-e963-4379-bab5-d6beabfc58a1))
    (pin "108" (uuid 6a06d046-8f03-4ce6-b8c7-c30e5518feea))
    (pin "166" (uuid 0e0179cd-9ec2-492d-aec7-0f6f1fb8a515))
    (pin "153" (uuid 3b075f74-fd33-40c6-bc94-32afb0340033))
    (pin "79" (uuid 9d694da0-2fd6-49c8-ae5b-6b40e0607290))
    (pin "88" (uuid 3466c634-38a0-4765-8128-3007ccf7c735))
    (pin "64" (uuid d6bea874-df1f-4430-aa5d-d4cfbacc6058))
    (pin "48" (uuid 9e36bdf5-e8e3-42f3-8a92-345f115c2688))
    (pin "31" (uuid 871610fc-1304-4070-bace-dae480e5e531))
    (pin "161" (uuid 993107ee-2534-4ef9-91dd-a178b35fe8a3))
    (pin "173" (uuid 82387977-10f6-4101-8e04-80473f892fd3))
    (pin "119" (uuid 00ecf122-73d3-488e-86d5-85cd1e758e25))
    (pin "193" (uuid 6a90137c-b402-428e-b2e1-ced9ae2dfade))
    (pin "157" (uuid d36d4d40-8b16-432d-92fc-c27bcf6f5c42))
    (pin "141" (uuid 86a6e316-4d61-46f6-9bb0-c2be66572044))
    (pin "77" (uuid beb525de-bbe3-4f88-9569-1b15108f110e))
    (pin "109" (uuid f879362b-1b1c-4dea-a38e-850481b5d80d))
    (pin "130" (uuid f053f54d-df52-46d9-98fb-4a298a4e972a))
    (pin "63" (uuid 2509db9b-1c4c-4106-9c80-4aed0f425e61))
    (pin "38" (uuid f520d7cf-3496-43ee-a252-c4fa09709151))
    (pin "167" (uuid 706c7ab6-bfc6-4b33-9e5a-7cca9540eb16))
    (pin "46" (uuid 69ba34ea-12c3-43b4-aa3a-6d4d75081cb7))
    (pin "121" (uuid b1b8598a-f5bc-46af-a338-1441c1f822f4))
    (pin "56" (uuid 4d953d3f-c4a5-42af-97ff-debae6173e37))
    (pin "191" (uuid 71d3ee63-8c60-46a7-a788-86837ff979f6))
    (pin "114" (uuid 29018196-abc3-422c-aa6c-0a2d37f4cfcf))
    (pin "152" (uuid 6fc67f6e-b55e-4c0d-b9b5-c1c68237d0fa))
    (pin "120" (uuid c46b7bf8-4642-4d14-882a-baae4aa2980c))
    (pin "87" (uuid 24ed0e74-48f9-4891-9384-a48f46a38a76))
    (pin "159" (uuid 9e5123cc-4ede-4542-b720-503b93f82a37))
    (pin "43" (uuid 0af85976-201e-4efe-a89d-afb6e4da520e))
    (pin "199" (uuid e22c2945-4b33-4abc-bcf0-146a29201f15))
    (pin "49" (uuid 638f96eb-f566-4719-99a6-3dab7f8306aa))
    (pin "192" (uuid 08025b8f-7e0d-4fad-b51a-20d57976fbf7))
    (pin "112" (uuid 7eb2be89-69a8-49df-8cd6-22e5361195d3))
    (pin "118" (uuid 66a4797b-9c3c-450b-af02-e03eb4f3022b))
    (pin "158" (uuid c98a3279-44c0-4cb6-8a32-b1b805891558))
    (pin "110" (uuid 9496b1ec-5a30-48d5-820a-f8179f9b6a1f))
    (pin "155" (uuid 4f43db97-329d-438b-b470-66d57d6e9fde))
    (pin "116" (uuid 9eb07884-fbfd-4ba8-88be-4049b1d922d6))
    (pin "200" (uuid 81e9d6fa-5b3b-467e-bf6b-dc1bd2e04e4d))
    (pin "76" (uuid 2c8af3f1-e22d-4a7d-a91c-04583625b75e))
    (pin "81" (uuid d73c88f7-0a57-4fa8-9568-caa98a0d33c8))
    (pin "165" (uuid 91e7a7ce-e7b1-4162-a081-e69f2172e580))
    (pin "134" (uuid 2d124af5-c314-4d39-ab00-150c0975c44d))
    (pin "107" (uuid 5a61a057-b1bb-47e3-a91b-c21de1fe2576))
    (pin "21" (uuid 722bb021-36aa-4989-9c8c-619400e3e570))
    (pin "164" (uuid 4f9f6213-9512-45b1-a7aa-f5bc37fdc0ce))
    (pin "106" (uuid 35e4f5c6-9162-48f2-b35d-1684cb35b628))
    (pin "135" (uuid e93f39d7-637e-4a75-9d56-243289cf5eb8))
    (pin "85" (uuid 3908ce33-6487-4d79-b6c6-f22f3c6e9198))
    (pin "47" (uuid 96693f1c-33ed-44b4-ae78-b0e8ad7f101f))
    (pin "132" (uuid d64570db-b5ac-45c9-8538-9d6445f2f0f2))
    (pin "133" (uuid 1de4525e-9260-4724-af10-1ab9352b0bf2))
    (pin "129" (uuid f5f917b4-2017-44e5-af8a-09e87e6e7354))
    (pin "44" (uuid 1f9534c8-0166-434d-8be5-a679bb6cecef))
    (pin "117" (uuid d8d945cc-b7bd-40c1-8e78-d109b81ee8b2))
    (pin "194" (uuid 17fba5b3-e964-4162-a937-c3443b593581))
    (pin "172" (uuid 9293018b-d55f-4997-93b0-8a663dea876f))
    (pin "80" (uuid b984a3f5-5d3b-4586-b4e3-c9ff413f3725))
    (pin "55" (uuid 582e25a9-0787-4343-bc44-e50714b3d662))
    (pin "175" (uuid 81dcc565-79da-493d-98fa-7fb72f917c93))
    (pin "162" (uuid f753618e-9c30-4a76-981d-3737a2d1f369))
    (pin "74" (uuid ba366030-a915-4606-abb9-a6a66b92cea1))
    (pin "36" (uuid 300d92e5-5571-4cb4-afdc-55293529670b))
    (pin "96" (uuid bcc6f6d1-85d0-4590-b960-a3983f54bba9))
    (pin "29" (uuid 9b268576-36b5-403e-b683-8fb663baa095))
    (pin "69" (uuid a4a00004-25ee-471d-878b-52300b849534))
    (pin "17" (uuid 3a89e6c2-c467-48b8-8c32-32dfc7c214c8))
    (pin "25" (uuid 2aa9528a-e5cd-470e-822e-707e77fc9ef5))
    (pin "92" (uuid 27f20a43-3e0a-4433-9080-c711f540169a))
    (pin "9" (uuid 264be957-716f-46ce-ba61-de15545d5b0e))
    (pin "93" (uuid 8ea608b5-a693-47ae-9e22-e9c942b2969f))
    (pin "18" (uuid e5dbe7cf-c92a-4436-8cbc-45b8e4f7b81b))
    (pin "15" (uuid bdd552bf-d09e-4378-a2de-22573a63d110))
    (pin "12" (uuid ea8465de-a7be-4abc-82f5-03b6241ca097))
    (pin "20" (uuid dd943aa2-21f7-43f3-87e8-a0b7f4db6265))
    (pin "139" (uuid aaebffd4-07bd-49c1-aa8e-c1514f4c1318))
    (pin "35" (uuid 86bff0ae-901b-442a-846d-74b187f4db86))
    (pin "3" (uuid db0e900b-72ff-4235-9a1b-48d032ad08b8))
    (pin "185" (uuid c0e89c5b-ced1-4189-968c-b5aa435e6f7c))
    (pin "67" (uuid a21c3067-4660-4a2f-b204-816cd86c8a0b))
    (pin "72" (uuid 8ba1b08f-45ba-46a8-9603-001fad598bcb))
    (pin "11" (uuid b5420d14-5423-4e89-a251-d275a1b00c22))
    (pin "137" (uuid 629a5990-c6af-4d2d-a1a7-03e37004f226))
    (pin "51" (uuid f082e147-b96a-4e07-a3ed-447734b7f13a))
    (pin "57" (uuid 5bea16d6-22c7-4c8b-8036-9c07901cacd5))
    (pin "163" (uuid 8ae05923-60cf-4b25-b320-e4a73d874cf2))
    (pin "16" (uuid b47e83fa-3e04-4bd4-919f-f32d7dd6f100))
    (pin "45" (uuid d62f2231-90da-46ed-bf06-17802c5da0d9))
    (pin "58" (uuid ff588150-87a0-4fa1-aa06-08c159a3dc9e))
    (pin "174" (uuid 1af0c96c-c1f6-4e7a-9cbb-730daede6629))
    (pin "90" (uuid 481d06f9-3dc5-464d-833d-925c7ab8ce24))
    (pin "27" (uuid 38d81b3b-d38c-46fc-889c-4a1a7e6686d3))
    (pin "84" (uuid 9885ee73-b00c-4ae6-8d43-7ce74cef1281))
    (pin "61" (uuid 338fd224-e23d-492d-bff8-b4954fa34a5a))
    (pin "168" (uuid 3cd86e99-06ba-4d03-aeb0-8185a13377e4))
    (pin "196" (uuid ace33197-5afa-4bfd-bc9f-65a063a88bf0))
    (pin "136" (uuid 1ce33b7e-90cf-4529-bfd8-29ecae56d8a6))
    (pin "39" (uuid 0cd28c85-5305-4d5b-9949-64eb19a0e166))
    (pin "89" (uuid 5b5dfa6e-836f-422e-9714-d92337c0047d))
    (pin "195" (uuid ba1bcb68-0b08-442d-8ee9-97b5ff607fd3))
    (pin "105" (uuid ee01bb9c-d108-486d-9071-8e5a913a2c1e))
    (pin "124" (uuid 03abbd79-a6b7-44a8-a951-3c7674ecd810))
    (pin "78" (uuid ed77337e-d08e-4e9e-8eb9-42c7249db047))
    (pin "101" (uuid 8656d42c-f252-4e71-b59c-33645d60bcd0))
    (pin "60" (uuid 132f8309-5775-4d4f-9e7a-094050aa0e33))
    (pin "4" (uuid fb4d5909-fd96-4131-90d2-0e5cb2285394))
    (pin "177" (uuid 5144e018-19ab-4148-bf02-203bc62ca61e))
    (pin "149" (uuid d69297ad-5ebe-4239-8118-fd7187fa688d))
    (pin "198" (uuid 3be25eb5-72a1-4cf4-9768-5830419e99ab))
    (pin "160" (uuid 42c784b8-9820-4429-827f-6c94a91f8365))
    (pin "104" (uuid ed5b37a4-c191-4cdc-8e2c-2a7f4fcf1dfc))
    (pin "24" (uuid 49193424-c2a7-483f-8c2c-86114664c2ef))
    (pin "95" (uuid 03ef23f4-26c1-4b37-b658-baf175803ac0))
    (pin "179" (uuid f0cb5782-8721-441b-bab6-1217e96ab6fe))
    (pin "97" (uuid 636ef102-3e21-43eb-8637-0343170aadb6))
    (pin "65" (uuid e7b87250-6a1a-4eac-b9e6-25e857859fc2))
    (pin "73" (uuid 07edf6aa-8645-4e3f-aa8a-b568916fe369))
    (pin "70" (uuid 32d55a7b-59db-422f-af41-ad4396a82e28))
    (pin "23" (uuid 728c7830-6f83-4137-b9f4-433f0adc2dbc))
    (pin "140" (uuid 93db464d-efe3-4d5a-9fc8-9b76248142a4))
    (pin "181" (uuid f4d95789-4232-4ad2-aafa-d5717c816499))
    (pin "1" (uuid b1b915ca-3d0a-4de8-9428-d872609f5fb1))
    (pin "10" (uuid fe3fe3d3-524e-495f-acc8-4a3d79c83845))
    (pin "66" (uuid a49648b4-04ee-4acc-8682-95eeef859664))
    (pin "180" (uuid 6ebd6a7b-6e20-42df-b165-3f2ecc7e545c))
    (pin "91" (uuid d729bde4-3213-4e06-8fee-4848fc3457f5))
    (pin "138" (uuid 0b7de507-72fd-4038-a2b5-3fca7dd11f44))
    (pin "186" (uuid f5780639-77b1-4df7-b4a3-1f2ee304754d))
    (pin "143" (uuid d78805a9-7887-4198-8082-99186e0d04fb))
    (pin "148" (uuid fab94ec7-13e7-4404-b8fa-cb12564fd05d))
    (pin "182" (uuid be8471c7-8750-4f89-a0d9-274959237b46))
    (pin "188" (uuid afb846bd-68a1-4993-97d8-3d9c11f85024))
    (pin "147" (uuid 2e66b9f8-b0b6-4f8b-86f5-19f23afd8d24))
    (pin "150" (uuid 17fd759f-4127-4b0b-b29f-f8890b0a4e7a))
    (pin "33" (uuid 9aab34b1-6da9-4df8-a428-92957605e83e))
    (pin "99" (uuid 3e28c0b4-a0bf-44d2-b78c-f33c2e116118))
    (pin "32" (uuid 6ef16061-e8d9-4a86-8b14-b277b9396b4d))
    (pin "189" (uuid 5caca093-d1ef-4cc1-b1c1-22e84ec8d425))
    (pin "187" (uuid 7ac9c25c-8bd5-49e1-9955-a4e145188513))
    (pin "75" (uuid ac1ba370-0ab0-43e5-b2b5-2722fde70c76))
    (pin "178" (uuid e7b78465-e765-46be-aae0-6fbf2a478799))
    (pin "146" (uuid 4d70f947-fcae-45f4-add5-56346c71d34e))
    (pin "13" (uuid 6d2c46f4-ec28-4f53-a507-01994fc1f1fb))
    (pin "68" (uuid 04759ca8-f957-4db3-8e25-4c2481ae776a))
    (pin "142" (uuid 9f2aa5ea-0505-470f-92f9-fb491f9039a1))
    (pin "100" (uuid 53b290ee-cc3b-4002-b935-2b3396a5f58a))
    (pin "71" (uuid 8ce5d603-f4d4-4125-80dc-88b70e5da517))
    (pin "144" (uuid aeee7d59-91c2-413e-9646-f0552d5ed96c))
    (pin "183" (uuid 9b09c47b-5442-4341-8b7b-44ae2b728d8b))
    (pin "34" (uuid cdbb36f8-c504-4d35-b9ac-7a019fe2b4b0))
    (pin "184" (uuid cf8869a3-83de-4d43-83d3-f3ab4a25a736))
    (pin "22" (uuid 1a6d0e89-f700-45b8-88e3-1557739f9d1f))
    (pin "7" (uuid 96f7b5f7-0908-4215-bc7b-569bc2a69f49))
    (pin "145" (uuid 53d2848d-8d52-4335-af1f-f5bd69675c8b))
    (pin "2" (uuid c65282c5-f308-4f26-a60f-c9478e6524c1))
    (pin "14" (uuid 44abb97f-bbbd-42e9-b8ee-7c6a1744c4b2))
    (pin "94" (uuid 155afac5-f7e9-4bae-8610-b9cd2b627f71))
    (pin "98" (uuid 69e23d1a-87b0-4ea1-85cf-ba391c60e5ba))
    (pin "28" (uuid e842f10b-acf5-4b3d-8db6-708f5080fa31))
    (pin "26" (uuid c25e15b4-a152-42be-94df-f09ce5ecccbd))
    (pin "82" (uuid ae25f66a-8280-43d5-8b09-8797845de900))
    (pin "19" (uuid 748bc1da-d4bd-46cf-9eff-28a53cdbc957))
    (pin "131" (uuid 81ae32ac-8baf-4bda-b298-794c9223fad6))
    (pin "170" (uuid d779cb00-b2b9-4462-9f6a-522a389db1d9))
    (pin "83" (uuid 638256df-780b-4614-b5aa-4e77c28e35e1))
    (pin "171" (uuid ccc4adf6-009b-4b55-adac-d16ca196f1d2))
    (instances
      (project "Payload"
        (path "/1538b795-14eb-461c-a8b0-b6a295a337db/132477e8-a6fe-41d6-9d19-8a01b60dcd22"
          (reference "Module1") (unit 1)
        )
        (path "/1538b795-14eb-461c-a8b0-b6a295a337db/f69d667c-4ca3-4161-84ff-64f64d99f362"
          (reference "Module1") (unit 1)
        )
        (path "/1538b795-14eb-461c-a8b0-b6a295a337db/d5f676e3-f036-4169-9b27-4120627d88bc"
          (reference "Module2") (unit 1)
        )
      )
      (project "camera-companion-jacky"
        (path "/668ff29f-8356-4c9b-ace0-a71ab7b83a33/539fb2f5-d053-4ced-824f-6018432ab062"
          (reference "Module1") (unit 1)
        )
      )
    )
  )
)
