
(kicad_symbol_lib (version 20211014) (generator kicad_symbol_editor)
  (symbol "TF-01A" (pin_names (offset 1.016)) (in_bom yes) (on_board yes)
    (property "Reference" "MICRO_SD" (id 0) (at -12.7 10.795 0)
      (effects (font (size 1.27 1.27)) (justify bottom left))
    )
    (property "Value" "TF-01A" (id 1) (at -12.7 -20.32 0)
      (effects (font (size 1.27 1.27)) (justify bottom left))
    )
    (property "Footprint" "TF-01A:TF-01A" (id 2) (at 0 0 0)
      (effects (font (size 1.27 1.27)) (justify bottom) hide)
    )
    (property "MF" "HRO Electronics Co., Ltd." (id 4) (at 0 0 0)
      (effects (font (size 1.27 1.27)) (justify bottom) hide)
    )
    (property "Description" "\nStandard Card Edge Connectors\n" (id 5) (at 0 0 0)
      (effects (font (size 1.27 1.27)) (justify bottom) hide)
    )
    (property "Package" "Package" (id 6) (at 0 0 0)
      (effects (font (size 1.27 1.27)) (justify bottom) hide)
    )
    (property "Price" "None" (id 7) (at 0 0 0)
      (effects (font (size 1.27 1.27)) (justify bottom) hide)
    )
    (property "SnapEDA_Link" "https://www.snapeda.com/parts/TF-01A/HRO+Electronics+Co.%252C+Ltd./view-part/?ref=snap" (id 8) (at 0 0 0)
      (effects (font (size 1.27 1.27)) (justify bottom) hide)
    )
    (property "MP" "TF-01A" (id 9) (at 0 0 0)
      (effects (font (size 1.27 1.27)) (justify bottom) hide)
    )
    (property "Availability" "Not in stock" (id 10) (at 0 0 0)
      (effects (font (size 1.27 1.27)) (justify bottom) hide)
    )
    (property "Check_prices" "https://www.snapeda.com/parts/TF-01A/HRO+Electronics+Co.%252C+Ltd./view-part/?ref=eda" (id 11) (at 0 0 0)
      (effects (font (size 1.27 1.27)) (justify bottom) hide)
    )
    (symbol "TF-01A_0_0"
      (rectangle (start -12.7 -17.78) (end 12.7 10.16)
        (stroke (width 0.254)) (fill (type background))
      )
      (pin bidirectional line (at -17.78 -5.08 0) (length 5.08)
        (name "DAT2"
          (effects (font (size 1.016 1.016)))
        )
        (number "1"
          (effects (font (size 1.016 1.016)))
        )
      )
      (pin bidirectional line (at -17.78 -7.62 0) (length 5.08)
        (name "CD/DAT3"
          (effects (font (size 1.016 1.016)))
        )
        (number "2"
          (effects (font (size 1.016 1.016)))
        )
      )
      (pin bidirectional line (at -17.78 5.08 0) (length 5.08)
        (name "CMD"
          (effects (font (size 1.016 1.016)))
        )
        (number "3"
          (effects (font (size 1.016 1.016)))
        )
      )
      (pin power_in line (at 17.78 7.62 180.0) (length 5.08)
        (name "VDD"
          (effects (font (size 1.016 1.016)))
        )
        (number "4"
          (effects (font (size 1.016 1.016)))
        )
      )
      (pin bidirectional clock (at -17.78 7.62 0) (length 5.08)
        (name "CLK"
          (effects (font (size 1.016 1.016)))
        )
        (number "5"
          (effects (font (size 1.016 1.016)))
        )
      )
      (pin power_in line (at 17.78 -15.24 180.0) (length 5.08)
        (name "VSS"
          (effects (font (size 1.016 1.016)))
        )
        (number "6"
          (effects (font (size 1.016 1.016)))
        )
      )
      (pin bidirectional line (at -17.78 0.0 0) (length 5.08)
        (name "DAT0"
          (effects (font (size 1.016 1.016)))
        )
        (number "7"
          (effects (font (size 1.016 1.016)))
        )
      )
      (pin bidirectional line (at -17.78 -2.54 0) (length 5.08)
        (name "DAT1"
          (effects (font (size 1.016 1.016)))
        )
        (number "8"
          (effects (font (size 1.016 1.016)))
        )
      )
      (pin passive line (at 17.78 0.0 180.0) (length 5.08)
        (name "CD"
          (effects (font (size 1.016 1.016)))
        )
        (number "CD1"
          (effects (font (size 1.016 1.016)))
        )
      )
      (pin power_in line (at 17.78 -5.08 180.0) (length 5.08)
        (name "SHIELD"
          (effects (font (size 1.016 1.016)))
        )
        (number "MP1"
          (effects (font (size 1.016 1.016)))
        )
      )
      (pin power_in line (at 17.78 -7.62 180.0) (length 5.08)
        (name "SHIELD__1"
          (effects (font (size 1.016 1.016)))
        )
        (number "MP2"
          (effects (font (size 1.016 1.016)))
        )
      )
      (pin power_in line (at 17.78 -10.16 180.0) (length 5.08)
        (name "SHIELD__2"
          (effects (font (size 1.016 1.016)))
        )
        (number "MP3"
          (effects (font (size 1.016 1.016)))
        )
      )
      (pin power_in line (at 17.78 -12.7 180.0) (length 5.08)
        (name "SHIELD__3"
          (effects (font (size 1.016 1.016)))
        )
        (number "MP4"
          (effects (font (size 1.016 1.016)))
        )
      )
    )
  )
)