
(footprint PQFN50P300X250X97-14N (layer F.Cu) (tedit 6564A6B8)
  (descr "")
  (attr smd)
  (fp_text reference REF** (at -0.684 -1.9032 0) (layer F.SilkS)
    (effects (font (size 0.32 0.32) (thickness 0.15)))
  )
  (fp_text value PQFN50P300X250X97-14N (at 2.5672 2.0968 0) (layer F.Fab)
    (effects (font (size 0.32 0.32) (thickness 0.15)))
  )
  (pad 5 smd roundrect (roundrect_rratio 0.09) (at -0.5 0.91 90.0) (size 0.61 0.35) (layers F.Cu F.Mask F.Paste) (solder_mask_margin 0.102))
  (pad 6 smd roundrect (roundrect_rratio 0.09) (at 0.0 0.91 90.0) (size 0.61 0.35) (layers F.Cu F.Mask F.Paste) (solder_mask_margin 0.102))
  (pad 7 smd roundrect (roundrect_rratio 0.09) (at 0.5 0.91 90.0) (size 0.61 0.35) (layers F.Cu F.Mask F.Paste) (solder_mask_margin 0.102))
  (pad 8 smd roundrect (roundrect_rratio 0.09) (at 1.16 0.75 180.0) (size 0.61 0.35) (layers F.Cu F.Mask F.Paste) (solder_mask_margin 0.102))
  (pad 9 smd roundrect (roundrect_rratio 0.09) (at 1.16 0.25 180.0) (size 0.61 0.35) (layers F.Cu F.Mask F.Paste) (solder_mask_margin 0.102))
  (pad 10 smd roundrect (roundrect_rratio 0.09) (at 1.16 -0.25 180.0) (size 0.61 0.35) (layers F.Cu F.Mask F.Paste) (solder_mask_margin 0.102))
  (pad 11 smd roundrect (roundrect_rratio 0.09) (at 1.16 -0.75 180.0) (size 0.61 0.35) (layers F.Cu F.Mask F.Paste) (solder_mask_margin 0.102))
  (pad 12 smd roundrect (roundrect_rratio 0.09) (at 0.5 -0.91 270.0) (size 0.61 0.35) (layers F.Cu F.Mask F.Paste) (solder_mask_margin 0.102))
  (pad 13 smd roundrect (roundrect_rratio 0.09) (at 0.0 -0.91 270.0) (size 0.61 0.35) (layers F.Cu F.Mask F.Paste) (solder_mask_margin 0.102))
  (pad 14 smd roundrect (roundrect_rratio 0.09) (at -0.5 -0.91 270.0) (size 0.61 0.35) (layers F.Cu F.Mask F.Paste) (solder_mask_margin 0.102))
  (pad 1 smd roundrect (roundrect_rratio 0.09) (at -1.16 -0.75) (size 0.61 0.35) (layers F.Cu F.Mask F.Paste) (solder_mask_margin 0.102))
  (pad 2 smd roundrect (roundrect_rratio 0.09) (at -1.16 -0.25) (size 0.61 0.35) (layers F.Cu F.Mask F.Paste) (solder_mask_margin 0.102))
  (pad 3 smd roundrect (roundrect_rratio 0.09) (at -1.16 0.25) (size 0.61 0.35) (layers F.Cu F.Mask F.Paste) (solder_mask_margin 0.102))
  (pad 4 smd roundrect (roundrect_rratio 0.09) (at -1.16 0.75) (size 0.61 0.35) (layers F.Cu F.Mask F.Paste) (solder_mask_margin 0.102))
  (fp_line (start -1.5 1.25) (end -1.5 -1.25) (layer F.Fab) (width 0.127))
  (fp_line (start -1.5 -1.25) (end 1.5 -1.25) (layer F.Fab) (width 0.127))
  (fp_line (start 1.5 -1.25) (end 1.5 1.25) (layer F.Fab) (width 0.127))
  (fp_line (start 1.5 1.25) (end -1.5 1.25) (layer F.Fab) (width 0.127))
  (fp_line (start -1.5 -1.1) (end -1.5 -1.25) (layer F.SilkS) (width 0.127))
  (fp_line (start -1.5 -1.25) (end -0.85 -1.25) (layer F.SilkS) (width 0.127))
  (fp_line (start 0.85 -1.25) (end 1.5 -1.25) (layer F.SilkS) (width 0.127))
  (fp_line (start 1.5 -1.25) (end 1.5 -1.1) (layer F.SilkS) (width 0.127))
  (fp_line (start 1.5 1.1) (end 1.5 1.25) (layer F.SilkS) (width 0.127))
  (fp_line (start 1.5 1.25) (end 0.85 1.25) (layer F.SilkS) (width 0.127))
  (fp_line (start -1.5 1.1) (end -1.5 1.25) (layer F.SilkS) (width 0.127))
  (fp_line (start -1.5 1.25) (end -0.85 1.25) (layer F.SilkS) (width 0.127))
  (fp_line (start -1.72 1.47) (end -1.72 -1.47) (layer F.CrtYd) (width 0.05))
  (fp_line (start -1.72 -1.47) (end 1.72 -1.47) (layer F.CrtYd) (width 0.05))
  (fp_line (start 1.72 -1.47) (end 1.72 1.47) (layer F.CrtYd) (width 0.05))
  (fp_line (start 1.72 1.47) (end -1.72 1.47) (layer F.CrtYd) (width 0.05))
  (fp_circle (center -2.0 -0.8) (end -1.9 -0.8) (layer F.SilkS) (width 0.2))
  (fp_circle (center -2.0 -0.8) (end -1.9 -0.8) (layer F.Fab) (width 0.2))
)