^C:\USERS\FEZSI\DOCUMENTS\VISUAL STUDIO 2015\PROJECTS\STELLARISMODMANAGER\STELLARISMODMANAGER\GENERATEDFILES\DEBUG\MOC_STELLARISMODMANAGER.CPP|C:\USERS\FEZSI\DOCUMENTS\VISUAL STUDIO 2015\PROJECTS\STELLARISMODMANAGER\STELLARISMODMANAGER\MAIN.CPP|C:\USERS\FEZSI\DOCUMENTS\VISUAL STUDIO 2015\PROJECTS\STELLARISMODMANAGER\STELLARISMODMANAGER\STELLARISMODMANAGER.CPP
C:\USERS\FEZSI\DOCUMENTS\VISUAL STUDIO 2015\PROJECTS\STELLARISMODMANAGER\STELLARISMODMANAGER\X64\DEBUG\VC140.PDB
C:\USERS\FEZSI\DOCUMENTS\VISUAL STUDIO 2015\PROJECTS\STELLARISMODMANAGER\STELLARISMODMANAGER\X64\DEBUG\STELLARISMODMANAGER.OBJ
C:\USERS\FEZSI\DOCUMENTS\VISUAL STUDIO 2015\PROJECTS\STELLARISMODMANAGER\STELLARISMODMANAGER\X64\DEBUG\MAIN.OBJ
C:\USERS\FEZSI\DOCUMENTS\VISUAL STUDIO 2015\PROJECTS\STELLARISMODMANAGER\STELLARISMODMANAGER\X64\DEBUG\MOC_STELLARISMODMANAGER.OBJ
^C:\USERS\FEZSI\DOCUMENTS\VISUAL STUDIO 2015\PROJECTS\STELLARISMODMANAGER\STELLARISMODMANAGER\GENERATEDFILES\DEBUG\MOC_STELLARISMODMANAGER.CPP
C:\USERS\FEZSI\DOCUMENTS\VISUAL STUDIO 2015\PROJECTS\STELLARISMODMANAGER\STELLARISMODMANAGER\X64\DEBUG\VC140.PDB
^C:\USERS\FEZSI\DOCUMENTS\VISUAL STUDIO 2015\PROJECTS\STELLARISMODMANAGER\STELLARISMODMANAGER\MAIN.CPP
C:\USERS\FEZSI\DOCUMENTS\VISUAL STUDIO 2015\PROJECTS\STELLARISMODMANAGER\STELLARISMODMANAGER\X64\DEBUG\VC140.PDB
^C:\USERS\FEZSI\DOCUMENTS\VISUAL STUDIO 2015\PROJECTS\STELLARISMODMANAGER\STELLARISMODMANAGER\STELLARISMODMANAGER.CPP
C:\USERS\FEZSI\DOCUMENTS\VISUAL STUDIO 2015\PROJECTS\STELLARISMODMANAGER\STELLARISMODMANAGER\X64\DEBUG\VC140.PDB
^C:\USERS\FEZSI\DOCUMENTS\VISUAL STUDIO 2015\PROJECTS\STELLARISMODMANAGER\STELLARISMODMANAGER\GENERATEDFILES\QRC_STELLARISMODMANAGER.CPP
C:\USERS\FEZSI\DOCUMENTS\VISUAL STUDIO 2015\PROJECTS\STELLARISMODMANAGER\STELLARISMODMANAGER\X64\DEBUG\VC140.PDB
C:\USERS\FEZSI\DOCUMENTS\VISUAL STUDIO 2015\PROJECTS\STELLARISMODMANAGER\STELLARISMODMANAGER\X64\DEBUG\QRC_STELLARISMODMANAGER.OBJ
