{
	"queryStringParameters":{
        "clientId": "ClientId-0003",
        "userId": "a91ca2c5-716e-495b-a620-97955730d5e2",
        "contact_number": "9083423423",
        "email": "thisclient@yahoo.com",
        "location": "Metropolitan",
        "concern": "Problem with regard to Tax Law",
        "meetingDate": "11-13-2020",
        "timeslot": "WED13:00-14:00"
        

	}
}