// Jest Snapshot v1, https://goo.gl/fbAQLP

exports[`EmployeeGrid Should compare the component with a snapshot 1`] = `
<div
  style={Object {}}
>
  <div
    className="sc-bwzfXH hbZeap"
  >
    <div
      className="sc-bdVaJa cTBdUC"
    >
      <img
        src={undefined}
      />
    </div>
    <div
      className="sc-bdVaJa dbYzFY"
    >
      <h3>
         
      </h3>
      <p>
        
      </p>
    </div>
  </div>
</div>
`;
