{
  "id": "centered_text",
  "type": "SharedSlice",
  "name": "CenteredText",
  "description": "CenteredText",
  "variations": [
    {
      "id": "default",
      "name": "Default",
      "docURL": "...",
      "version": "sktwi1xtmkfgx8626",
      "description": "CenteredText",
      "primary": {
        "title": {
          "type": "StructuredText",
          "config": {
            "single": "heading1",
            "label": "Title",
            "placeholder": "This is where it all begins..."
          }
        },
        "description": {
          "type": "StructuredText",
          "config": {
            "single": "paragraph",
            "label": "Description",
            "placeholder": "A nice description of your feature"
          }
        }
      },
      "imageUrl": "https://images.prismic.io/slice-machine/621a5ec4-0387-4bc5-9860-2dd46cbc07cd_default_ss.png?auto=compress,format",
      "items": {}
    }
  ]
}