%YAML 1.1
%TAG !u! tag:unity3d.com,2011:
--- !u!114 &11400000
MonoBehaviour:
  m_ObjectHideFlags: 0
  m_CorrespondingSourceObject: {fileID: 0}
  m_PrefabInstance: {fileID: 0}
  m_PrefabAsset: {fileID: 0}
  m_GameObject: {fileID: 0}
  m_Enabled: 1
  m_EditorHideFlags: 0
  m_Script: {fileID: 11500000, guid: c7b0a3414f1bee34e88fa28bd2189ecc, type: 3}
  m_Name: First Responder
  m_EditorClassIdentifier: 
  Value: 0
  icon: {fileID: 0}
  title: 
  description: 
  money: 3
  reputation: 3
  morale: 5
  empathy: 8
  greetings:
  - available:
      _useConstant: 1
      ConstantValue: 1
      Variable: {fileID: 0}
    graph: {fileID: 11400000, guid: c536ebf25e0e11446ac083c24f3d5f14, type: 2}
    priority: 0
    hasPlayed: 0
  questions:
  - available:
      _useConstant: 1
      ConstantValue: 1
      Variable: {fileID: 0}
    graph: {fileID: 11400000, guid: 9ccbfb94ffb1ef94a90617eeea172e1c, type: 2}
    priority: 0
    hasPlayed: 0
  outro:
  - available:
      _useConstant: 1
      ConstantValue: 1
      Variable: {fileID: 0}
    graph: {fileID: 11400000, guid: 7e20463a507590c4e9e59602b3d06983, type: 2}
    priority: 0
    hasPlayed: 0
  memories: []
