%YAML 1.1
%TAG !u! tag:unity3d.com,2011:
--- !u!114 &11400000
MonoBehaviour:
  m_ObjectHideFlags: 0
  m_CorrespondingSourceObject: {fileID: 0}
  m_PrefabInstance: {fileID: 0}
  m_PrefabAsset: {fileID: 0}
  m_GameObject: {fileID: 0}
  m_Enabled: 1
  m_EditorHideFlags: 0
  m_Script: {fileID: 11500000, guid: 1e444c55647ad1f4abed4329c35327aa, type: 3}
  m_Name: Laughing
  m_EditorClassIdentifier: 
  motion: {fileID: 1827226128182048838, guid: 17a48d918cf75e74aa527c89697f3d15, type: 3}
