module gitlab.com/sean.dever/source_code_test

go 1.22.2

require (
	github.com/DataDog/appsec-internal-go v1.6.0 // indirect
	github.com/DataDog/datadog-agent/pkg/obfuscate v0.48.0 // indirect
	github.com/DataDog/datadog-agent/pkg/remoteconfig/state v0.48.1 // indirect
	github.com/DataDog/datadog-go/v5 v5.3.0 // indirect
	github.com/DataDog/go-libddwaf/v3 v3.2.1 // indirect
	github.com/DataDog/go-tuf v1.0.2-0.5.2 // indirect
	github.com/DataDog/sketches-go v1.4.5 // indirect
	github.com/Microsoft/go-winio v0.6.1 // indirect
	github.com/cespare/xxhash/v2 v2.2.0 // indirect
	github.com/dustin/go-humanize v1.0.1 // indirect
	github.com/eapache/queue/v2 v2.0.0-20230407133247-75960ed334e4 // indirect
	github.com/ebitengine/purego v0.6.0-alpha.5 // indirect
	github.com/google/uuid v1.5.0 // indirect
	github.com/gorilla/mux v1.8.0 // indirect
	github.com/hashicorp/go-secure-stdlib/parseutil v0.1.7 // indirect
	github.com/hashicorp/go-secure-stdlib/strutil v0.1.2 // indirect
	github.com/hashicorp/go-sockaddr v1.0.2 // indirect
	github.com/mitchellh/mapstructure v1.5.0 // indirect
	github.com/outcaste-io/ristretto v0.2.3 // indirect
	github.com/philhofer/fwd v1.1.2 // indirect
	github.com/pkg/errors v0.9.1 // indirect
	github.com/ryanuber/go-glob v1.0.0 // indirect
	github.com/secure-systems-lab/go-securesystemslib v0.7.0 // indirect
	github.com/tinylib/msgp v1.1.8 // indirect
	go.uber.org/atomic v1.11.0 // indirect
	golang.org/x/mod v0.12.0 // indirect
	golang.org/x/sys v0.20.0 // indirect
	golang.org/x/time v0.3.0 // indirect
	golang.org/x/tools v0.12.1-0.20230815132531-74c255bcf846 // indirect
	golang.org/x/xerrors v0.0.0-20220907171357-04be3eba64a2 // indirect
	google.golang.org/protobuf v1.33.0 // indirect
	gopkg.in/DataDog/dd-trace-go.v1 v1.65.1 // indirect
)
