<?xml version="1.0" encoding="UTF-8" standalone="no"?>
<!-- Created with Inkscape (http://www.inkscape.org/) -->

<svg
   xmlns:dc="http://purl.org/dc/elements/1.1/"
   xmlns:cc="http://creativecommons.org/ns#"
   xmlns:rdf="http://www.w3.org/1999/02/22-rdf-syntax-ns#"
   xmlns:svg="http://www.w3.org/2000/svg"
   xmlns="http://www.w3.org/2000/svg"
   xmlns:sodipodi="http://sodipodi.sourceforge.net/DTD/sodipodi-0.dtd"
   xmlns:inkscape="http://www.inkscape.org/namespaces/inkscape"
   width="210mm"
   height="297mm"
   viewBox="0 0 210 297"
   version="1.1"
   id="svg1120"
   inkscape:export-filename="F:\infoooo00oo0o\testjavascript\images\bolCircle.png"
   inkscape:export-xdpi="13.475697"
   inkscape:export-ydpi="13.475697"
   inkscape:version="0.92.4 (5da689c313, 2019-01-14)"
   sodipodi:docname="bolCircle.svg">
  <defs
     id="defs1114" />
  <sodipodi:namedview
     id="base"
     pagecolor="#ffffff"
     bordercolor="#666666"
     borderopacity="1.0"
     inkscape:pageopacity="0.0"
     inkscape:pageshadow="2"
     inkscape:zoom="0.7"
     inkscape:cx="-40.144268"
     inkscape:cy="619.64379"
     inkscape:document-units="mm"
     inkscape:current-layer="layer1"
     showgrid="false"
     showborder="false"
     showguides="true"
     inkscape:guide-bbox="true"
     inkscape:window-width="1920"
     inkscape:window-height="1001"
     inkscape:window-x="-9"
     inkscape:window-y="-9"
     inkscape:window-maximized="1">
    <sodipodi:guide
       position="9.0871639,159.82718"
       orientation="1,0"
       id="guide1194"
       inkscape:locked="false" />
  </sodipodi:namedview>
  <metadata
     id="metadata1117">
    <rdf:RDF>
      <cc:Work
         rdf:about="">
        <dc:format>image/svg+xml</dc:format>
        <dc:type
           rdf:resource="http://purl.org/dc/dcmitype/StillImage" />
        <dc:title />
      </cc:Work>
    </rdf:RDF>
  </metadata>
  <g
     inkscape:groupmode="layer"
     id="layer3"
     inkscape:label="Calque 2">
    <g
       id="layer1-9"
       inkscape:label="Calque 1"
       transform="translate(-96.830011,-28.32515)">
      <g
         transform="translate(-25.059094,-49.866948)"
         id="g967">
        <g
           transform="translate(241.90476,15.119048)"
           id="layer2"
           inkscape:label="Calque 2"
           style="display:inline">
          <path
             style="opacity:1;fill:#a96625;fill-opacity:1;stroke:#000000;stroke-width:3.84320903;stroke-miterlimit:4;stroke-dasharray:none;stroke-dashoffset:0;stroke-opacity:0.98431373"
             d="m 9.3166504,181.04256 c -3e-7,24.81307 -11.078976,47.4962 -29.3872924,64.88069 -9.123821,8.66344 -10.926809,10.99009 -23.587703,15.60286 -6.411015,2.33574 -36.835412,-4.81795 -58.160395,-4.81795 -15.55322,0 -44.50515,8.83195 -58.80555,7.70463 -17.35732,-1.36829 -21.50042,-2.42003 -32.4403,-10.79716 -23.62949,-18.0941 -38.27673,-44.64776 -38.27673,-73.30806 0,-8.56301 1.81669,-16.73353 3.80012,-24.7978 0,0 0.0472,-1.55915 1.98327,-5.65437 1.62418,-3.43557 -7.94092,14.06039 111.64003,15.08895 125.94049,1.08327 115.5209388,-21.02228 117.5478958,-14.77713 2.836424,8.73916 0.734608,1.98274 2.4584478,7.98321 2.1110495,7.3483 3.2282069,15.01283 3.2282068,22.89213 z"
             id="path818"
             inkscape:connector-curvature="0"
             sodipodi:nodetypes="sssssssssssss" />
        </g>
        <g
           transform="translate(241.90476,15.119048)"
           inkscape:label="Calque 1"
           id="layer1-0"
           style="display:inline;fill:none">
          <path
             sodipodi:nodetypes="sssss"
             inkscape:connector-curvature="0"
             id="path815"
             d="m 3.0238037,149.2113 c 1.63e-5,8.55877 -51.1061437,15.69748 -114.1488037,15.69748 -63.04266,0 -114.14882,-7.13871 -114.1488,-15.69748 0,0 -2.18858,15.5836 114.1488,15.68601 C 5.2121904,164.99972 3.0238037,149.2113 3.0238037,149.2113 Z"
             style="opacity:1;fill:none;fill-opacity:1;stroke:#000000;stroke-width:3.5999999;stroke-miterlimit:4;stroke-dasharray:none;stroke-dashoffset:0;stroke-opacity:0.98431373" />
        </g>
        <g
           transform="translate(241.90476,15.119048)"
           id="layer3-2"
           inkscape:label="Calque 3"
           style="display:inline">
          <ellipse
             ry="15.786157"
             rx="78.949806"
             cy="254.23688"
             cx="-111.197"
             id="ellipse824"
             style="opacity:1;fill:#a96625;fill-opacity:1;stroke:#000000;stroke-width:3.02173519;stroke-miterlimit:4;stroke-dasharray:none;stroke-dashoffset:0;stroke-opacity:0.98431373" />
          <ellipse
             style="opacity:1;fill:#a96625;fill-opacity:1;stroke:none;stroke-width:3.74234796;stroke-miterlimit:4;stroke-dasharray:none;stroke-dashoffset:0;stroke-opacity:0.98431373"
             id="path861"
             cx="-111.24562"
             cy="242.60023"
             rx="86.621613"
             ry="25.926535" />
        </g>
      </g>
    </g>
  </g>
  <g
     inkscape:label="Calque 1"
     inkscape:groupmode="layer"
     id="layer1">
    <g
       id="layer1-7"
       inkscape:label="Calque 1"
       transform="matrix(0.29374272,0,0,0.29374272,-29.828004,97.492329)">
      <circle
         r="121.70833"
         cy="192.67856"
         cx="132.29166"
         id="path1110"
         style="opacity:1;fill:#1fada9;fill-opacity:1;stroke:#000000;stroke-width:3.5999999;stroke-miterlimit:4;stroke-dasharray:none;stroke-dashoffset:0;stroke-opacity:0.98431373" />
    </g>
  </g>
</svg>
