<?xml version="1.0" encoding="UTF-8" standalone="no"?>
<svg
   xmlns:dc="http://purl.org/dc/elements/1.1/"
   xmlns:cc="http://creativecommons.org/ns#"
   xmlns:rdf="http://www.w3.org/1999/02/22-rdf-syntax-ns#"
   xmlns:svg="http://www.w3.org/2000/svg"
   xmlns="http://www.w3.org/2000/svg"
   xmlns:xlink="http://www.w3.org/1999/xlink"
   xmlns:sodipodi="http://sodipodi.sourceforge.net/DTD/sodipodi-0.dtd"
   xmlns:inkscape="http://www.inkscape.org/namespaces/inkscape"
   inkscape:version="1.0 (4035a4fb49, 2020-05-01)"
   sodipodi:docname="chess-26774.svg"
   id="svg26"
   version="1.1"
   viewBox="0 0 1052.3621875 375">
  <metadata
     id="metadata32">
    <rdf:RDF>
      <cc:Work
         rdf:about="">
        <dc:format>image/svg+xml</dc:format>
        <dc:type
           rdf:resource="http://purl.org/dc/dcmitype/StillImage" />
      </cc:Work>
    </rdf:RDF>
  </metadata>
  <defs
     id="defs30" />
  <sodipodi:namedview
     inkscape:current-layer="svg26"
     inkscape:window-maximized="1"
     inkscape:window-y="-9"
     inkscape:window-x="-9"
     inkscape:cy="260.02206"
     inkscape:cx="297.44574"
     inkscape:zoom="5.6568543"
     showgrid="false"
     id="namedview28"
     inkscape:window-height="1001"
     inkscape:window-width="1920"
     inkscape:pageshadow="2"
     inkscape:pageopacity="0"
     guidetolerance="10"
     gridtolerance="10"
     objecttolerance="10"
     borderopacity="1"
     bordercolor="#666666"
     pagecolor="#ffffff" />
  <path
     style="fill:#ac3c5d;fill-opacity:1"
     d="m 758.74,110.36 c 2.1516,0 4.4324,-1.248 6.8423,-3.7439 1.291,-1.291 1.9365,-2.4099 1.9365,-3.3566 0,-1.1189 -1.0328,-1.6783 -3.0984,-1.6783 -2.4098,0 -4.4324,1.0758 -6.0677,3.2275 -0.86069,1.0328 -1.291,2.1086 -1.291,3.2275 0,1.5492 0.55942,2.3238 1.6783,2.3238 m -2.1947,-28.273 c 0.17214,0 0.60246,-0.04304 1.291,-0.12911 3.873,0 8.0042,1.291 12.394,3.873 l 0.77461,0.51639 c 2.4959,-4.0451 4.3894,-6.0677 5.6804,-6.0677 2.7541,1.5492 4.5616,3.2275 5.4222,5.0349 0.43034,0.86068 1.0758,2.6681 1.9365,5.4222 0.68853,-0.17215 1.3771,-0.25819 2.0656,-0.25819 7.2296,0 14.115,4.4324 20.656,13.297 7.8321,10.242 11.748,24.185 11.748,41.828 0,3.9591 -0.17213,7.5308 -0.51639,10.715 h -54.48 c 0.17215,-5.7665 2.2808,-11.232 6.3259,-16.396 0.43034,-0.68853 1.0328,-1.4631 1.8074,-2.3238 3.1845,-4.0451 5.121,-7.1435 5.8095,-9.2952 0.34426,-1.1188 0.60246,-2.2808 0.7746,-3.4857 -5.6804,2.2377 -9.9407,5.5513 -12.781,9.9407 -1.291,2.1516 -2.7111,4.3894 -4.2603,6.7132 -0.43034,0.68854 -1.0758,1.0328 -1.9365,1.0328 -2.1517,0 -3.2275,-1.334 -3.2275,-4.0021 -0.86069,1.1189 -1.8504,1.6783 -2.9693,1.6783 l -2.582,-0.6455 c -3.7009,-0.94675 -6.3259,-2.582 -7.8751,-4.9058 -0.51639,-0.77459 -1.0758,-1.8074 -1.6783,-3.0984 0.60248,-3.7009 3.5718,-11.06 8.9079,-22.076 3.873,-7.9181 6.2829,-13.599 7.2296,-17.041 0.0861,-0.7746 0.12909,-1.8934 0.12909,-3.3566 0,-1.2049 -0.21517,-3.5287 -0.6455,-6.9714 m -7.746,45.314 c -2.0656,0 -3.4427,0.90369 -4.1312,2.7111 -0.17213,0.43033 -0.2582,0.86066 -0.2582,1.291 0,0.34426 0.12909,0.7746 0.3873,1.291 2.2377,0 3.6148,-0.94673 4.1312,-2.8402 0.0861,-0.2582 0.12911,-0.55945 0.12911,-0.9037 0,-0.17214 -0.0861,-0.68853 -0.2582,-1.5492 m 63.388,19.881 v -4.7767 c 0,-14.029 -3.5718,-25.519 -10.715,-34.47 -6.1968,-7.746 -11.834,-11.619 -16.912,-11.619 l -1.5492,-0.2582 c -0.17213,0.08606 -0.30124,0.17213 -0.38731,0.2582 -1.1188,0 -1.6783,0.47336 -1.6783,1.4201 0,0.34428 0.2582,0.77461 0.77459,1.291 4.6476,0.43032 9.7255,3.7439 15.234,9.9407 6.9714,8.0902 10.457,19.795 10.457,35.115 v 0.77461 c 0,3.7869 0.81762,5.6804 2.4529,5.6804 1.3771,0 2.1517,-1.1189 2.3238,-3.3566"
     id="path1030" />
  <path
     style="fill:#793cac;fill-opacity:1"
     d="m 605.39,126.5 c -4.3895,0 -6.5842,0.68853 -6.5841,2.0656 -1.2e-4,1.2049 1.9364,1.9365 5.8095,2.1947 h 7.1005 c 8.6065,0 12.91,-0.73158 12.91,-2.1947 -1.2e-4,-1.3771 -2.1948,-2.0656 -6.5841,-2.0656 h -12.652 m 0,-8.0042 c -3.787,0 -5.8957,0.43035 -6.3259,1.291 -0.17224,0.17215 -0.25832,0.43034 -0.2582,0.77461 -1.2e-4,0.94673 0.90359,1.5062 2.7111,1.6783 2.2376,0.25819 5.6373,0.3873 10.199,0.3873 4.5617,0 8.0041,-0.12911 10.328,-0.3873 1.7212,-0.17214 2.5819,-0.73157 2.582,-1.6783 -1.2e-4,-1.3771 -2.1948,-2.0656 -6.5841,-2.0656 h -12.652 m 24.013,5.5513 2.582,9.9407 c -10e-5,3.0123 -3.0555,4.7767 -9.1661,5.2931 4.4754,1.7213 8.6496,2.582 12.523,2.582 0.51631,0 3.0553,-0.12911 7.6169,-0.38731 3.7868,0 6.8852,1.9795 9.2952,5.9386 0.34416,0.68852 0.77451,1.4631 1.291,2.3238 l -4.6476,7.1005 c -1.3772,1.7213 -2.8403,2.8402 -4.3894,3.3566 -0.34439,-1.8074 -3.0985,-2.9262 -8.2624,-3.3566 l -3.0984,-0.25819 c -10.586,-0.86066 -17.73,-3.1414 -21.431,-6.8423 -3.3567,3.5287 -8.4777,5.5513 -15.363,6.0677 -1.5492,0.17215 -3.5718,0.43034 -6.0677,0.77461 -6.2829,0.51639 -9.9407,1.4201 -10.973,2.7111 -0.17214,0.25819 -0.30125,0.55943 -0.38731,0.90369 -2.2377,-0.94673 -4.3464,-3.0984 -6.3259,-6.455 -0.77461,-1.3771 -1.6783,-2.7111 -2.7111,-4.0021 2.3238,-4.3033 4.8197,-6.8853 7.4878,-7.746 0.94676,-0.34427 1.9795,-0.5164 3.0984,-0.5164 l 7.6169,0.38731 c 3.959,0 8.1333,-0.86068 12.523,-2.582 -6.1107,-0.51639 -9.1661,-2.2808 -9.1661,-5.2931 0,-0.25819 0.68853,-2.4529 2.0656,-6.5841 0.43032,-1.3771 0.6455,-2.3238 0.6455,-2.8402 -5.2501,-6.3689 -7.8751,-12.006 -7.8751,-16.912 0,-5.6804 2.7972,-10.844 8.3915,-15.492 4.9918,-4.2173 8.6066,-6.455 10.844,-6.7132 -1.8936,-2.3238 -2.8403,-4.7337 -2.8402,-7.2296 -10e-5,-4.0451 2.0225,-6.541 6.0677,-7.4878 0.94662,-0.2581 1.9364,-0.38718 2.9693,-0.38729 4.3032,1.1e-4 7.1004,1.5922 8.3915,4.7767 l 0.6455,2.7111 v 0.3873 c -10e-5,2.4099 -0.94684,4.8197 -2.8402,7.2296 1.6352,0.43033 4.088,1.7644 7.3587,4.0021 7.918,5.5082 11.877,11.576 11.877,18.203 -10e-5,4.9919 -2.5821,10.457 -7.746,16.396 m -15.363,-12.006 v -5.9386 h 4.5185 v -4.9058 h -4.5185 v -5.5513 h -4.6476 v 5.5513 h -4.5185 v 4.9058 h 4.5185 v 5.9386 h 4.6476 m -2.3238,-36.406 c -1.7214,0 -2.7973,0.77458 -3.2275,2.3238 l -0.12908,0.77458 c -1.1e-4,1.6353 0.86055,2.6681 2.582,3.0984 0.25809,0.08607 0.51629,0.12909 0.77461,0.12909 2.1515,0 3.2274,-1.0758 3.2275,-3.2275 -1.1e-4,-2.0656 -1.076,-3.0984 -3.2275,-3.0984"
     id="path1026" />
  <path
     style="fill:#72ac3c;fill-opacity:1"
     d="m 414.87,156.32 -2.4529,-2.4529 v -9.1661 l 13.039,-12.91 V 106.1 l -10.07,-9.9407 v -11.49 l 3.6148,-3.6148 h 9.1661 l 2.3238,2.1947 v 3.2275 h 4.9058 v -3.2275 l 2.1947,-2.1947 h 14.33 l 2.1947,2.1947 v 3.2275 h 4.9058 v -3.2275 l 2.1947,-2.1947 h 9.2952 l 3.6148,3.6148 v 11.49 l -10.07,9.9407 v 25.691 l 13.039,12.91 v 9.1661 l -2.582,2.4529 h -59.644 m 15.234,-27.498 v 4.3894 h 29.306 v -4.3894 h -29.306 m 0,-23.238 v 4.3894 h 29.306 v -4.3894 h -29.306"
     id="path1022" />
  <path
     style="fill:#3fad8e;fill-opacity:1"
     d="m 254.43,142.89 c 0,1.3771 0.98976,2.0656 2.9693,2.0656 l 8.9079,-0.6455 7.746,-0.3873 h 1.9365 l 15.105,0.77461 3.0984,0.25819 c 1.9794,0 2.9692,-0.68853 2.9693,-2.0656 -10e-5,-2.4959 -5.7666,-3.873 -17.299,-4.1312 h -4.0021 c -9.7256,0 -16.224,0.73158 -19.494,2.1947 -1.291,0.51641 -1.9365,1.1619 -1.9365,1.9365 m -16.137,-53.964 c -1.6353,0 -2.6681,0.81765 -3.0984,2.4529 -0.0861,0.2582 -0.12911,0.51639 -0.12911,0.77461 0,1.6353 0.81765,2.6681 2.4529,3.0984 0.25819,0.08607 0.51639,0.12911 0.7746,0.12911 2.0656,0 3.0984,-1.0758 3.0984,-3.2275 0,-2.1517 -1.0328,-3.2275 -3.0984,-3.2275 m 16.912,-8.1333 c -2.2377,0 -3.3566,1.0758 -3.3566,3.2275 0,2.1517 1.1188,3.2275 3.3566,3.2275 2.0656,0 3.0984,-1.0758 3.0984,-3.2275 0,-2.1517 -1.0328,-3.2275 -3.0984,-3.2275 m 41.183,0 c -1.4632,0 -2.453,0.73158 -2.9693,2.1947 l -0.12911,1.0328 c -1e-4,2.1517 1.0327,3.2275 3.0984,3.2275 2.1516,0 3.2274,-1.0758 3.2275,-3.2275 10e-5,-2.1517 -1.0759,-3.2275 -3.2275,-3.2275 m 16.783,8.1333 c -2.0657,0 -3.0985,1.0758 -3.0984,3.2275 1e-4,2.1517 1.0327,3.2275 3.0984,3.2275 2.1516,0 3.2274,-1.0758 3.2275,-3.2275 -1.3e-4,-1.6353 -0.81775,-2.6681 -2.4529,-3.0984 -0.2583,-0.08607 -0.51651,-0.12911 -0.7746,-0.12911 m -9.2952,61.71 c -1.1e-4,2.4099 -4.4325,4.0882 -13.297,5.0349 l -12.523,0.77458 h -2.3238 c -10.5,0 -18.504,-0.90369 -24.013,-2.7111 -2.6681,-0.77461 -4.0021,-1.8074 -4.0021,-3.0984 0,-2.4959 0.68853,-5.3361 2.0656,-8.5206 0.94673,-1.8935 1.4201,-3.2275 1.4201,-4.0021 0,-1.6353 -1.9795,-4.8198 -5.9386,-9.5534 -2.1517,-2.4959 -3.3996,-4.2173 -3.7439,-5.164 0,-0.51639 -0.2582,-1.6783 -0.77461,-3.4857 l -1.6783,-6.455 c -1.1188,-4.2173 -1.8504,-8.6927 -2.1947,-13.426 -3.9591,-1.6353 -5.9386,-4.2603 -5.9386,-7.8751 0,-3.0984 1.4201,-5.2931 4.2603,-6.5841 0.94673,-0.43035 1.9795,-0.64552 3.0984,-0.64552 2.8402,0 4.9488,1.291 6.3259,3.873 0.60248,1.1188 0.90371,2.2377 0.90371,3.3566 l -0.6455,4.9058 c 0,3.873 2.7541,8.6067 8.2624,14.201 0.43032,-3.5287 0.6455,-7.2296 0.6455,-11.103 0,-5.7664 -1.0328,-9.4243 -3.0984,-10.973 -0.17213,-0.17215 -0.34428,-0.30123 -0.51639,-0.3873 -1.5492,-0.94674 -2.3238,-2.625 -2.3238,-5.0349 0,-3.1845 1.4631,-5.3792 4.3894,-6.5841 0.94675,-0.43033 1.9365,-0.6455 2.9693,-0.6455 3.0123,0 5.164,1.3771 6.455,4.1312 0.51639,0.94675 0.77448,1.9795 0.7746,3.0984 l -0.90371,5.5513 c 0,4.8197 2.3667,12.178 7.1005,22.076 1.8073,-8.0903 2.711,-14.287 2.7111,-18.59 -1e-4,-3.6148 -0.64562,-6.9284 -1.9365,-9.9407 -0.51652,-1.1189 -0.77471,-1.9795 -0.77461,-2.582 -10e-5,-3.1845 1.42,-5.3792 4.2603,-6.5841 0.94662,-0.43032 1.9364,-0.6455 2.9693,-0.6455 3.0122,0 5.1208,1.4201 6.3259,4.2603 0.43022,0.94673 0.6454,1.9365 0.6455,2.9693 -1e-4,0.17213 -0.73167,2.4529 -2.1947,6.8423 -0.34439,1.1188 -0.51651,3.0123 -0.51641,5.6804 -10e-5,4.3033 0.90359,10.5 2.7111,18.59 4.6475,-9.8116 6.9713,-17.17 6.9714,-22.076 l -0.7746,-5.4222 v -0.12911 c -1.2e-4,-3.1845 1.463,-5.3792 4.3894,-6.5841 0.94662,-0.43033 1.9364,-0.6455 2.9693,-0.6455 3.0122,0 5.1639,1.3771 6.455,4.1312 0.51629,0.94675 0.77449,1.9795 0.77459,3.0984 -1e-4,2.4099 -0.77471,4.1312 -2.3238,5.164 -2.41,1.5492 -3.6149,5.3361 -3.6148,11.361 -10e-5,3.7869 0.21505,7.4448 0.6455,10.974 5.5081,-5.5943 8.2623,-10.328 8.2624,-14.201 l -0.6455,-4.9058 c -1e-4,-3.0123 1.377,-5.164 4.1312,-6.455 0.94662,-0.51639 1.9794,-0.7746 3.0984,-0.7746 3.0983,0 5.293,1.3771 6.5841,4.1312 l 0.7746,2.4529 v 0.6455 c -1e-4,3.4426 -1.9796,6.0677 -5.9386,7.8751 -0.51651,5.9386 -1.9796,13.211 -4.3894,21.818 -0.17223,0.68854 -0.25831,1.2049 -0.2582,1.5492 -1.1e-4,0.60247 -0.64561,1.5922 -1.9365,2.9693 l -1.5492,1.9365 c -4.1313,4.7337 -6.1969,8.0042 -6.1968,9.8116 -10e-5,0.51639 1.0327,3.1845 3.0984,8.0042 0.34417,1.7213 0.51628,3.2275 0.51639,4.5185 m -28.015,-73.845 c -1.6354,0 -2.6682,0.81764 -3.0984,2.4529 -0.0862,0.2582 -0.12919,0.51639 -0.12908,0.77459 -1.1e-4,1.6353 0.81751,2.6681 2.4529,3.0984 0.25809,0.08607 0.51631,0.12911 0.77461,0.12911 2.0655,0 3.0983,-1.0758 3.0984,-3.2275 -1.2e-4,-1.5492 -0.73167,-2.582 -2.1947,-3.0984 -0.2583,-0.08606 -0.55953,-0.1291 -0.90369,-0.1291 m 23.238,50.349 c -10e-5,-2.7541 -7.7461,-4.1312 -23.238,-4.1312 -15.578,0 -23.367,1.4201 -23.367,4.2603 0,1.2049 1.1188,1.8074 3.3566,1.8074 2.582,0 5.8095,-0.21516 9.6825,-0.6455 l 8.3915,-0.25819 h 2.0656 c 2.4097,0 6.9713,0.21515 13.685,0.6455 l 6.3259,0.25819 c 2.0655,0 3.0983,-0.6455 3.0984,-1.9365"
     id="path1018" />
  <path
     style="fill:#ffffff;fill-opacity:1"
     d="m 111.54,124.05 c 0,1.5492 -1.0758,2.3238 -3.2275,2.3238 -2.4099,0 -3.6148,-0.77459 -3.6148,-2.3238 0,-7.1435 -2.3668,-12.953 -7.1005,-17.428 -4.2173,-3.7869 -8.3054,-5.6804 -12.264,-5.6804 -5.8525,0 -9.5104,2.3238 -10.973,6.9714 l -0.5164,3.4857 v 0.2582 c 0,3.4426 2.539,8.2194 7.6169,14.33 1.3771,1.5492 2.539,2.7541 3.4857,3.6148 1.3771,1.1188 3.6578,1.6783 6.8423,1.6783 3.3566,0 8.7788,-0.6455 16.267,-1.9365 7.5739,1.291 13.039,1.9365 16.396,1.9365 3.2705,0 5.5513,-0.55943 6.8423,-1.6783 3.6148,-3.1845 6.6271,-7.0575 9.037,-11.619 1.3771,-2.582 2.0656,-4.6906 2.0656,-6.3259 0,-5.4222 -2.4529,-8.8218 -7.3587,-10.199 -1.291,-0.34427 -2.6681,-0.51641 -4.1312,-0.51641 -3.959,0 -8.0042,1.9365 -12.135,5.8095 -4.8197,4.3033 -7.2296,10.07 -7.2296,17.299 m 28.015,-12.394 c 0,3.4426 -2.3668,7.4878 -7.1005,12.135 l -3.3566,2.8402 -1.291,0.77458 c -1.6353,0.2582 -3.3566,0.3873 -5.164,0.3873 -5.3361,0 -8.0042,-1.0758 -8.0042,-3.2275 0.17213,-6.6271 2.1517,-11.791 5.9386,-15.492 3.2705,-3.2706 6.6271,-4.9058 10.07,-4.9058 4.3894,0 7.1866,1.5922 8.3915,4.7767 l 0.51641,2.7111 m -12.264,32.791 c 0,-2.2377 -6.3259,-3.3566 -18.978,-3.3566 -3.4427,0 -6.498,0.12909 -9.1661,0.3873 l -3.0984,0.2582 c -4.6476,0.60247 -6.9714,1.4631 -6.9714,2.582 0,1.291 1.1619,1.9365 3.4857,1.9365 l 15.621,-1.291 15.492,1.291 c 2.4098,0 3.6148,-0.60246 3.6148,-1.8074 m 7.2296,3.0984 c -0.17214,5.8525 -8.9509,8.7788 -26.336,8.7788 -17.213,0 -25.949,-2.9263 -26.207,-8.7788 -0.08607,-5.5083 -0.9037,-10.414 -2.4529,-14.717 -0.94673,-2.3238 -2.7541,-5.2931 -5.4222,-8.9079 -3.3566,-4.5615 -5.0349,-8.6067 -5.0349,-12.135 0,-5.5083 2.3668,-9.7686 7.1005,-12.781 2.6681,-1.7213 5.6374,-2.582 8.9079,-2.582 4.4755,0 8.7358,1.6353 12.781,4.9058 0,-3.9591 0.3873,-6.6702 1.1619,-8.1333 0.60246,-1.6353 2.582,-3.6148 5.9386,-5.9386 v -2.9693 l -5.2931,-3.2275 v -4.6476 h 4.7767 l 1.5492,-4.7767 h 4.3894 l 1.6783,4.7767 h 4.6476 v 4.6476 l -5.164,3.2275 v 2.9693 c 3.2705,2.4099 5.2931,4.4755 6.0677,6.1968 l 0.9037,3.7439 c 0.0861,1.0328 0.17214,2.4099 0.2582,4.1312 4.0451,-3.2705 8.2194,-4.9058 12.523,-4.9058 5.7664,0 10.242,2.1947 13.426,6.5841 1.8074,2.582 2.7111,5.5083 2.7111,8.7788 0,3.5287 -1.6783,7.6169 -5.0349,12.264 l -2.9693,4.1312 c -3.1844,4.8197 -4.8197,11.275 -4.9058,19.365 m -57.708,-35.89 c 0,-3.6148 1.8074,-5.9386 5.4222,-6.9714 1.0328,-0.34428 2.1086,-0.51641 3.2275,-0.51641 3.6148,0 7.0575,1.6353 10.328,4.9058 3.7009,3.7869 5.6374,8.9509 5.8095,15.492 0.0861,1.8935 -1.8935,2.9693 -5.9386,3.2275 h -1.9365 c -1.7213,0 -3.4857,-0.1291 -5.2931,-0.3873 -2.8402,-1.3771 -5.6804,-4.0882 -8.5206,-8.1333 -2.0656,-3.0123 -3.0984,-5.5513 -3.0984,-7.6169"
     id="path857" />
  <g
     inkscape:export-ydpi="158.92102"
     inkscape:export-xdpi="158.92102"
     id="g1052">
    <path
       style="fill:#ffffff;fill-opacity:1"
       sodipodi:type="inkscape:offset"
       inkscape:radius="3.1032958"
       inkscape:original="M 105.99219 71.634766 L 104.44336 76.412109 L 99.666016 76.412109 L 99.666016 81.058594 L 104.95898 84.287109 L 104.95898 87.255859 C 101.60238 89.579659 99.623944 91.560012 99.021484 93.195312 C 98.246884 94.658412 97.859375 97.369025 97.859375 101.32812 C 93.814175 98.057625 89.553625 96.421875 85.078125 96.421875 C 81.807625 96.421875 78.838022 97.282606 76.169922 99.003906 C 71.436222 102.01631 69.070312 106.27686 69.070312 111.78516 C 69.070312 115.31346 70.746916 119.35842 74.103516 123.91992 C 76.771616 127.53472 78.580614 130.50432 79.527344 132.82812 C 81.076544 137.13113 81.894399 142.03662 81.980469 147.54492 C 82.238469 153.39742 90.972547 156.32422 108.18555 156.32422 C 125.57065 156.32422 134.3513 153.39742 134.52344 147.54492 C 134.60954 139.45492 136.24529 132.99939 139.42969 128.17969 L 142.39844 124.04883 C 145.75504 119.40173 147.43359 115.31386 147.43359 111.78516 C 147.43359 108.51466 146.53006 105.58786 144.72266 103.00586 C 141.53866 98.616459 137.06328 96.421875 131.29688 96.421875 C 126.99328 96.421875 122.81854 98.057625 118.77344 101.32812 C 118.68738 99.606825 118.60173 98.230066 118.51562 97.197266 L 117.61133 93.453125 C 116.83673 91.731825 114.81347 89.665759 111.54297 87.255859 L 111.54297 84.287109 L 116.70703 81.058594 L 116.70703 76.412109 L 112.06055 76.412109 L 110.38086 71.634766 L 105.99219 71.634766 z M 85.333984 100.94141 C 89.292584 100.94141 93.380356 102.83419 97.597656 106.62109 C 102.33136 111.09609 104.69727 116.90728 104.69727 124.05078 C 104.69727 125.59999 105.9026 126.37305 108.3125 126.37305 C 110.4642 126.37305 111.53906 125.59998 111.53906 124.05078 L 111.54297 124.05078 C 111.54297 116.82178 113.95178 111.0533 118.77148 106.75 C 122.90228 102.877 126.94725 100.94141 130.90625 100.94141 C 132.36935 100.94141 133.74611 101.11276 135.03711 101.45703 C 139.94291 102.83423 142.39648 106.23405 142.39648 111.65625 C 142.39648 113.29155 141.70718 115.40042 140.33008 117.98242 C 137.92018 122.54392 134.90972 126.41706 131.29492 129.60156 C 130.00392 130.72043 127.72167 131.2793 124.45117 131.2793 C 121.09417 131.2793 115.63054 130.63475 108.05664 129.34375 C 100.56844 130.63475 95.145663 131.2793 91.789062 131.2793 C 88.604563 131.2793 86.324366 130.72036 84.947266 129.60156 C 84.000566 128.74086 82.838037 127.53553 81.460938 125.98633 C 76.383038 119.87573 73.84375 115.09885 73.84375 111.65625 L 73.84375 111.39844 L 74.359375 107.91211 C 75.821975 103.26451 79.481484 100.94141 85.333984 100.94141 z M 85.464844 104.16797 C 84.345944 104.16797 83.271081 104.33931 82.238281 104.68359 C 78.623481 105.71639 76.814453 108.0395 76.814453 111.6543 C 76.814453 113.7199 77.848462 116.25918 79.914062 119.27148 C 82.754262 123.31658 85.593394 126.0272 88.433594 127.4043 C 90.240994 127.6625 92.005263 127.79297 93.726562 127.79297 L 95.664062 127.79297 C 99.709162 127.53477 101.68766 126.45795 101.60156 124.56445 C 101.42946 118.02335 99.493869 112.85917 95.792969 109.07227 C 92.522469 105.80177 89.079644 104.16797 85.464844 104.16797 z M 130.64844 104.16797 C 127.20554 104.16797 123.85058 105.80362 120.58008 109.07422 C 116.79318 112.77522 114.81275 117.93931 114.64062 124.56641 C 114.64062 126.71811 117.30843 127.79297 122.64453 127.79297 C 124.45193 127.79297 126.17329 127.66445 127.80859 127.40625 L 129.09961 126.63086 L 132.45703 123.79102 C 137.19073 119.14382 139.55664 115.09885 139.55664 111.65625 L 139.04102 108.94531 C 137.83612 105.76081 135.03784 104.16797 130.64844 104.16797 z M 108.31445 141.08984 C 120.96655 141.08984 127.29297 142.20957 127.29297 144.44727 C 127.29297 145.65221 126.08753 146.25391 123.67773 146.25391 L 108.18555 144.96289 L 92.564453 146.25391 C 90.240653 146.25391 89.080078 145.60741 89.080078 144.31641 C 89.080078 143.19751 91.403181 142.3388 96.050781 141.73633 L 99.148438 141.47656 C 101.81654 141.21835 104.87175 141.08984 108.31445 141.08984 z "
       xlink:href="#path857"
       id="path859"
       inkscape:href="#path857"
       d="m 105.99219,68.53125 a 3.1036061,3.1036061 0 0 0 -2.95117,2.146484 l -0.85352,2.63086 H 99.666016 A 3.1036061,3.1036061 0 0 0 96.5625,76.412109 v 4.646485 a 3.1036061,3.1036061 0 0 0 1.488281,2.648437 l 3.613279,2.205078 c -2.530618,1.876257 -4.490262,3.652907 -5.421872,5.953125 -0.618103,1.20313 -0.998278,2.503775 -1.208985,4.007813 -3.170001,-1.62127 -6.507486,-2.554688 -9.955078,-2.554688 -3.811983,0 -7.430247,1.042909 -10.582031,3.074219 -5.451405,3.47284 -8.529297,8.998992 -8.529297,15.392582 0,4.51139 2.053436,9.10505 5.636719,13.97461 a 3.1036061,3.1036061 0 0 0 0.0039,0.004 c 2.561701,3.47065 4.232594,6.27413 5.015625,8.17383 1.400122,3.91103 2.172561,8.45036 2.253906,13.65625 a 3.1036061,3.1036061 0 0 0 0.0039,0.0879 c 0.09793,2.22139 1.118713,4.36555 2.714844,5.92383 1.596132,1.55828 3.667788,2.63764 6.142578,3.4668 4.949581,1.65832 11.664876,2.35546 20.447269,2.35546 8.86669,0 15.63268,-0.69593 20.60547,-2.35351 2.48639,-0.82879 4.56503,-1.90646 6.1621,-3.47266 1.59708,-1.56619 2.60627,-3.73433 2.67188,-5.96484 a 3.1036061,3.1036061 0 0 0 0.002,-0.0586 c 0.0818,-7.68502 1.64027,-13.51599 4.38867,-17.67968 0.002,-0.002 0.002,-0.005 0.004,-0.008 l 2.89453,-4.02539 0.004,-0.004 c 3.57281,-4.94754 5.61914,-9.56474 5.61914,-14.07617 0,-3.84206 -1.11091,-7.47207 -3.27149,-10.5586 a 3.1036061,3.1036061 0 0 0 -0.0312,-0.043 c -3.70688,-5.110226 -9.38373,-7.865231 -15.9375,-7.865231 -3.40634,0 -6.72209,0.962302 -9.89063,2.632813 l -0.7793,-3.226563 a 3.1036061,3.1036061 0 0 0 -0.18554,-0.544921 c -1.02791,-2.284196 -3.04688,-4.200552 -5.66211,-6.257813 l 3.57226,-2.232422 a 3.1036061,3.1036061 0 0 0 1.45899,-2.630859 v -4.646485 a 3.1036061,3.1036061 0 0 0 -3.10352,-3.103515 h -2.44726 l -0.95118,-2.703125 a 3.1036061,3.1036061 0 0 0 -2.92773,-2.074219 z m -24.607424,33.16797 c -0.02731,0.008 -0.04893,0.0252 -0.07617,0.0332 -0.01633,0.005 -0.03447,0.002 -0.05078,0.008 z m 23.316404,22.72461 0.002,0.0586 c -4.4e-4,-0.017 -0.005,-0.0319 -0.006,-0.0488 -1.5e-4,-0.003 0.004,-0.006 0.004,-0.01 z" />
    <path
       d="m111.54 124.05c0 1.5492-1.0758 2.3238-3.2275 2.3238-2.4099 0-3.6148-0.77459-3.6148-2.3238 0-7.1435-2.3668-12.953-7.1005-17.428-4.2173-3.7869-8.3054-5.6804-12.264-5.6804-5.8525 0-9.5104 2.3238-10.973 6.9714l-0.5164 3.4857v0.2582c0 3.4426 2.539 8.2194 7.6169 14.33 1.3771 1.5492 2.539 2.7541 3.4857 3.6148 1.3771 1.1188 3.6578 1.6783 6.8423 1.6783 3.3566 0 8.7788-0.6455 16.267-1.9365 7.5739 1.291 13.039 1.9365 16.396 1.9365 3.2705 0 5.5513-0.55943 6.8423-1.6783 3.6148-3.1845 6.6271-7.0575 9.037-11.619 1.3771-2.582 2.0656-4.6906 2.0656-6.3259 0-5.4222-2.4529-8.8218-7.3587-10.199-1.291-0.34427-2.6681-0.51641-4.1312-0.51641-3.959 0-8.0042 1.9365-12.135 5.8095-4.8197 4.3033-7.2296 10.07-7.2296 17.299m28.015-12.394c0 3.4426-2.3668 7.4878-7.1005 12.135l-3.3566 2.8402-1.291 0.77458c-1.6353 0.2582-3.3566 0.3873-5.164 0.3873-5.3361 0-8.0042-1.0758-8.0042-3.2275 0.17213-6.6271 2.1517-11.791 5.9386-15.492 3.2705-3.2706 6.6271-4.9058 10.07-4.9058 4.3894 0 7.1866 1.5922 8.3915 4.7767l0.51641 2.7111m-12.264 32.791c0-2.2377-6.3259-3.3566-18.978-3.3566-3.4427 0-6.498 0.12909-9.1661 0.3873l-3.0984 0.2582c-4.6476 0.60247-6.9714 1.4631-6.9714 2.582 0 1.291 1.1619 1.9365 3.4857 1.9365l15.621-1.291 15.492 1.291c2.4098 0 3.6148-0.60246 3.6148-1.8074m7.2296 3.0984c-0.17214 5.8525-8.9509 8.7788-26.336 8.7788-17.213 0-25.949-2.9263-26.207-8.7788-0.08607-5.5083-0.9037-10.414-2.4529-14.717-0.94673-2.3238-2.7541-5.2931-5.4222-8.9079-3.3566-4.5615-5.0349-8.6067-5.0349-12.135 0-5.5083 2.3668-9.7686 7.1005-12.781 2.6681-1.7213 5.6374-2.582 8.9079-2.582 4.4755 0 8.7358 1.6353 12.781 4.9058 0-3.9591 0.3873-6.6702 1.1619-8.1333 0.60246-1.6353 2.582-3.6148 5.9386-5.9386v-2.9693l-5.2931-3.2275v-4.6476h4.7767l1.5492-4.7767h4.3894l1.6783 4.7767h4.6476v4.6476l-5.164 3.2275v2.9693c3.2705 2.4099 5.2931 4.4755 6.0677 6.1968l0.9037 3.7439c0.08608 1.0328 0.17214 2.4099 0.2582 4.1312 4.0451-3.2705 8.2194-4.9058 12.523-4.9058 5.7664 0 10.242 2.1947 13.426 6.5841 1.8074 2.582 2.7111 5.5083 2.7111 8.7788 0 3.5287-1.6783 7.6169-5.0349 12.264l-2.9693 4.1312c-3.1844 4.8197-4.8197 11.275-4.9058 19.365m-57.708-35.89c0-3.6148 1.8074-5.9386 5.4222-6.9714 1.0328-0.34428 2.1086-0.51641 3.2275-0.51641 3.6148 0 7.0575 1.6353 10.328 4.9058 3.7009 3.7869 5.6374 8.9509 5.8095 15.492 0.08607 1.8935-1.8935 2.9693-5.9386 3.2275h-1.9365c-1.7213 0-3.4857-0.1291-5.2931-0.3873-2.8402-1.3771-5.6804-4.0882-8.5206-8.1333-2.0656-3.0123-3.0984-5.5513-3.0984-7.6169"
       id="path2" />
  </g>
  <g
     id="g1056">
    <path
       style="fill:#ffffff;fill-opacity:1"
       sodipodi:type="inkscape:offset"
       inkscape:radius="3.1819806"
       inkscape:original="M 275.86133 73.046875 C 274.82843 73.046875 273.8392 73.263039 272.89258 73.693359 C 270.05228 74.898259 268.63271 77.092844 268.63281 80.277344 C 268.63271 80.879844 268.88973 81.740475 269.40625 82.859375 C 270.69713 85.871675 271.34365 89.185981 271.34375 92.800781 C 271.34365 97.103781 270.44011 103.30033 268.63281 111.39062 C 263.89901 101.49262 261.53125 94.134153 261.53125 89.314453 L 262.43555 83.761719 C 262.43543 82.642819 262.17655 81.610812 261.66016 80.664062 C 260.36916 77.909962 258.21738 76.533203 255.20508 76.533203 C 254.17228 76.533203 253.18308 76.747404 252.23633 77.177734 C 249.31003 78.382634 247.84766 80.577219 247.84766 83.761719 C 247.84766 86.171619 248.62072 87.850135 250.16992 88.796875 C 250.34203 88.882945 250.51537 89.013397 250.6875 89.185547 C 252.7531 90.734247 253.78516 94.391803 253.78516 100.1582 C 253.78516 104.0316 253.57094 107.73302 253.14062 111.26172 C 247.63233 105.66742 244.87695 100.93355 244.87695 97.060547 L 245.52344 92.154297 C 245.52344 91.035397 245.22162 89.915675 244.61914 88.796875 C 243.24204 86.214875 241.13317 84.923828 238.29297 84.923828 C 237.17407 84.923828 236.14204 85.139962 235.19531 85.570312 C 232.35511 86.861313 230.93555 89.055897 230.93555 92.154297 C 230.93555 95.769097 232.91395 98.393997 236.87305 100.0293 C 237.21735 104.7626 237.94956 109.23778 239.06836 113.45508 L 240.74609 119.91016 C 241.2625 121.71756 241.52148 122.88009 241.52148 123.39648 C 241.86578 124.34318 243.11392 126.06465 245.26562 128.56055 C 249.22473 133.29415 251.20312 136.47798 251.20312 138.11328 C 251.20312 138.88788 250.72993 140.22173 249.7832 142.11523 C 248.40613 145.29973 247.7168 148.14082 247.7168 150.63672 C 247.7168 151.92772 249.0526 152.95977 251.7207 153.73438 C 257.2297 155.54178 265.23242 156.44531 275.73242 156.44531 L 278.05664 156.44531 L 290.58008 155.67188 C 299.44458 154.72518 303.87684 153.04662 303.87695 150.63672 C 303.87684 149.34572 303.70355 147.84044 303.35938 146.11914 C 301.29367 141.29944 300.26162 138.63162 300.26172 138.11523 C 300.26162 136.30783 302.32768 133.03643 306.45898 128.30273 L 308.00781 126.36719 C 309.2987 124.99009 309.94325 123.99895 309.94336 123.39648 C 309.94325 123.05218 310.02894 122.5362 310.20117 121.84766 C 312.61097 113.24066 314.07529 105.9679 314.5918 100.0293 C 318.5508 98.221897 320.5292 95.596897 320.5293 92.154297 L 320.5293 91.509766 L 319.75586 89.056641 C 318.46476 86.302541 316.27017 84.925781 313.17188 84.925781 C 312.05288 84.925781 311.01889 85.182829 310.07227 85.699219 C 307.31807 86.990219 305.94131 89.141997 305.94141 92.154297 L 306.58789 97.060547 C 306.58779 100.93355 303.83232 105.66742 298.32422 111.26172 C 297.89377 107.73252 297.67959 104.07401 297.67969 100.28711 C 297.67959 94.262209 298.88492 90.474981 301.29492 88.925781 C 302.84401 87.892981 303.61709 86.171619 303.61719 83.761719 C 303.61709 82.642819 303.36004 81.610812 302.84375 80.664062 C 301.55265 77.909962 299.40087 76.533203 296.38867 76.533203 C 295.35577 76.533203 294.36654 76.747404 293.41992 77.177734 C 290.49352 78.382634 289.02918 80.577219 289.0293 83.761719 L 289.0293 83.892578 L 289.80469 89.314453 C 289.80459 94.220453 287.47953 101.57903 282.83203 111.39062 C 281.02452 103.30063 280.12099 97.104081 280.12109 92.800781 C 280.12099 90.132681 280.29428 88.237941 280.63867 87.119141 C 282.1017 82.729741 282.83193 80.449474 282.83203 80.277344 C 282.83193 79.244544 282.61772 78.255324 282.1875 77.308594 C 280.9824 74.468394 278.87353 73.046875 275.86133 73.046875 z M 275.86133 76.792969 C 276.20549 76.792969 276.50732 76.835815 276.76562 76.921875 C 278.22866 77.438275 278.95886 78.470331 278.95898 80.019531 C 278.95888 82.171231 277.92683 83.248047 275.86133 83.248047 C 275.60303 83.248047 275.34403 83.203258 275.08594 83.117188 C 273.45055 82.686887 272.6327 81.654831 272.63281 80.019531 C 272.6327 79.761331 272.67747 79.504294 272.76367 79.246094 C 273.19387 77.610834 274.22593 76.792969 275.86133 76.792969 z M 255.20508 80.792969 C 257.27068 80.792969 258.30469 81.867831 258.30469 84.019531 C 258.30469 86.171231 257.27068 87.248047 255.20508 87.248047 C 252.96728 87.248047 251.84961 86.171231 251.84961 84.019531 C 251.84961 81.867831 252.96738 80.792969 255.20508 80.792969 z M 296.38867 80.792969 C 298.54027 80.792969 299.61729 81.867831 299.61719 84.019531 C 299.61709 86.171231 298.54027 87.248047 296.38867 87.248047 C 294.32297 87.248047 293.29092 86.171231 293.29102 84.019531 L 293.41992 82.988281 C 293.93622 81.525161 294.92547 80.792969 296.38867 80.792969 z M 238.29297 88.925781 C 240.35857 88.925781 241.39258 90.002597 241.39258 92.154297 C 241.39258 94.305997 240.35857 95.380859 238.29297 95.380859 C 238.03476 95.380859 237.77772 95.338023 237.51953 95.251953 C 235.88428 94.821653 235.06641 93.789597 235.06641 92.154297 C 235.06641 91.896077 235.10921 91.637106 235.19531 91.378906 C 235.62561 89.743656 236.65767 88.925781 238.29297 88.925781 z M 313.17188 88.925781 C 313.42997 88.925781 313.68897 88.968617 313.94727 89.054688 C 315.58242 89.484988 316.39831 90.518997 316.39844 92.154297 C 316.39834 94.305997 315.32347 95.380859 313.17188 95.380859 C 311.10617 95.380859 310.07432 94.305997 310.07422 92.154297 C 310.07412 90.002597 311.10618 88.925781 313.17188 88.925781 z M 275.86133 123.00977 C 291.35323 123.00977 299.09951 124.38653 299.09961 127.14062 C 299.09951 128.43162 298.06745 129.07812 296.00195 129.07812 L 289.67578 128.82031 C 282.96208 128.38996 278.39993 128.17383 275.99023 128.17383 L 273.92383 128.17383 L 265.5332 128.43164 C 261.6602 128.86198 258.43356 129.07812 255.85156 129.07812 C 253.61376 129.07813 252.49414 128.47443 252.49414 127.26953 C 252.49414 124.42933 260.28333 123.00977 275.86133 123.00977 z M 275.86133 138.75977 L 279.86328 138.75977 C 291.39568 139.01797 297.16201 140.39472 297.16211 142.89062 C 297.16201 144.26769 296.17276 144.95508 294.19336 144.95508 L 291.09375 144.69727 L 275.99023 143.92188 L 274.05273 143.92188 L 266.30664 144.31055 L 257.39844 144.95508 C 255.4189 144.95508 254.42969 144.26773 254.42969 142.89062 L 254.43164 142.89062 C 254.43164 142.11603 255.07619 141.46954 256.36719 140.95312 C 259.63719 139.49 266.13573 138.75977 275.86133 138.75977 z "
       xlink:href="#path1018"
       id="path1020"
       inkscape:href="#path1018"
       d="m 275.86133,69.865234 c -1.46601,0 -2.92049,0.322706 -4.25391,0.923828 -3.74147,1.609919 -6.15638,5.375238 -6.15625,9.488282 -2.5e-4,1.507935 0.458,2.598072 1.06641,3.916015 l -0.0352,-0.08008 c 1.10955,2.58915 1.6796,5.452052 1.67969,8.6875 -5e-5,1.933869 -0.21799,4.425898 -0.65625,7.431639 -1.65265,-4.576865 -2.74744,-8.455773 -2.77539,-10.767576 l 0.8457,-5.191406 a 3.1822988,3.1822988 0 0 0 0.041,-0.511719 c -1.7e-4,-1.574207 -0.39002,-3.138335 -1.125,-4.523438 -1.71163,-3.568183 -5.33591,-5.886718 -9.28711,-5.886719 -1.45604,0 -2.9041,0.322207 -4.23633,0.919922 -3.80365,1.596 -6.30273,5.354323 -6.30273,9.490235 0,0.127007 0.0348,0.250064 0.0391,0.376953 -1.80979,-1.469714 -4.02838,-2.396484 -6.41211,-2.396484 -1.52867,0 -3.03965,0.30688 -4.41406,0.93164 -3.71327,1.687852 -6.125,5.410167 -6.125,9.480469 0,4.125023 2.45386,7.647237 6.14453,9.812503 0.39927,4.27455 1.05773,8.39487 2.08984,12.28906 l 0.004,0.0117 c 3.2e-4,0.001 -3.2e-4,0.003 0,0.004 l 1.67383,6.43946 a 3.1822988,3.1822988 0 0 0 0.0215,0.0742 c 0.4946,1.73105 0.65234,3.15882 0.65234,2.61132 a 3.1822988,3.1822988 0 0 0 0.19141,1.0879 c 0.76068,2.09159 2.08907,3.56158 4.29297,6.11718 1.92165,2.29758 3.33088,4.19161 4.1914,5.57617 0.86053,1.38457 1.00586,2.40109 1.00586,1.93555 0,-0.52128 -0.2149,0.83992 -1.08398,2.57813 a 3.1822988,3.1822988 0 0 0 -0.0742,0.16015 c -1.49718,3.46226 -2.32812,6.70338 -2.32812,9.78516 0,1.74297 1.06156,3.3512 2.23632,4.25976 1.16676,0.90237 2.48809,1.42971 4.03516,1.88086 6.07091,1.97747 14.28514,2.84961 24.92578,2.84961 h 2.32422 a 3.1822988,3.1822988 0 0 0 0.19531,-0.006 l 12.52344,-0.77343 a 3.1822988,3.1822988 0 0 0 0.14258,-0.0117 c 4.57402,-0.48849 8.07387,-1.13841 10.76172,-2.15625 1.34392,-0.50892 2.51134,-1.09965 3.52343,-2.03321 1.0121,-0.93355 1.8554,-2.43193 1.85547,-4.00976 -1.3e-4,-1.57553 -0.20428,-3.27095 -0.57812,-5.14063 a 3.1822988,3.1822988 0 0 0 -0.19727,-0.63086 c -1.0247,-2.39081 -1.78807,-4.24038 -2.27929,-5.50976 -0.23426,-0.60536 -0.39768,-1.06045 -0.49805,-1.36524 0.0204,0.147 0.15728,-0.65623 0.99609,-1.98437 0.89161,-1.41174 2.35386,-3.32009 4.35352,-5.61133 a 3.1822988,3.1822988 0 0 0 0.0879,-0.10351 l 1.54883,-1.93555 -0.16211,0.1875 c 0.72522,-0.77366 1.31303,-1.47188 1.79687,-2.21485 0.48385,-0.74296 0.99779,-1.49598 0.99805,-2.93164 a 3.1822988,3.1822988 0 0 0 0,-0.002 c 6e-5,0.18467 0.0204,-0.20886 0.16211,-0.77539 2.23373,-7.99141 3.58966,-14.77709 4.22851,-20.66406 3.71314,-2.249771 6.1952,-5.72584 6.19532,-9.800783 v -0.644531 a 3.1822988,3.1822988 0 0 0 -0.14649,-0.957032 l -0.77343,-2.453125 a 3.1822988,3.1822988 0 0 0 -0.1543,-0.394531 c -1.70634,-3.639853 -5.42392,-5.960937 -9.46484,-5.960937 -1.57113,0 -3.13607,0.385835 -4.5254,1.123047 -0.7048,0.338078 -1.3272,0.789914 -1.92578,1.265624 0.004,-0.128952 0.0781,-0.241915 0.0781,-0.371093 -1.4e-4,-1.57232 -0.38757,-3.138759 -1.125,-4.527344 -1.71223,-3.566683 -5.33496,-5.882813 -9.28516,-5.882813 -1.45609,0 -2.90408,0.322116 -4.23633,0.919922 -3.80331,1.595786 -6.30484,5.352963 -6.30468,9.490235 v 0.130859 a 3.1822988,3.1822988 0 0 0 0.0312,0.451172 l 0.72851,5.099609 c -0.023,2.357664 -1.069,6.188971 -2.66015,10.691411 -0.42762,-2.957056 -0.64458,-5.423383 -0.64454,-7.333989 -9e-5,-2.527162 0.24136,-4.297299 0.37696,-4.740234 0.71953,-2.159323 1.26692,-3.824941 1.63476,-4.972656 0.18631,-0.581306 0.32671,-1.031307 0.42969,-1.376953 0.0515,-0.172824 0.0939,-0.317696 0.13281,-0.466797 0.039,-0.149102 0.13606,0.179545 0.13672,-0.964844 a 3.1822988,3.1822988 0 0 0 0,-0.002 c -1.4e-4,-1.461907 -0.32144,-2.917285 -0.92383,-4.253906 -1.58837,-3.691046 -5.23241,-6.158204 -9.22851,-6.158204 z m -0.0254,10.035157 c -0.12461,0.09869 -0.26187,0.07422 0.0254,0.07422 0.0185,0 -0.0297,-0.0084 -0.0234,-0.0078 -0.004,0.0047 0.0517,-0.108868 -0.002,-0.06641 z m -0.0527,0.130859 c -5.4e-4,0.02644 0.007,-0.01106 0.006,0.01172 0.0156,0.01153 -0.0797,-0.037 -0.0488,0.002 0.0567,0.07162 0.0396,-0.01081 0.043,-0.01367 z m 20.77735,3.818359 c -0.0829,-0.08282 -0.0341,0.09516 -0.0488,0.06641 l 0.004,-0.0332 c -0.0368,-0.02137 0.10069,0.02251 0.0449,-0.0332 z m -41.52735,0.08008 c 0.005,0.0013 -0.0328,0.04148 0.1211,0.03125 0.007,0.06352 -0.0312,-0.09677 -0.0312,0.05859 0,0.158281 0.0384,-0.0028 0.0312,0.06055 -0.15358,-0.01019 -0.11616,0.02991 -0.1211,0.03125 -0.002,-0.04666 -0.002,-0.01966 -0.002,-0.0918 0,-0.07059 3.5e-4,-0.04374 0.002,-0.08984 z m 41.41407,0.002 -0.0274,0.115234 c 0.0307,-0.08691 -0.0261,-0.03308 -0.0273,-0.07617 0.16128,0.0013 0.0107,-0.04367 0.0547,-0.03906 z m 0.01,0.117187 c -0.002,0.03377 0.0156,-0.0039 0.0137,0.01758 l -0.004,0.05664 c -0.008,-1.1e-4 0.0123,-0.02934 -0.0352,-0.02539 -0.005,-0.03299 0.03,0.03892 0.0254,-0.04883 z m 0.0332,0.04492 c -0.002,0.03127 -0.0494,0.217389 0.0703,0.09766 0.0933,-0.0933 -0.0938,-0.04445 -0.0762,-0.05469 z m -47.85742,7.519531 a 3.1822988,3.1822988 0 0 0 0.14649,0.117188 c 0.54875,0.411435 1.82422,3.041007 1.82422,8.427731 0,0.96709 -0.13265,1.81697 -0.16016,2.75977 -1.55755,-2.4145 -2.34562,-4.417575 -2.36914,-5.773439 l 0.60351,-4.574219 a 3.1822988,3.1822988 0 0 0 0.0274,-0.416015 c 0,-0.182806 -0.0614,-0.358955 -0.0723,-0.541016 z m 54.14649,0.402344 c -6.7e-4,0.04747 -0.0195,0.09111 -0.0195,0.138672 a 3.1822988,3.1822988 0 0 0 0.0273,0.416015 l 0.60351,4.574219 c -0.0236,1.357332 -0.8139,3.363159 -2.375,5.781249 -0.0257,-0.89663 -0.15432,-1.72501 -0.15429,-2.63867 -9e-5,-5.125459 1.09259,-7.462567 1.91797,-8.271485 z m -64.51172,0.01758 c -0.01,0.0078 0.0117,-4.55e-4 0.002,0.0059 -1.5e-4,2e-6 -0.002,0.0037 -0.002,0.0039 -0.007,0.0059 0.008,-0.01592 0,-0.0098 z m 75.02148,0.0918 c -0.0531,-0.06717 -0.0346,0.02079 -0.0391,0.01563 7.2e-4,-0.03113 -0.009,0.01225 -0.008,-0.01367 -0.016,-0.0119 0.0771,0.03633 0.0469,-0.002 z m -75.07226,0.04102 c -5.5e-4,0.0267 0.007,-0.01121 0.006,0.01172 0.0156,0.01153 -0.0797,-0.03698 -0.0488,0.002 0.0567,0.07159 0.0395,-0.01076 0.043,-0.01367 z m 75.02343,0.01953 c -0.0155,0.249363 -0.0717,0.311928 0.10157,0.138672 0.15632,-0.156323 0.0343,-0.105752 -0.125,-0.0918 -0.004,-0.03173 0.0281,0.03511 0.0234,-0.04687 z" />
    <path
       d="m254.43 142.89c0 1.3771 0.98976 2.0656 2.9693 2.0656l8.9079-0.6455 7.746-0.3873h1.9365l15.105 0.77461 3.0984 0.25819c1.9794 0 2.9692-0.68853 2.9693-2.0656-1e-4 -2.4959-5.7666-3.873-17.299-4.1312h-4.0021c-9.7256 0-16.224 0.73158-19.494 2.1947-1.291 0.51641-1.9365 1.1619-1.9365 1.9365m-16.137-53.964c-1.6353 0-2.6681 0.81765-3.0984 2.4529-0.08607 0.2582-0.12911 0.51639-0.12911 0.77461 0 1.6353 0.81765 2.6681 2.4529 3.0984 0.25819 0.08607 0.51639 0.12911 0.7746 0.12911 2.0656 0 3.0984-1.0758 3.0984-3.2275s-1.0328-3.2275-3.0984-3.2275m16.912-8.1333c-2.2377 0-3.3566 1.0758-3.3566 3.2275s1.1188 3.2275 3.3566 3.2275c2.0656 0 3.0984-1.0758 3.0984-3.2275s-1.0328-3.2275-3.0984-3.2275m41.183 0c-1.4632 0-2.453 0.73158-2.9693 2.1947l-0.12911 1.0328c-1e-4 2.1517 1.0327 3.2275 3.0984 3.2275 2.1516 0 3.2274-1.0758 3.2275-3.2275s-1.0759-3.2275-3.2275-3.2275m16.783 8.1333c-2.0657 0-3.0985 1.0758-3.0984 3.2275s1.0327 3.2275 3.0984 3.2275c2.1516 0 3.2274-1.0758 3.2275-3.2275-1.3e-4 -1.6353-0.81775-2.6681-2.4529-3.0984-0.2583-0.08607-0.51651-0.12911-0.7746-0.12911m-9.2952 61.71c-1.1e-4 2.4099-4.4325 4.0882-13.297 5.0349l-12.523 0.77458h-2.3238c-10.5 0-18.504-0.90369-24.013-2.7111-2.6681-0.77461-4.0021-1.8074-4.0021-3.0984 0-2.4959 0.68853-5.3361 2.0656-8.5206 0.94673-1.8935 1.4201-3.2275 1.4201-4.0021 0-1.6353-1.9795-4.8198-5.9386-9.5534-2.1517-2.4959-3.3996-4.2173-3.7439-5.164 0-0.51639-0.2582-1.6783-0.77461-3.4857l-1.6783-6.455c-1.1188-4.2173-1.8504-8.6927-2.1947-13.426-3.9591-1.6353-5.9386-4.2603-5.9386-7.8751 0-3.0984 1.4201-5.2931 4.2603-6.5841 0.94673-0.43035 1.9795-0.64552 3.0984-0.64552 2.8402 0 4.9488 1.291 6.3259 3.873 0.60248 1.1188 0.90371 2.2377 0.90371 3.3566l-0.6455 4.9058c0 3.873 2.7541 8.6067 8.2624 14.201 0.43032-3.5287 0.6455-7.2296 0.6455-11.103 0-5.7664-1.0328-9.4243-3.0984-10.973-0.17213-0.17215-0.34428-0.30123-0.51639-0.3873-1.5492-0.94674-2.3238-2.625-2.3238-5.0349 0-3.1845 1.4631-5.3792 4.3894-6.5841 0.94675-0.43033 1.9365-0.6455 2.9693-0.6455 3.0123 0 5.164 1.3771 6.455 4.1312 0.51639 0.94675 0.77448 1.9795 0.7746 3.0984l-0.90371 5.5513c0 4.8197 2.3667 12.178 7.1005 22.076 1.8073-8.0903 2.711-14.287 2.7111-18.59-1e-4 -3.6148-0.64562-6.9284-1.9365-9.9407-0.51652-1.1189-0.77471-1.9795-0.77461-2.582-1e-4 -3.1845 1.42-5.3792 4.2603-6.5841 0.94662-0.43032 1.9364-0.6455 2.9693-0.6455 3.0122 0 5.1208 1.4201 6.3259 4.2603 0.43022 0.94673 0.6454 1.9365 0.6455 2.9693-1e-4 0.17213-0.73167 2.4529-2.1947 6.8423-0.34439 1.1188-0.51651 3.0123-0.51641 5.6804-1e-4 4.3033 0.90359 10.5 2.7111 18.59 4.6475-9.8116 6.9713-17.17 6.9714-22.076l-0.7746-5.4222v-0.12911c-1.2e-4 -3.1845 1.463-5.3792 4.3894-6.5841 0.94662-0.43033 1.9364-0.6455 2.9693-0.6455 3.0122 0 5.1639 1.3771 6.455 4.1312 0.51629 0.94675 0.77449 1.9795 0.77459 3.0984-1e-4 2.4099-0.77471 4.1312-2.3238 5.164-2.41 1.5492-3.6149 5.3361-3.6148 11.361-1e-4 3.7869 0.21505 7.4448 0.6455 10.974 5.5081-5.5943 8.2623-10.328 8.2624-14.201l-0.6455-4.9058c-1e-4 -3.0123 1.377-5.164 4.1312-6.455 0.94662-0.51639 1.9794-0.7746 3.0984-0.7746 3.0983 0 5.293 1.3771 6.5841 4.1312l0.7746 2.4529v0.6455c-1e-4 3.4426-1.9796 6.0677-5.9386 7.8751-0.51651 5.9386-1.9796 13.211-4.3894 21.818-0.17223 0.68854-0.25831 1.2049-0.2582 1.5492-1.1e-4 0.60247-0.64561 1.5922-1.9365 2.9693l-1.5492 1.9365c-4.1313 4.7337-6.1969 8.0042-6.1968 9.8116-1e-4 0.51639 1.0327 3.1845 3.0984 8.0042 0.34417 1.7213 0.51628 3.2275 0.51639 4.5185m-28.015-73.845c-1.6354 0-2.6682 0.81764-3.0984 2.4529-0.08618 0.2582-0.12919 0.51639-0.12908 0.77459-1.1e-4 1.6353 0.81751 2.6681 2.4529 3.0984 0.25809 0.08607 0.51631 0.12911 0.77461 0.12911 2.0655 0 3.0983-1.0758 3.0984-3.2275-1.2e-4 -1.5492-0.73167-2.582-2.1947-3.0984-0.2583-0.08606-0.55953-0.1291-0.90369-0.1291m23.238 50.349c-1e-4 -2.7541-7.7461-4.1312-23.238-4.1312-15.578 0-23.367 1.4201-23.367 4.2603 0 1.2049 1.1188 1.8074 3.3566 1.8074 2.582 0 5.8095-0.21516 9.6825-0.6455l8.3915-0.25819h2.0656c2.4097 0 6.9713 0.21515 13.685 0.6455l6.3259 0.25819c2.0655 0 3.0983-0.6455 3.0984-1.9365"
       id="path4" />
  </g>
  <g
     inkscape:export-ydpi="173.26137"
     inkscape:export-xdpi="173.26137"
     id="g1060">
    <path
       style="fill:#ffffff;fill-opacity:1"
       sodipodi:type="inkscape:offset"
       inkscape:radius="3.9528465"
       inkscape:original="M 419 81.054688 L 415.38672 84.669922 L 415.38672 96.160156 L 425.45703 106.09961 L 425.45703 131.79102 L 412.41797 144.70117 L 412.41797 153.86719 L 414.86914 156.32031 L 474.51367 156.32031 L 477.0957 153.86719 L 477.0957 144.70117 L 464.05664 131.79102 L 464.05664 106.09961 L 474.12695 96.160156 L 474.12695 84.669922 L 470.51172 81.054688 L 461.2168 81.054688 L 459.02148 83.25 L 459.02148 86.476562 L 454.11523 86.476562 L 454.11523 83.25 L 451.92188 81.054688 L 437.5918 81.054688 L 435.39648 83.25 L 435.39648 86.476562 L 430.49023 86.476562 L 430.49023 83.25 L 428.16797 81.054688 L 419 81.054688 z M 430.10352 105.58398 L 459.41016 105.58398 L 459.41016 109.97266 L 430.10352 109.97266 L 430.10352 105.58398 z M 430.10352 128.82227 L 459.41016 128.82227 L 459.41016 133.21094 L 430.10352 133.21094 L 430.10352 128.82227 z "
       xlink:href="#path1022"
       id="path1024"
       inkscape:href="#path1022"
       d="m 419,77.101562 a 3.9532418,3.9532418 0 0 0 -2.79492,1.158204 L 412.5918,81.875 a 3.9532418,3.9532418 0 0 0 -1.15821,2.794922 v 11.490234 a 3.9532418,3.9532418 0 0 0 1.17579,2.8125 l 8.89453,8.779294 v 22.39063 l -11.86719,11.75 a 3.9532418,3.9532418 0 0 0 -1.17188,2.80859 v 9.16602 a 3.9532418,3.9532418 0 0 0 1.15625,2.79492 l 2.45118,2.45312 a 3.9532418,3.9532418 0 0 0 2.79687,1.15821 h 59.64453 a 3.9532418,3.9532418 0 0 0 2.72266,-1.08789 l 2.58203,-2.45313 a 3.9532418,3.9532418 0 0 0 1.23047,-2.86523 v -9.16602 a 3.9532418,3.9532418 0 0 0 -1.17188,-2.80859 l -11.86718,-11.75 v -22.39063 l 8.89453,-8.779294 a 3.9532418,3.9532418 0 0 0 1.17578,-2.8125 V 84.669922 A 3.9532418,3.9532418 0 0 0 476.92188,81.875 l -3.61524,-3.615234 a 3.9532418,3.9532418 0 0 0 -2.79492,-1.158204 h -9.29492 a 3.9532418,3.9532418 0 0 0 -2.79492,1.158204 l -1.85352,1.853515 -1.84961,-1.851562 a 3.9532418,3.9532418 0 0 0 -2.79687,-1.160157 H 437.5918 a 3.9532418,3.9532418 0 0 0 -2.79492,1.158204 l -1.86133,1.861328 -2.05274,-1.939453 a 3.9532418,3.9532418 0 0 0 -2.71484,-1.080079 z" />
    <path
       d="m414.87 156.32-2.4529-2.4529v-9.1661l13.039-12.91v-25.691l-10.07-9.9407v-11.49l3.6148-3.6148h9.1661l2.3238 2.1947v3.2275h4.9058v-3.2275l2.1947-2.1947h14.33l2.1947 2.1947v3.2275h4.9058v-3.2275l2.1947-2.1947h9.2952l3.6148 3.6148v11.49l-10.07 9.9407v25.691l13.039 12.91v9.1661l-2.582 2.4529h-59.644m15.234-27.498v4.3894h29.306v-4.3894h-29.306m0-23.238v4.3894h29.306v-4.3894h-29.306"
       id="path6" />
  </g>
  <g
     inkscape:export-ydpi="148.07816"
     inkscape:export-xdpi="148.07816"
     id="g1064">
    <path
       style="fill:#ffffff;fill-opacity:1"
       sodipodi:type="inkscape:offset"
       inkscape:radius="3.5531671"
       inkscape:original="M 611.7168 70.341797 C 610.6839 70.341907 609.69271 70.470416 608.74609 70.728516 C 604.70089 71.675316 602.67959 74.171697 602.67969 78.216797 C 602.67959 80.712697 603.62593 83.123466 605.51953 85.447266 C 603.28213 85.705466 599.66758 87.942856 594.67578 92.160156 C 589.08148 96.808156 586.2832 101.97194 586.2832 107.65234 C 586.2832 112.55834 588.9081 118.19555 594.1582 124.56445 C 594.1582 125.08085 593.94399 126.0272 593.51367 127.4043 C 592.1366 131.5355 591.44727 133.73009 591.44727 133.98828 C 591.44727 137.00058 594.50258 138.76486 600.61328 139.28125 C 596.22358 141.00257 592.0508 141.86328 588.0918 141.86328 L 580.47461 141.47656 C 579.35571 141.47656 578.32176 141.64792 577.375 141.99219 C 574.7069 142.85289 572.21247 145.43498 569.88867 149.73828 C 570.92147 151.02928 571.825 152.36313 572.59961 153.74023 C 574.57911 157.09683 576.68808 159.24858 578.92578 160.19531 C 579.01184 159.85105 579.14036 159.54921 579.3125 159.29102 C 580.3448 158.00002 584.00226 157.09647 590.28516 156.58008 C 592.78106 156.23581 594.80432 155.97879 596.35352 155.80664 C 603.23882 155.29024 608.3601 153.26698 611.7168 149.73828 C 615.4178 153.43918 622.56048 155.71942 633.14648 156.58008 L 636.24609 156.83789 C 641.40999 157.26829 644.16342 158.38791 644.50781 160.19531 C 646.05691 159.67891 647.51928 158.55919 648.89648 156.83789 L 653.54492 149.73828 C 653.02843 148.87758 652.59807 148.10258 652.25391 147.41406 C 649.84391 143.45496 646.74578 141.47656 642.95898 141.47656 C 638.39738 141.73476 635.85811 141.86328 635.3418 141.86328 C 631.4684 141.86328 627.29376 141.00255 622.81836 139.28125 C 628.92896 138.76485 631.98428 137.00058 631.98438 133.98828 L 629.40234 124.04688 C 634.56624 118.10787 637.14834 112.64424 637.14844 107.65234 C 637.14844 101.02534 633.18948 94.957419 625.27148 89.449219 C 622.00078 87.211519 619.54731 85.877596 617.91211 85.447266 C 619.80547 83.037366 620.75381 80.626697 620.75391 78.216797 L 620.75391 77.830078 L 620.10742 75.119141 C 618.81632 71.934641 616.02 70.341907 611.7168 70.341797 z M 611.7168 75.634766 C 613.8683 75.634766 614.94325 76.668775 614.94336 78.734375 C 614.94326 80.886075 613.8683 81.960938 611.7168 81.960938 C 611.45848 81.960937 611.1995 81.918101 610.94141 81.832031 C 609.21996 81.401731 608.35927 80.369675 608.35938 78.734375 L 608.48828 77.958984 C 608.91848 76.409764 609.9954 75.634766 611.7168 75.634766 z M 609.39258 95.646484 L 614.03906 95.646484 L 614.03906 101.19727 L 618.55859 101.19727 L 618.55859 106.10352 L 614.03906 106.10352 L 614.03906 112.04102 L 609.39258 112.04102 L 609.39258 106.10352 L 604.87305 106.10352 L 604.87305 101.19727 L 609.39258 101.19727 L 609.39258 95.646484 z M 605.39062 118.49609 L 618.04102 118.49609 C 622.43032 118.49609 624.62488 119.18345 624.625 120.56055 C 624.6249 121.50728 623.76417 122.06809 622.04297 122.24023 C 619.71907 122.49842 616.27654 122.62695 611.71484 122.62695 C 607.15314 122.62695 603.75518 122.49842 601.51758 122.24023 C 599.71007 122.06813 598.80652 121.50728 598.80664 120.56055 C 598.80652 120.21628 598.89221 119.95926 599.06445 119.78711 C 599.49465 118.92646 601.60362 118.49609 605.39062 118.49609 z M 605.39062 126.5 L 618.04102 126.5 C 622.43032 126.5 624.62488 127.18931 624.625 128.56641 C 624.625 130.02953 620.3233 130.75977 611.7168 130.75977 L 604.61523 130.75977 C 600.74213 130.50157 598.80652 129.77131 598.80664 128.56641 C 598.80654 127.18934 601.00113 126.5 605.39062 126.5 z "
       xlink:href="#path1026"
       id="path1028"
       inkscape:href="#path1026"
       d="m 611.7168,66.789062 c -1.30485,1.39e-4 -2.59461,0.170756 -3.83985,0.503907 -2.5446,0.606605 -4.85246,1.819625 -6.4414,3.78125 -1.602,1.977747 -2.30866,4.528181 -2.3086,7.142578 -7e-5,1.856945 0.47198,3.654616 1.21289,5.382812 -2.37531,1.29238 -4.84242,3.215336 -7.93554,5.828125 -0.001,0.0012 -0.002,0.0027 -0.004,0.0039 -6.13856,5.101795 -9.66992,11.375039 -9.66992,18.220699 0,5.73709 2.81548,11.58467 7.64258,17.76954 -0.0694,0.33681 -0.049,0.26927 -0.2461,0.90624 -0.003,0.0109 -4.8e-4,0.005 -0.004,0.0156 -0.67863,2.03667 -1.19712,3.61983 -1.54883,4.74023 -0.17817,0.56756 -0.31429,1.0177 -0.41797,1.38672 -0.0518,0.18451 -0.0966,0.34621 -0.13867,0.52735 -0.042,0.18113 -0.12305,0.16742 -0.12305,0.99023 0,1.51367 0.62697,2.93123 1.51758,4.18164 -0.42001,0.0221 -0.87529,0.13617 -1.28711,0.13672 l -7.4707,-0.37891 a 3.5535224,3.5535224 0 0 0 -0.17969,-0.004 c -1.46156,0 -2.90042,0.2339 -4.25586,0.71875 -3.99311,1.31617 -6.925,4.71928 -9.45703,9.4082 a 3.5535224,3.5535224 0 0 0 0.35156,3.90625 c 0.91849,1.14812 1.71224,2.32282 2.38867,3.52539 a 3.5535224,3.5535224 0 0 0 0.0371,0.0625 c 2.20293,3.73546 4.72279,6.53452 8.00196,7.92188 a 3.5535224,3.5535224 0 0 0 4.61718,-1.79883 c 0.27716,-0.13895 0.77975,-0.39049 1.52344,-0.57422 1.52184,-0.37598 3.8656,-0.72371 6.89453,-0.97266 a 3.5535224,3.5535224 0 0 0 0.19531,-0.0215 c 2.47555,-0.34146 4.47374,-0.59494 5.97461,-0.76172 l -0.12695,0.0117 c 6.12489,-0.45937 11.26397,-2.14863 15.2207,-5.125 4.86447,3.37585 11.78492,5.14569 21.01954,5.89648 l 3.09179,0.25782 c 2.3799,0.19836 4.08799,0.58429 4.89453,0.91211 0.29899,0.12152 0.30006,0.12009 0.32422,0.11914 a 3.5535224,3.5535224 0 0 0 4.46094,2.15625 c 2.37452,-0.79156 4.36687,-2.41538 6.04102,-4.50782 a 3.5535224,3.5535224 0 0 0 0.19726,-0.27343 l 4.64844,-7.09961 a 3.5535224,3.5535224 0 0 0 0.0742,-3.77539 c -0.48036,-0.80049 -0.86889,-1.50127 -1.16016,-2.08399 a 3.5535224,3.5535224 0 0 0 -0.14258,-0.25976 c -2.83988,-4.66531 -7.30572,-7.64258 -12.33008,-7.64258 a 3.5535224,3.5535224 0 0 0 -0.20117,0.006 c -4.55374,0.25775 -7.48934,0.38086 -7.41601,0.38086 -0.41531,0 -0.8927,-0.11937 -1.32032,-0.14258 0.88967,-1.24991 1.51558,-2.66696 1.51563,-4.17969 a 3.5535224,3.5535224 0 0 0 -0.11328,-0.89258 l -2.14453,-8.25586 c 4.68121,-5.77952 7.42176,-11.47783 7.42187,-17.1875 0,-8.042101 -4.93396,-15.229421 -13.40039,-21.119137 a 3.5535224,3.5535224 0 0 0 -0.0234,-0.01563 c -1.61723,-1.106455 -3.0104,-1.997679 -4.32226,-2.730469 0.8068,-1.795766 1.35148,-3.649601 1.35156,-5.570312 v -0.386719 a 3.5535224,3.5535224 0 0 0 -0.0957,-0.824219 l -0.64649,-2.710937 a 3.5535224,3.5535224 0 0 0 -0.16406,-0.511719 c -1.8073,-4.457703 -6.50368,-6.994008 -11.68359,-6.994141 z m 0.0664,11.746094 c 0.0661,0.14231 0.1289,0.339835 0.12891,0.199219 l -0.0156,0.189453 c 0.0194,-0.0749 -0.0627,0.02585 -0.1289,0.111328 -0.0392,-0.0285 -0.0475,-0.01993 -0.0918,-0.0625 -0.19427,-0.186686 -0.15607,-0.113974 -0.17578,-0.146484 0.0362,-0.0631 0.0438,-0.102426 0.125,-0.183594 0.0699,-0.06988 0.1002,-0.07177 0.1582,-0.107422 z" />
    <path
       d="m605.39 126.5c-4.3895 0-6.5842 0.68853-6.5841 2.0656-1.2e-4 1.2049 1.9364 1.9365 5.8095 2.1947h7.1005c8.6065 0 12.91-0.73158 12.91-2.1947-1.2e-4 -1.3771-2.1948-2.0656-6.5841-2.0656h-12.652m0-8.0042c-3.787 0-5.8957 0.43035-6.3259 1.291-0.17224 0.17215-0.25832 0.43034-0.2582 0.77461-1.2e-4 0.94673 0.90359 1.5062 2.7111 1.6783 2.2376 0.25819 5.6373 0.3873 10.199 0.3873s8.0041-0.12911 10.328-0.3873c1.7212-0.17214 2.5819-0.73157 2.582-1.6783-1.2e-4 -1.3771-2.1948-2.0656-6.5841-2.0656h-12.652m24.013 5.5513 2.582 9.9407c-1e-4 3.0123-3.0555 4.7767-9.1661 5.2931 4.4754 1.7213 8.6496 2.582 12.523 2.582 0.51631 0 3.0553-0.12911 7.6169-0.38731 3.7868 0 6.8852 1.9795 9.2952 5.9386 0.34416 0.68852 0.77451 1.4631 1.291 2.3238l-4.6476 7.1005c-1.3772 1.7213-2.8403 2.8402-4.3894 3.3566-0.34439-1.8074-3.0985-2.9262-8.2624-3.3566l-3.0984-0.25819c-10.586-0.86066-17.73-3.1414-21.431-6.8423-3.3567 3.5287-8.4777 5.5513-15.363 6.0677-1.5492 0.17215-3.5718 0.43034-6.0677 0.77461-6.2829 0.51639-9.9407 1.4201-10.973 2.7111-0.17214 0.25819-0.30125 0.55943-0.38731 0.90369-2.2377-0.94673-4.3464-3.0984-6.3259-6.455-0.77461-1.3771-1.6783-2.7111-2.7111-4.0021 2.3238-4.3033 4.8197-6.8853 7.4878-7.746 0.94676-0.34427 1.9795-0.5164 3.0984-0.5164l7.6169 0.38731c3.959 0 8.1333-0.86068 12.523-2.582-6.1107-0.51639-9.1661-2.2808-9.1661-5.2931 0-0.25819 0.68853-2.4529 2.0656-6.5841 0.43032-1.3771 0.6455-2.3238 0.6455-2.8402-5.2501-6.3689-7.8751-12.006-7.8751-16.912 0-5.6804 2.7972-10.844 8.3915-15.492 4.9918-4.2173 8.6066-6.455 10.844-6.7132-1.8936-2.3238-2.8403-4.7337-2.8402-7.2296-1e-4 -4.0451 2.0225-6.541 6.0677-7.4878 0.94662-0.2581 1.9364-0.38718 2.9693-0.38729 4.3032 1.1e-4 7.1004 1.5922 8.3915 4.7767l0.6455 2.7111v0.3873c-1e-4 2.4099-0.94684 4.8197-2.8402 7.2296 1.6352 0.43033 4.088 1.7644 7.3587 4.0021 7.918 5.5082 11.877 11.576 11.877 18.203-1e-4 4.9919-2.5821 10.457-7.746 16.396m-15.363-12.006v-5.9386h4.5185v-4.9058h-4.5185v-5.5513h-4.6476v5.5513h-4.5185v4.9058h4.5185v5.9386h4.6476m-2.3238-36.406c-1.7214 0-2.7973 0.77458-3.2275 2.3238l-0.12908 0.77458c-1.1e-4 1.6353 0.86055 2.6681 2.582 3.0984 0.25809 0.08607 0.51629 0.12909 0.77461 0.12909 2.1515 0 3.2274-1.0758 3.2275-3.2275-1.1e-4 -2.0656-1.076-3.0984-3.2275-3.0984"
       id="path8" />
  </g>
  <g
     id="g1101">
    <path
       d="m 776.68555,76.744141 c -2.49247,0 -3.74836,1.332661 -4.96875,2.636718 -0.58602,0.626194 -1.19997,1.647308 -1.78711,2.453125 -4.0708,-2.078603 -8.11809,-3.412109 -12.09375,-3.412109 a 3.5358872,3.5358872 0 0 0 -0.43946,0.02734 c -0.65842,0.08231 -1.2927,0.103515 -0.85156,0.103515 a 3.5358872,3.5358872 0 0 0 -3.50781,3.97461 c 0.4239,3.391634 0.61914,5.748169 0.61914,6.529297 0,1.257489 -0.0467,2.108062 -0.0977,2.675781 -0.84862,2.970462 -3.14526,8.488818 -6.90234,16.169918 a 3.5358872,3.5358872 0 0 0 -0.006,0.0117 c -5.38106,11.10883 -8.43771,18.26306 -9.2168,23.04883 a 3.5358872,3.5358872 0 0 0 0.28711,2.06445 c 0.65268,1.39852 1.27633,2.56488 1.94141,3.5625 2.14688,3.22033 5.68017,5.2815 9.93945,6.3711 a 3.5358872,3.5358872 0 0 0 0.0176,0.004 l 2.58203,0.64649 a 3.5358872,3.5358872 0 0 0 0.85938,0.10547 c 0.31675,0 0.58689,-0.19732 0.89648,-0.2461 0.0585,0.0796 0.0639,0.17374 0.12695,0.25196 1.26067,1.56382 3.36546,2.3164 5.17188,2.3164 1.3045,0 2.6473,-0.70005 3.74414,-1.625 -1.80117,3.77444 -2.89378,7.7174 -3.01562,11.79883 a 3.5358872,3.5358872 0 0 0 3.5332,3.64063 h 54.48047 a 3.5358872,3.5358872 0 0 0 3.51562,-3.1543 c 0.36115,-3.34044 0.53516,-7.03459 0.53516,-11.0957 0,-18.15155 -4.04168,-32.93181 -12.45508,-43.94922 -6.81405,-9.225754 -14.61313,-14.517049 -23.14453,-14.658206 -0.37601,-1.082872 -0.79569,-2.477172 -1.16406,-3.21875 -1.3234,-2.764667 -3.74555,-4.824135 -6.86719,-6.580078 a 3.5358872,3.5358872 0 0 0 -1.73242,-0.453125 z m -9.625,60.998049 c -0.0592,0.0756 -0.0997,0.15658 -0.15821,0.23242 -0.0155,0.0245 -0.0413,0.0496 -0.0566,0.0742 z"
       style="fill:#ffffff;fill-opacity:1"
       sodipodi:type="inkscape:offset"
       inkscape:radius="3.5355337"
       inkscape:original="M 776.68555 80.279297 C 775.39455 80.279297 773.50176 82.302556 771.00586 86.347656 L 770.23047 85.830078 C 765.84067 83.248078 761.70894 81.957031 757.83594 81.957031 C 757.1474 82.043101 756.71706 82.087891 756.54492 82.087891 C 756.97501 85.529013 757.19141 87.852075 757.19141 89.056641 C 757.19141 90.519841 757.1486 91.639462 757.0625 92.414062 C 756.1158 95.856062 753.70503 101.53698 749.83203 109.45508 C 744.49593 120.47108 741.52631 127.83035 740.92383 131.53125 C 741.52633 132.82225 742.08713 133.85432 742.60352 134.62891 C 744.15272 136.95271 746.77762 138.58841 750.47852 139.53516 L 753.06055 140.18164 C 754.17945 140.18164 755.16861 139.62085 756.0293 138.50195 C 756.0293 141.17005 757.10416 142.50391 759.25586 142.50391 C 760.11656 142.50391 760.76302 142.1612 761.19336 141.47266 C 762.74256 139.14886 764.16212 136.90941 765.45312 134.75781 C 768.29342 130.36841 772.55398 127.05606 778.23438 124.81836 C 778.06223 126.02326 777.8052 127.18393 777.46094 128.30273 C 776.77244 130.45443 774.83489 133.55451 771.65039 137.59961 C 770.87579 138.46031 770.27409 139.23335 769.84375 139.92188 C 765.79865 145.08588 763.68973 150.55186 763.51758 156.31836 L 817.99805 156.31836 C 818.34231 153.13416 818.51367 149.56262 818.51367 145.60352 C 818.51367 127.96052 814.59772 114.01739 806.76562 103.77539 C 800.22462 94.910791 793.33898 90.478516 786.10938 90.478516 C 785.42088 90.478516 784.73345 90.564178 784.04492 90.736328 C 783.18422 87.982228 782.53776 86.175133 782.10742 85.314453 C 781.24682 83.507053 779.43965 81.828497 776.68555 80.279297 z M 783.01172 96.15625 L 784.56055 96.416016 C 789.63855 96.416016 795.27586 100.28916 801.47266 108.03516 C 808.61586 116.98616 812.1875 128.47491 812.1875 142.50391 L 812.1875 147.28125 C 812.0154 149.51895 811.24233 150.63672 809.86523 150.63672 C 808.22995 150.63672 807.41211 148.74393 807.41211 144.95703 L 807.41211 144.18164 C 807.41211 128.86164 803.92648 117.15661 796.95508 109.06641 C 791.44658 102.86961 786.3683 99.557273 781.7207 99.126953 C 781.20431 98.610563 780.94531 98.180217 780.94531 97.835938 C 780.94531 96.889198 781.5062 96.416016 782.625 96.416016 C 782.71107 96.329946 782.83959 96.24231 783.01172 96.15625 z M 764.41992 101.58203 C 766.48552 101.58203 767.51953 102.14087 767.51953 103.25977 C 767.51953 104.20647 766.87303 105.32423 765.58203 106.61523 C 763.17213 109.11113 760.89183 110.35938 758.74023 110.35938 C 757.62135 110.35937 757.0625 109.58631 757.0625 108.03711 C 757.0625 106.91821 757.49283 105.84139 758.35352 104.80859 C 759.98882 102.65689 762.01012 101.58203 764.41992 101.58203 z M 748.79883 127.40039 C 748.97093 128.26106 749.05859 128.77708 749.05859 128.94922 C 749.05859 129.29347 749.01579 129.59532 748.92969 129.85352 C 748.41329 131.74699 747.03458 132.69336 744.79688 132.69336 C 744.53867 132.17696 744.41016 131.7466 744.41016 131.40234 C 744.41016 130.972 744.49584 130.54166 744.66797 130.11133 C 745.35647 128.30392 746.73323 127.40039 748.79883 127.40039 z "
       xlink:href="#path1030"
       id="path1032"
       inkscape:href="#path1030" />
    <path
       d="m 758.74,110.36 c 2.1516,0 4.4324,-1.248 6.8423,-3.7439 1.291,-1.291 1.9365,-2.4099 1.9365,-3.3566 0,-1.1189 -1.0328,-1.6783 -3.0984,-1.6783 -2.4098,0 -4.4324,1.0758 -6.0677,3.2275 -0.86069,1.0328 -1.291,2.1086 -1.291,3.2275 0,1.5492 0.55942,2.3238 1.6783,2.3238 m -2.1947,-28.273 c 0.17214,0 0.60246,-0.04304 1.291,-0.12911 3.873,0 8.0042,1.291 12.394,3.873 l 0.77461,0.51639 c 2.4959,-4.0451 4.3894,-6.0677 5.6804,-6.0677 2.7541,1.5492 4.5616,3.2275 5.4222,5.0349 0.43034,0.86068 1.0758,2.6681 1.9365,5.4222 0.68853,-0.17215 1.3771,-0.25819 2.0656,-0.25819 7.2296,0 14.115,4.4324 20.656,13.297 7.8321,10.242 11.748,24.185 11.748,41.828 0,3.9591 -0.17213,7.5308 -0.51639,10.715 h -54.48 c 0.17215,-5.7665 2.2808,-11.232 6.3259,-16.396 0.43034,-0.68853 1.0328,-1.4631 1.8074,-2.3238 3.1845,-4.0451 5.121,-7.1435 5.8095,-9.2952 0.34426,-1.1188 0.60246,-2.2808 0.7746,-3.4857 -5.6804,2.2377 -9.9407,5.5513 -12.781,9.9407 -1.291,2.1516 -2.7111,4.3894 -4.2603,6.7132 -0.43034,0.68854 -1.0758,1.0328 -1.9365,1.0328 -2.1517,0 -3.2275,-1.334 -3.2275,-4.0021 -0.86069,1.1189 -1.8504,1.6783 -2.9693,1.6783 l -2.582,-0.6455 c -3.7009,-0.94675 -6.3259,-2.582 -7.8751,-4.9058 -0.51639,-0.77459 -1.0758,-1.8074 -1.6783,-3.0984 0.60248,-3.7009 3.5718,-11.06 8.9079,-22.076 3.873,-7.9181 6.2829,-13.599 7.2296,-17.041 0.0861,-0.7746 0.12909,-1.8934 0.12909,-3.3566 0,-1.2049 -0.21517,-3.5287 -0.6455,-6.9714 m -7.746,45.314 c -2.0656,0 -3.4427,0.90369 -4.1312,2.7111 -0.17213,0.43033 -0.2582,0.86066 -0.2582,1.291 0,0.34426 0.12909,0.7746 0.3873,1.291 2.2377,0 3.6148,-0.94673 4.1312,-2.8402 0.0861,-0.2582 0.12911,-0.55945 0.12911,-0.9037 0,-0.17214 -0.0861,-0.68853 -0.2582,-1.5492 m 63.388,19.881 v -4.7767 c 0,-14.029 -3.5718,-25.519 -10.715,-34.47 -6.1968,-7.746 -11.834,-11.619 -16.912,-11.619 l -1.5492,-0.2582 c -0.17213,0.08606 -0.30124,0.17213 -0.38731,0.2582 -1.1188,0 -1.6783,0.47336 -1.6783,1.4201 0,0.34428 0.2582,0.77461 0.77459,1.291 4.6476,0.43032 9.7255,3.7439 15.234,9.9407 6.9714,8.0902 10.457,19.795 10.457,35.115 v 0.77461 c 0,3.7869 0.81762,5.6804 2.4529,5.6804 1.3771,0 2.1517,-1.1189 2.3238,-3.3566"
       id="path10" />
  </g>
  <g
     id="g1093">
    <path
       id="path1045"
       style="fill:#ac683c;fill-opacity:1"
       d="m 947.70703,80.410156 c -1.9797,0 -3.82958,0.430346 -5.55078,1.291016 -3.787,1.8935 -5.6798,4.775437 -5.67969,8.648437 -10e-5,2.3238 0.77297,4.777375 2.32227,7.359375 -5.9386,2.409396 -8.90625,6.497176 -8.90625,12.263676 0,1.3771 0.17135,2.71095 0.51562,4.00195 1.2049,4.0451 3.4852,6.58439 6.8418,7.61719 -2.8403,1.3771 -5.24902,2.88227 -7.22852,4.51758 -6.7134,5.25 -10.07031,13.29857 -10.07031,24.14257 0,3.0123 0.0429,5.03556 0.12891,6.06836 h 55.125 c 0.086,-1.0328 0.13076,-3.05606 0.13086,-6.06836 -1e-4,-4.9059 -0.6038,-9.16645 -1.8086,-12.78125 -2.324,-6.5408 -7.44528,-11.8338 -15.36328,-15.8789 0.9466,-0.2582 1.80732,-0.73138 2.58203,-1.41992 3.0983,-2.3239 4.6483,-5.72382 4.64844,-10.19922 -10e-5,-2.4099 -0.68941,-4.77581 -2.06641,-7.09961 -1.37719,-2.1517 -3.65739,-3.873066 -6.84179,-5.164066 1.46303,-2.4099 2.19521,-4.863475 2.19531,-7.359375 -10e-5,-1.8074 -0.4733,-3.44315 -1.41992,-4.90625 -2.0657,-3.3566 -5.25149,-5.033203 -9.55469,-5.033203 z" />
    <path
       id="path1043"
       d="m 920.08,156.32 c -0.086,-1.0328 -0.12908,-3.0554 -0.12908,-6.0677 0,-10.844 3.3566,-18.892 10.07,-24.142 1.9795,-1.6353 4.3893,-3.1414 7.2296,-4.5185 -3.3566,-1.0328 -5.6374,-3.5718 -6.8423,-7.6169 -0.34427,-1.291 -0.51639,-2.625 -0.51639,-4.0021 0,-5.7665 2.9693,-9.8546 8.9079,-12.264 -1.5493,-2.582 -2.3239,-5.0349 -2.3238,-7.3587 -1.1e-4,-3.873 1.8934,-6.7562 5.6804,-8.6497 1.7212,-0.86067 3.5716,-1.291 5.5513,-1.291 4.3032,0 7.4877,1.6783 9.5534,5.0349 0.94662,1.4631 1.42,3.0984 1.4201,4.9058 -1e-4,2.4959 -0.73167,4.9488 -2.1947,7.3587 3.1844,1.291 5.4651,3.0123 6.8423,5.164 1.377,2.3238 2.0655,4.6906 2.0656,7.1005 -1.4e-4,4.4754 -1.5493,7.8751 -4.6476,10.199 -0.77471,0.68854 -1.6354,1.1619 -2.582,1.4201 7.918,4.0451 13.039,9.3382 15.363,15.879 1.2048,3.6148 1.8073,7.8751 1.8074,12.781 -1e-4,3.0123 -0.0431,5.0349 -0.12908,6.0677 h -55.126"
       style="fill:#ac683c;fill-opacity:1" />
    <path
       d="m 947.70703,76.892578 c -2.4895,0 -4.92154,0.560289 -7.125,1.66211 -4.64383,2.322548 -7.62319,6.776254 -7.62305,11.794921 -8e-5,1.9882 0.5509,3.95625 1.32618,5.90625 -4.88326,3.109142 -7.91016,7.946831 -7.91016,13.716801 0,1.66891 0.20994,3.31511 0.63477,4.9082 a 3.5181972,3.5181972 0 0 0 0.0273,0.0977 c 0.73581,2.47026 1.96386,4.64963 3.57617,6.38867 -0.96963,0.6441 -1.92988,1.29195 -2.7832,1.99414 -7.62169,5.97515 -11.39649,15.33404 -11.39649,26.89062 0,3.0457 0.0311,5.04433 0.14063,6.35938 a 3.5181972,3.5181972 0 0 0 3.50586,3.22656 h 55.125 a 3.5181972,3.5181972 0 0 0 3.50586,-3.22656 c 0.10915,-1.31083 0.14247,-3.31228 0.14258,-6.35938 -1.1e-4,-5.19445 -0.63276,-9.82752 -1.98829,-13.89453 a 3.5181972,3.5181972 0 0 0 -0.0234,-0.0644 c -2.12663,-5.98529 -6.39757,-10.95806 -12.30274,-14.94141 2.81855,-2.94891 4.37291,-6.94025 4.37305,-11.3789 -1.3e-4,-3.08061 -0.90826,-6.11083 -2.55664,-8.89258 a 3.5181972,3.5181972 0 0 0 -0.0644,-0.10352 c -1.26421,-1.975178 -3.16591,-3.470318 -5.30664,-4.765622 0.71547,-1.907732 1.21476,-3.860179 1.21484,-5.861329 -1.3e-4,-2.409751 -0.67712,-4.773179 -1.9707,-6.785156 -2.64234,-4.261411 -7.32071,-6.671875 -12.52149,-6.671875 z m 15.37695,45.908202 -0.22656,0.18555 c 0.0364,-0.0273 0.0596,-0.0662 0.0957,-0.0937 0.0404,-0.0348 0.091,-0.0564 0.13086,-0.0918 z"
       style="fill:#ffffff;fill-opacity:1"
       sodipodi:type="inkscape:offset"
       inkscape:radius="3.5178454"
       inkscape:original="M 947.70703 80.410156 C 945.72733 80.410156 943.87745 80.840502 942.15625 81.701172 C 938.36925 83.594672 936.47645 86.476609 936.47656 90.349609 C 936.47646 92.673409 937.24953 95.126984 938.79883 97.708984 C 932.86023 100.11838 929.89258 104.20616 929.89258 109.97266 C 929.89258 111.34976 930.06393 112.68361 930.4082 113.97461 C 931.6131 118.01971 933.8934 120.559 937.25 121.5918 C 934.4097 122.9689 932.00098 124.47407 930.02148 126.10938 C 923.30808 131.35938 919.95117 139.40795 919.95117 150.25195 C 919.95117 153.26425 919.99407 155.28751 920.08008 156.32031 L 975.20508 156.32031 C 975.29108 155.28751 975.33584 153.26425 975.33594 150.25195 C 975.33584 145.34605 974.73214 141.0855 973.52734 137.4707 C 971.20334 130.9299 966.08206 125.6369 958.16406 121.5918 C 959.11066 121.3336 959.97138 120.86042 960.74609 120.17188 C 963.84439 117.84798 965.39439 114.44806 965.39453 109.97266 C 965.39443 107.56276 964.70513 105.19685 963.32812 102.87305 C 961.95093 100.72135 959.67073 98.999984 956.48633 97.708984 C 957.94936 95.299084 958.68154 92.845509 958.68164 90.349609 C 958.68154 88.542209 958.20834 86.906459 957.26172 85.443359 C 955.19602 82.086759 952.01023 80.410156 947.70703 80.410156 z "
       xlink:href="#path1045"
       id="path1048"
       inkscape:href="#path1045" />
    <path
       d="m 920.08,156.32 c -0.086,-1.0328 -0.12908,-3.0554 -0.12908,-6.0677 0,-10.844 3.3566,-18.892 10.07,-24.142 1.9795,-1.6353 4.3893,-3.1414 7.2296,-4.5185 -3.3566,-1.0328 -5.6374,-3.5718 -6.8423,-7.6169 -0.34427,-1.291 -0.51639,-2.625 -0.51639,-4.0021 0,-5.7665 2.9693,-9.8546 8.9079,-12.264 -1.5493,-2.582 -2.3239,-5.0349 -2.3238,-7.3587 -1.1e-4,-3.873 1.8934,-6.7562 5.6804,-8.6497 1.7212,-0.86067 3.5716,-1.291 5.5513,-1.291 4.3032,0 7.4877,1.6783 9.5534,5.0349 0.94662,1.4631 1.42,3.0984 1.4201,4.9058 -1e-4,2.4959 -0.73167,4.9488 -2.1947,7.3587 3.1844,1.291 5.4651,3.0123 6.8423,5.164 1.377,2.3238 2.0655,4.6906 2.0656,7.1005 -1.4e-4,4.4754 -1.5493,7.8751 -4.6476,10.199 -0.77471,0.68854 -1.6354,1.1619 -2.582,1.4201 7.918,4.0451 13.039,9.3382 15.363,15.879 1.2048,3.6148 1.8073,7.8751 1.8074,12.781 -1e-4,3.0123 -0.0431,5.0349 -0.12908,6.0677 h -55.126"
       id="path12" />
  </g>
  <g
     inkscape:export-ydpi="169.51553"
     inkscape:export-xdpi="169.51553"
     id="g1137">
    <path
       style="fill:#ffffff;stroke:#000000;stroke-width:1px;stroke-linecap:butt;stroke-linejoin:miter;stroke-opacity:1;fill-opacity:1"
       d="m 107.4375,234.0625 -5.1875,3.75 -1.125,9.9375 L 85.5625,241.375 74,248.5 l -0.75,10.9375 10.5,16.375 4.5,18.25 36.4375,2.4375 10.0625,-9.5 4.6875,-20 8.125,-12.25 -6.625,-11.25 -14.0625,-1.6875 -8.5625,4.875 -2.6875,-12.625 z"
       id="path1133" />
    <path
       d="m109.66 299.15c-17.127 0-25.82-2.8832-26.078-8.6497-0.43034-7.9181-1.7644-13.9-4.0021-17.945-0.94673-1.6353-2.2808-3.6148-4.0021-5.9386-2.9263-3.873-4.5615-7.1435-4.9058-9.8116-0.08607-0.68853-0.12911-1.4201-0.12911-2.1947 0-5.4222 2.2808-9.6825 6.8423-12.781 1.1189-0.68854 2.2808-1.248 3.4857-1.6783 4.5615-1.6353 9.08-1.3771 13.555 0.77461 1.6353 0.77458 3.2705 1.8074 4.9058 3.0984l0.12911 0.12911c0-1.8074 0.08605-3.7439 0.2582-5.8095 0-0.60249 0.30122-1.4201 0.90369-2.4529 1.3771-2.2377 3.0123-4.0021 4.9058-5.2931 0.34426-0.17214 0.68853-0.38731 1.0328-0.6455v-3.0984l-5.2931-3.0984v-4.6476h4.7767l1.6783-4.9058h3.873l1.6783 4.9058h4.7767v4.6476l-5.2931 3.0984v3.0984c4.4755 2.8402 6.7562 5.6804 6.8423 8.5206 0.17213 1.7213 0.2582 3.6148 0.2582 5.6804l0.12911-0.12911c5.4222-4.5615 11.103-6.0246 17.041-4.3894 1.5492 0.43031 3.0123 1.0758 4.3894 1.9365 4.8197 2.9262 7.2726 7.2726 7.3587 13.039 0 3.4427-1.7213 7.5308-5.164 12.264-2.8402 3.9591-4.6046 6.8423-5.2931 8.6497-1.4631 3.873-2.3238 8.8648-2.582 14.976-0.17212 5.7665-8.8649 8.6497-26.078 8.6497m0-43.507 3.7439-5.9386c0.60247-1.291 1.0758-2.4959 1.4201-3.6148 0.17215-0.60246 0.25822-1.8504 0.25822-3.7439 0-5.0779-1.7644-7.6169-5.2931-7.6169-3.7008 0-5.5513 2.539-5.5513 7.6169 0 1.8935 0.08607 3.1414 0.2582 3.7439 0.68853 2.3238 2.1517 5.0779 4.3894 8.2624 0.51641 0.60247 0.77461 1.0328 0.77461 1.291m34.47-0.2582c0-3.873-1.291-6.8423-3.873-8.9079-2.1516-1.8074-4.6906-2.7111-7.6169-2.7111-3.7008 0-7.703 1.8934-12.006 5.6804-5.0779 4.3894-7.9612 10.328-8.6497 17.816 0 0.60246 1.5922 1.291 4.7767 2.0656 3.7009 0.68854 9.9837 1.0328 18.849 1.0328l5.8095-7.746c1.8074-2.7541 2.7111-5.164 2.7111-7.2296m-34.47 17.428c-2.1517 0.94675-8.6927 1.7644-19.623 2.4529-1.6353 0.08608-2.9693 0.17213-4.0021 0.2582 0.86068 3.2705 1.4201 6.8853 1.6783 10.844 5.9386-1.8935 13.254-2.8402 21.947-2.8402 8.8648 0 16.181 0.94672 21.947 2.8402 0.2582-4.3033 0.81763-7.9181 1.6783-10.844l-19.107-1.5492c-1.6353-0.25819-3.1414-0.64549-4.5185-1.1619m-34.47-17.428c0 2.6681 2.1086 6.7132 6.3259 12.135 1.0328 1.291 1.7644 2.2378 2.1947 2.8402h2.3238c8.8649 0 15.32-0.60246 19.365-1.8074 1.291-0.34426 1.9365-0.77458 1.9365-1.291-0.68854-7.4878-3.5718-13.426-8.6497-17.816-4.2173-3.7869-8.2194-5.6804-12.006-5.6804-1.2049 0-2.4959 0.25819-3.873 0.7746-3.4427 0.86066-5.7665 3.1414-6.9714 6.8423l-0.6455 3.4857v0.51639m34.47 39.117c8.0902 0 13.685-0.51641 16.783-1.5492 0.7746-0.25822 1.1619-0.55945 1.1619-0.90372 0-2.2377-5.9386-3.3566-17.816-3.3566-4.5615 0-8.9939 0.30125-13.297 0.90371-3.1845 0.51639-4.7767 1.334-4.7767 2.4529 0 1.291 5.0779 2.1086 15.234 2.4529h2.7111"
       id="path14" />
  </g>
  <g
     inkscape:export-ydpi="172.7589"
     inkscape:export-xdpi="172.7589"
     id="g1131">
    <path
       style="fill:#ffffff;stroke:#000000;stroke-width:1px;stroke-linecap:butt;stroke-linejoin:miter;stroke-opacity:1;fill-opacity:1"
       d="m 239.31145,230.87036 -3.57973,1.59099 1.01647,6.98268 c 0,0 4.41942,5.21492 4.41942,5.74525 0,0.53033 6.20739,23.06072 6.26989,23.37322 C 247.5,268.875 255.125,280 255.125,280 l -0.25,14.375 46,0.25 1.0625,-25.9375 8.3125,-3.6875 5,-24.75 5.5625,-5.625 -5,-5.6875 -6.0625,5.5 -0.5,12.5 -10,10.875 -1.125,-26.4375 5.875,-4.4375 -3.4375,-6.125 -7.25,3.875 -0.4375,17.5625 -8.5,14.8125 -6.375,-28.625 4.1875,-5.75 -1.9375,-5.1875 -7.75,2.875 3,23 -4.4375,13.4375 -9.625,-19.625 v -14.375 l -8.5625,-0.125 -0.0625,6.8125 4.875,10.0625 -1.1875,18.125 -12.625,-17 0.1875,-9.5625 z"
       id="path1127" />
    <path
       d="m274.62 270.1h5.6804c1.2909 0 2.8401 0.04301 4.6476 0.12908l12.781 0.77461h0.12911c1.5491 0 2.3237-0.21518 2.3238-0.6455v-0.51641c-1.2e-4 -2.582-5.7235-4.2603-17.17-5.0349-2.0657-0.17215-3.8731-0.25821-5.4222-0.25821-8.4346 0-14.933 0.86067-19.494 2.582-2.0656 0.77458-3.0984 1.6783-3.0984 2.7111v0.51641c0 0.43032 0.77461 0.6455 2.3238 0.6455l17.299-0.90369m23.883 5.8095c-6.7994-0.86066-13.771-1.291-20.914-1.291-7.4879 0-14.459 0.43034-20.914 1.291 1.0328 0.86066 1.5492 2.539 1.5492 5.0349 0 1.6353-0.25819 2.625-0.77458 2.9693 5.164-0.94673 11.877-1.4201 20.14-1.4201s14.975 0.47337 20.14 1.4201c-0.51651-0.34427-0.77471-1.334-0.77461-2.9693-1e-4 -2.496 0.51631-4.1742 1.5492-5.0349m-20.914 11.103c-4.3895 0-9.2953 0.21517-14.717 0.64551-4.2173 0.34425-6.3259 1.334-6.3259 2.9693 0 2.1516 7.0144 3.2275 21.043 3.2275s21.043-1.0758 21.043-3.2275c-1e-4 -0.68854-0.55953-1.334-1.6783-1.9365-3.2706-1.1189-9.7256-1.6783-19.365-1.6783m0-67.519c-2.1518 0-3.2276 1.0328-3.2275 3.0984-1.3e-4 2.2377 1.0757 3.3566 3.2275 3.3566 2.0655 0 3.0983-1.1189 3.0984-3.3566-1e-4 -2.0656-1.0329-3.0984-3.0984-3.0984m0-3.7439c3.0983 0 5.25 1.4201 6.455 4.2603l0.6455 2.582v0.38731c-1.1e-4 0.51639-0.34437 1.5922-1.0328 3.2275-1.205 3.5287-1.8075 6.5841-1.8074 9.1661-1e-4 4.2173 0.94663 10.457 2.8402 18.72 4.6475-9.8116 6.9713-17.213 6.9714-22.205l-0.77459-5.5513c-1.3e-4 -3.0123 1.3339-5.164 4.0021-6.455 0.9466-0.51639 1.9794-0.77458 3.0984-0.77458 3.0983 0 5.293 1.377 6.5841 4.1312 0.51631 1.0328 0.77451 2.0656 0.77461 3.0984-1e-4 2.2377-0.77471 4.0021-2.3238 5.2931-2.3239 2.3238-3.5288 6.1107-3.6148 11.361-1e-4 2.2378 0.21505 5.8525 0.6455 10.844 5.5942-5.7665 8.3914-10.457 8.3915-14.072l-0.64549-5.0349c-1.3e-4 -2.8402 1.2909-4.9488 3.873-6.3259 1.0327-0.60248 2.1085-0.90372 3.2275-0.90372 2.9262 0 5.1208 1.334 6.5841 4.0021l0.77461 2.4529v0.77458c-1e-4 3.5288-1.9796 6.1968-5.9386 8.0042-0.17225 3.7009-1.5924 10.973-4.2603 21.818-0.17225 0.51641-0.30136 0.98976-0.38731 1.4201-1.1e-4 1.2049-1.3772 3.2705-4.1312 6.1968-3.701 3.7009-5.5514 6.5841-5.5513 8.6497-1e-4 0.94672 1.0327 3.4857 3.0984 7.6169 0.34418 0.77461 0.51629 1.9365 0.51639 3.4857v0.90369c-0.08617 0.25819-0.12921 0.55943-0.12908 0.90369v0.12911l0.12908 0.12909c-1e-4 3.0984-8.3055 4.8197-24.916 5.164h-3.2275l-5.4222-0.1291h-0.12911c-8.0904-0.2582-14.244-0.94673-18.461-2.0656-2.6681-0.77458-4.0021-1.7643-4.0021-2.9693 0.08607-0.08605 0.08607-0.60246 0-1.5492-0.08608-0.17213-0.08608-0.34427 0-0.51639 0-1.9795 0.6455-4.2603 1.9365-6.8423 1.0328-2.0656 1.5492-3.4857 1.5492-4.2603 0-1.3771-0.73156-3.0123-2.1947-4.9058l-6.3259-7.2296c-0.68852-0.94673-1.0328-1.8504-1.0328-2.7111-2.6681-10.93-4.1742-18.031-4.5185-21.301-0.08606-0.68854-0.1291-1.334-0.1291-1.9365-3.9591-1.8074-5.9386-4.4754-5.9386-8.0042 0-2.8402 1.291-4.9488 3.873-6.3259 1.1189-0.60248 2.2378-0.90372 3.3566-0.90372 3.0123 0 5.164 1.3771 6.455 4.1312 0.51639 0.94673 0.77458 1.9795 0.77458 3.0984l-0.6455 5.0349c0 3.7869 2.7541 8.4776 8.2624 14.072 0.43034-3.7869 0.6455-7.4017 0.6455-10.844 0-4.7336-0.55943-7.8751-1.6783-9.4243-0.43034-0.60246-1.0758-1.291-1.9365-2.0656-1.5492-1.0328-2.3238-2.7541-2.3238-5.164 0-3.0123 1.4201-5.207 4.2603-6.5841 0.94673-0.43035 1.9795-0.6455 3.0984-0.6455 3.0123 0 5.164 1.377 6.455 4.1312 0.51628 0.94673 0.77448 1.9795 0.77458 3.0984l-0.77458 5.4222v0.1291c0 4.9058 2.3237 12.308 6.9714 22.205 1.8073-7.832 2.711-14.072 2.7111-18.72-1e-4 -3.4426-0.6456-6.7132-1.9365-9.8116-0.51649-1.2049-0.7747-2.0656-0.77458-2.582-1.2e-4 -3.0123 1.3769-5.164 4.1312-6.455 0.94662-0.51639 1.9794-0.77458 3.0984-0.77458m37.31 15.879c-1.3772 0-2.3669 0.68854-2.9693 2.0656-0.08618 0.34427-0.12922 0.68852-0.12911 1.0328-1.1e-4 1.7213 0.77449 2.7972 2.3238 3.2275 0.25809 0.08605 0.51631 0.12909 0.77461 0.12909 2.1515 0 3.2274-1.1189 3.2275-3.3566-1.1e-4 -2.0656-1.076-3.0984-3.2275-3.0984m-16.912-8.2624c-1.4632 0-2.453 0.73157-2.9693 2.1947l-0.12909 1.0328c-1.2e-4 1.5492 0.73144 2.582 2.1947 3.0984 0.25809 0.08606 0.55932 0.12909 0.90369 0.12909 2.2376 0 3.3565-1.0758 3.3566-3.2275s-1.119-3.2275-3.3566-3.2275m-41.054 0c-2.1516 0-3.2275 1.0758-3.2275 3.2275s1.0758 3.2275 3.2275 3.2275c2.0656 0 3.0984-1.0758 3.0984-3.2275s-1.0328-3.2275-3.0984-3.2275m-16.912 8.2624c-2.1516 0-3.2275 1.0328-3.2275 3.0984 0 2.2378 1.0758 3.3566 3.2275 3.3566 2.0656 0 3.0984-1.1189 3.0984-3.3566 0-1.4631-0.73157-2.4529-2.1947-2.9693-0.25822-0.08605-0.55944-0.12909-0.90372-0.12909m37.568 8.2624c-1.205 7.5738-2.7542 13.039-4.6476 16.396l-1.9365 3.0984v0.12911c-0.25832-0.25822-1.3772-1.5492-3.3566-3.873-2.496-2.9263-5.121-8.4776-7.8751-16.654 0.17213 1.2049 0.2582 2.4529 0.2582 3.7439 0 4.0451-0.73157 10.285-2.1947 18.72-4.6476-2.7541-9.1661-7.1435-13.555-13.168 1.4631 7.4017 2.582 12.264 3.3566 14.588 0.51641 1.7213 1.1619 2.7111 1.9365 2.9693 7.0575-4.0451 16.396-6.0677 28.015-6.0677 11.705 0 21.043 2.0226 28.015 6.0677 1.5491-0.51639 3.2704-6.3689 5.164-17.558-4.4756 6.1968-8.951 10.586-13.426 13.168-1.4632-7.4878-2.1948-13.383-2.1947-17.687-1.1e-4 -1.1189 0.08594-2.7111 0.25819-4.7767-1.7214 5.164-3.701 9.7685-5.9386 13.814-1.205 1.8074-2.5391 3.5287-4.0021 5.164-0.68863 0.68853-1.119 1.2049-1.291 1.5492l-2.8402-5.0349c-0.08615-0.34426-0.21526-0.68853-0.38728-1.0328-0.68864-1.8935-1.8075-6.412-3.3566-13.555"
       id="path16" />
  </g>
  <g
     inkscape:export-ydpi="190.02051"
     inkscape:export-xdpi="190.02051"
     id="g1151">
    <path
       style="fill:#ffffff;fill-opacity:1;stroke:#000000;stroke-width:1px;stroke-linecap:butt;stroke-linejoin:miter;stroke-opacity:1"
       d="m 418.78399,226.8045 10.96016,0.70711 2.29809,4.5078 6.36396,-0.97227 0.88389,-5.12652 12.28598,0.88388 4.15425,5.21491 5.74524,-3.97747 10.42983,-1.23744 1.41421,12.1092 -10.69499,9.72272 -0.17678,25.45585 12.72793,16.52862 -1.41422,6.09879 -57.80598,-1.5026 1.06066,-8.66206 11.13693,-11.57887 -0.61871,-27.75394 -11.29161,-9.78901 2.40858,-10.84967 z"
       id="path1121" />
    <path
       d="m 430.41,249.06 v 22.851 h 29.435 V 249.06 H 430.41 m -15.234,50.091 -2.4529,-2.4529 v -8.9079 l 13.168,-13.297 v -25.82 l -11.361,-9.9407 v -11.748 l 3.7439,-3.6148 h 11.619 l 2.1947,2.1947 v 3.3566 h 3.7439 v -3.3566 l 2.1947,-2.1947 h 14.201 l 2.1947,2.1947 v 3.3566 h 3.6148 v -3.3566 l 2.3238,-2.1947 h 11.619 l 3.7439,3.6148 v 11.748 l -11.361,9.9407 v 25.82 l 13.168,13.297 v 8.9079 l -2.4529,2.4529 h -59.902 m 2.0656,-10.199 v 5.0349 h 55.771 v -5.0349 h -55.771 m 12.652,-12.781 -8.5206,8.2624 h 47.509 l -8.5206,-8.2624 h -30.468 m 10.328,-47.38 v 3.3566 l -1.9365,1.8074 h -8.3915 l -1.9365,-1.8074 v -3.6148 h -7.2296 l -1.6783,1.8074 v 7.2296 l 8.7788,7.1005 h 34.599 l 8.7788,-7.1005 v -7.2296 l -1.6783,-1.8074 h -7.2296 v 3.6148 l -1.9365,1.8074 h -8.3915 l -1.9365,-1.8074 v -3.3566 h -9.8116"
       id="path18"
       inkscape:export-xdpi="189.60806"
       inkscape:export-ydpi="189.60806" />
  </g>
  <g
     id="g1117">
    <path
       style="fill:#ffffff;stroke:#000000;stroke-width:1px;stroke-linecap:butt;stroke-linejoin:miter;stroke-opacity:1;fill-opacity:1"
       d="m 607.40472,219.29149 1.94455,8.75045 -19.44544,16.70539 3.53553,14.4073 4.15426,8.66206 -1.59099,10.07627 7.33623,3.44715 -4.77297,4.41942 -21.65515,3.18198 2.20971,8.66206 30.84754,-6.36397 2.82842,-1.76776 6.01041,3.53553 27.04683,4.94975 4.68459,-6.98268 -5.92202,-5.03814 -23.5113,-2.82842 4.68458,-3.97748 4.94975,-4.86136 -1.67938,-12.72792 7.15945,-9.89949 -3.09359,-12.02082 -15.73312,-11.66726 1.23743,-11.84404 -11.49048,0.88388 z"
       id="path1113" />
    <path
       d="m613.06 264.16c-6.0248 0-10.715-0.25821-14.072-0.7746 0.60235 1.2049 0.90359 2.2377 0.90369 3.0984-1e-4 1.291-0.2583 2.3668-0.77458 3.2275 2.4958-0.7746 7.1434-1.1619 13.943-1.1619s11.447 0.38731 13.943 1.1619c-0.5165-0.86067-0.77469-1.9365-0.77459-3.2275-1e-4 -1.0328 0.25809-2.0656 0.77459-3.0984-4.0452 0.51639-8.6928 0.7746-13.943 0.7746m0-46.734c-1.8075 0-3.0555 0.81761-3.7439 2.4529-0.17225 0.43033-0.2583 0.86068-0.2582 1.291-1e-4 1.8935 0.94662 3.1414 2.8402 3.7439 0.34416 0.08607 0.73147 0.12911 1.1619 0.12911 1.9794 0 3.2704-0.90372 3.873-2.7111 0.08595-0.34428 0.12898-0.73158 0.12911-1.1619-1.3e-4 -1.7213-0.86078-2.8832-2.582-3.4857-0.5165-0.17214-0.98988-0.25819-1.4201-0.25819m0 54.867c-3.2706 0-7.4879 0.30124-12.652 0.9037-1.4631 0.17215-2.3238 0.98977-2.582 2.4529 0 1.0328 2.3667 1.6783 7.1005 1.9365-0.43044-0.08607-0.2583-0.12911 0.51641-0.12911h7.6169c10.07 0 15.105-0.60246 15.105-1.8074-1.2e-4 -1.9795-2.496-3.0554-7.4878-3.2275h-3.7439c-1.119 0-2.0657-0.04304-2.8402-0.12911h-1.0328m-0.12911-11.877c9.6394 0 15.535-0.90369 17.687-2.7111 1.463-1.1189 2.5388-4.0882 3.2275-8.9079-0.43044-4.3033-3.2276-8.4345-8.3915-12.394-4.8198-3.7869-9.0371-5.8956-12.652-6.3259-3.3567 0.43034-7.4449 2.539-12.264 6.3259-5.0779 3.9591-7.832 8.0903-8.2624 12.394 0.60248 4.4755 1.5492 7.3157 2.8402 8.5206 0.34426 0.34427 0.73157 0.6455 1.1619 0.90369 2.1517 1.4632 7.7029 2.1947 16.654 2.1947m-2.1947-6.3259v-5.6804h-4.3894v-5.0349h4.3894v-5.5513h4.6476v5.5513h4.3894v5.0349h-4.3894v5.6804h-4.6476m2.0656 26.336c-0.77469 0-3.0555 1.5062-6.8423 4.5185-2.6682 1.8074-6.9714 2.8832-12.91 3.2275-4.3033 0-7.746 0.21516-10.328 0.6455-2.7541 0.60246-4.1312 1.7644-4.1312 3.4857 0.2582 1.7213 1.1619 2.582 2.7111 2.582l6.8423-1.0328c4.4754 0 9.1661-0.60246 14.072-1.8074 5.5942-1.4631 9.209-3.7869 10.844-6.9714 2.3237 4.5616 8.3483 7.3157 18.074 8.2624l3.3566 0.51641h3.3566l6.9714 1.0328c1.5491 0 2.4528-0.86067 2.7111-2.582-1e-4 -1.7213-1.3772-2.8832-4.1312-3.4857l-13.814-1.0328c-4.3895-0.34427-8.6068-2.0656-12.652-5.164-1.8075-1.4632-3.1846-2.1947-4.1312-2.1947m0.25821 11.232c-3.3567 3.3566-8.4346 5.4222-15.234 6.1968-2.7541 0.25819-7.5739 0.86066-14.459 1.8074-1.8074 0.34428-2.8402 1.1619-3.0984 2.4529-1.6353-0.43033-4.0451-3.0984-7.2296-8.0042-0.7746-1.2049-1.334-2.0226-1.6783-2.4529 2.8402-5.4222 6.3689-8.1333 10.586-8.1333l7.6169 0.3873c3.5287 0 7.6599-0.81764 12.394-2.4529-6.1107-0.77459-9.1661-2.625-9.1661-5.5513l2.582-9.8116v-0.25822c-5.164-5.6804-7.746-11.017-7.746-16.008 0-5.6804 2.7972-10.844 8.3915-15.492 4.9057-4.1312 8.5205-6.3259 10.844-6.5841-1.8936-2.3238-2.8403-4.7336-2.8402-7.2296-1.1e-4 -3.9591 1.9794-6.455 5.9386-7.4878 0.94662-0.25809 1.9794-0.3872 3.0984-0.38731 4.2172 1.1e-4 6.9713 1.5922 8.2624 4.7767l0.6455 2.7111v0.38728c-1e-4 2.6681-0.90382 5.0779-2.7111 7.2296 2.3237 0.25821 5.9815 2.4959 10.974 6.7132 5.5081 4.5615 8.2623 9.6825 8.2624 15.363-1.1e-4 4.8197-2.5821 10.156-7.746 16.008-1e-4 1.205 0.43023 2.9263 1.291 5.164 0.86056 2.7541 1.2909 4.3894 1.291 4.9058-1e-4 2.9263-3.0555 4.7767-9.1661 5.5513 4.6475 1.6353 8.7787 2.4529 12.394 2.4529l7.6169-0.3873c4.2172 0 7.7459 2.7111 10.586 8.1333l-4.3894 6.7132c-1.4632 1.8935-2.9694 3.1414-4.5185 3.7439-0.34438-1.7213-2.8403-2.7972-7.4878-3.2275 0.60235 0-0.68864-0.12911-3.873-0.3873-10.758-1.0328-17.902-3.3136-21.431-6.8423"
       id="path20"
       inkscape:export-xdpi="161.1528"
       inkscape:export-ydpi="161.1528" />
  </g>
  <g
     id="g1111">
    <path
       style="fill:#ffffff;stroke:#000000;stroke-width:1px;stroke-linecap:butt;stroke-linejoin:miter;stroke-opacity:1;fill-opacity:1"
       d="m 759.78623,237.23432 -15.64473,35.62051 5.65685,7.24784 4.94975,-1.32582 3.62392,4.06586 10.69499,-12.63953 10.51821,-5.65686 1.23744,8.13173 -14.67246,23.33453 48.70198,0.26516 -1.41422,-29.6101 -11.13693,-21.47836 -15.29118,-9.104 -5.92202,-0.61872 -3.71231,-8.75045 -6.80591,5.39169 -10.51821,-5.12652 z"
       id="path1103" />
    <path
       d="m750.65 268.68c1.2049 0 1.8074 0.81763 1.8074 2.4529 0 2.1517-1.0758 3.2275-3.2275 3.2275-0.86065 0-1.291-0.68853-1.291-2.0656 0-2.4099 0.90369-3.6148 2.7111-3.6148m9.2952-15.75c-1.2049 0-1.8074-0.73155-1.8074-2.1947 0-2.3238 1.3771-4.2172 4.1312-5.6804 1.2049-0.60246 2.3238-0.90369 3.3566-0.90369 1.8074 0 2.7972 0.60246 2.9693 1.8074 0 1.9795-1.5492 3.873-4.6476 5.6804-1.5492 0.86069-2.8832 1.291-4.0021 1.291m1.0328-24.271c0.34426 1.2049 0.51639 2.0226 0.51639 2.4529 0 0.25821-0.12909 0.94673-0.3873 2.0656 1.3771 0 3.2706-0.68853 5.6804-2.0656-2.3238-1.2049-4.2603-2.0226-5.8095-2.4529m-15.363 44.41c0.51641 2.0656 1.8935 3.5718 4.1312 4.5185 0.86067 0.34427 1.6783 0.51639 2.4529 0.51639h0.25821c0.17213 0 1.1189-0.51639 2.8402-1.5492 0.51639-0.34427 0.94673-0.51639 1.291-0.51639h0.51639c0.43033 0 0.64552 0.25819 0.64552 0.77458l-0.77461 2.4529c0 0.7746 0.60246 1.1619 1.8074 1.1619 0.17214 0 1.248-1.5062 3.2275-4.5185 3.7869-5.8525 9.1661-10.285 16.137-13.297 0.68852-4.6476 2.4099-8.7358 5.164-12.264 0.68854-0.94674 1.3771-1.4201 2.0656-1.4201 0.77461 0 1.1619 0.55943 1.1619 1.6783 0 0.25822-0.7746 2.7111-2.3238 7.3587-0.60247 1.9795-0.90371 3.4427-0.90371 4.3894 0 0.25819 0.08607 0.81763 0.25822 1.6783 0 6.1107-2.582 12.523-7.746 19.236-3.4427 4.6476-5.3361 8.3485-5.6804 11.103h42.603c0.34428-3.9591 0.51641-6.8853 0.51641-8.7788 0-17.73-5.5513-31.888-16.654-42.474-3.3566-3.0984-6.0677-4.6476-8.1333-4.6476h-7.746c-0.68854-0.34427-1.3771-2.0656-2.0656-5.164-0.51639-2.4959-1.1619-4.0451-1.9365-4.6476-1.0328 3.0984-4.2173 5.5083-9.5534 7.2296-2.8402 0.86066-4.8197 1.7213-5.9386 2.582-0.94673 3.0123-3.7439 9.1231-8.3915 18.332-4.5615 9.123-6.9714 14.545-7.2296 16.267m72.296 26.078h-54.093c0.34426-5.9386 2.582-11.619 6.7132-17.041 3.1845-4.3033 5.0779-6.9284 5.6804-7.8751 1.2049-1.8935 1.9365-4.1742 2.1947-6.8423-5.5943 2.4098-9.9407 5.8525-13.039 10.328l-1.8074 2.9693c-1.291 2.0656-2.1086 3.2275-2.4529 3.4857-0.51639 0.43033-1.0758 0.6455-1.6783 0.6455-2.668 0-4.4755-0.9037-5.4222-2.7111-0.17215-0.2582-0.25821-0.55943-0.25821-0.9037-0.86067 0.43033-1.7213 0.6455-2.582 0.6455-4.1312 0-7.4017-2.582-9.8116-7.746 0.68853-3.7869 4.3033-12.523 10.844-26.207 0.68854-1.291 1.205-2.3238 1.5492-3.0984 2.582-5.7665 3.873-10.113 3.873-13.039 0-0.43032-0.25819-2.8402-0.77461-7.2296h1.0328c4.6476 0 9.08 1.4631 13.297 4.3894 2.3238-4.0451 4.2603-6.0677 5.8095-6.0677 2.7541 1.4631 4.6476 3.5287 5.6804 6.1968l1.4201 4.2603c0.86065-0.17214 1.5922-0.2582 2.1947-0.2582 6.8853 0 13.685 4.3894 20.398 13.168 7.8321 10.242 11.748 24.271 11.748 42.087 0 4.0451-0.17212 7.6599-0.51639 10.844"
       id="path22" />
  </g>
  <g
     inkscape:export-ydpi="189.69359"
     inkscape:export-xdpi="189.69359"
     id="g1145">
    <path
       style="fill:#ffffff;stroke:#000000;stroke-width:1px;stroke-linecap:butt;stroke-linejoin:miter;stroke-opacity:1;fill-opacity:1"
       d="m 941.51268,232.37297 1.32582,8.66205 -7.68978,8.13173 1.85615,11.57887 4.15425,3.0936 -8.04334,8.57367 -7.24784,7.24784 -1.67938,16.61701 50.02781,0.61872 -1.14905,-14.49569 -12.28598,-15.64474 -4.5962,-2.91681 8.57367,-6.45235 -2.91681,-12.37437 -5.92202,-5.56847 0.7071,-9.104 -6.62912,-5.48007 -8.75045,4.59619 z"
       id="path1141" />
    <path
       d="m 972.16,293.99 c -10e-5,-9.037 -2.453,-15.793 -7.3587,-20.269 -1.6354,-1.5492 -3.6579,-3.0123 -6.0677,-4.3894 -3.3567,-1.9795 -5.035,-3.7869 -5.0349,-5.4222 -10e-5,-0.86067 0.86055,-1.8074 2.582,-2.8402 2.668,-1.4631 4.2602,-3.1845 4.7767,-5.164 0.17202,-0.77458 0.25809,-1.7213 0.25819,-2.8402 -1e-4,-3.9591 -2.0227,-7.0575 -6.0677,-9.2952 l -2.3238,-1.6783 c -0.43045,-0.43032 -0.64561,-0.9037 -0.6455,-1.4201 -1.1e-4,-1.4631 0.51628,-2.9263 1.5492,-4.3894 0.68843,-0.94672 1.0327,-2.0656 1.0328,-3.3566 -10e-5,-2.2377 -1.205,-3.873 -3.6148,-4.9058 -0.77471,-0.25821 -1.5493,-0.3873 -2.3238,-0.3873 -2.41,0 -4.1313,1.0758 -5.164,3.2275 -0.34436,0.68854 -0.51651,1.3771 -0.51641,2.0656 -10e-5,0.77461 0.55935,2.2377 1.6783,4.3894 0.68843,1.2049 0.98966,2.3238 0.90372,3.3566 -1.4e-4,1.0328 -0.9899,2.0656 -2.9693,3.0984 -3.9592,2.3238 -5.9387,5.4222 -5.9386,9.2952 -1.3e-4,3.3566 1.6782,6.0247 5.0349,8.0042 1.6352,1.1188 2.4528,2.0656 2.4529,2.8402 -1.1e-4,1.6353 -1.6784,3.4427 -5.0349,5.4222 -6.1968,3.7869 -10.156,8.3915 -11.877,13.814 -0.94673,3.0123 -1.4201,6.6271 -1.4201,10.844 h 46.089 m -50.607,5.164 c -0.0861,-1.0328 -0.12911,-3.0123 -0.12911,-5.9386 0,-10.586 3.0984,-18.504 9.2952,-23.754 2.0656,-1.7213 4.6905,-3.3996 7.8751,-5.0349 -3.2705,-1.0328 -5.4652,-3.5288 -6.5841,-7.4878 -0.43032,-1.291 -0.6455,-2.625 -0.6455,-4.0021 0,-5.7664 2.9263,-9.8977 8.7788,-12.394 -1.3772,-2.496 -2.0657,-4.9488 -2.0656,-7.3587 -1.1e-4,-3.9591 1.9364,-6.8853 5.8095,-8.7788 1.6352,-0.77461 3.3995,-1.1619 5.2931,-1.1619 4.3893,0 7.6168,1.6783 9.6825,5.0349 0.94663,1.4631 1.42,3.0984 1.4201,4.9058 -10e-5,2.3238 -0.77471,4.7767 -2.3238,7.3587 5.9385,2.4099 8.9078,6.541 8.9079,12.394 -1.1e-4,4.5616 -1.6784,8.0042 -5.0349,10.328 -0.68863,0.51641 -1.4632,0.90371 -2.3238,1.1619 7.7459,3.9591 12.781,8.994 15.105,15.105 1.463,3.7869 2.1946,8.3485 2.1947,13.685 -10e-5,2.8402 -0.0431,4.8197 -0.12911,5.9386 h -55.126"
       id="path24"
       inkscape:export-xdpi="189.69359"
       inkscape:export-ydpi="189.69359" />
  </g>
</svg>
