ALEPH_1991_S2435284
ALEPH_1996_S3486095
CDF_1990_S2089246
CDF_1994_S2952106
CDF_2000_S4155203
CDF_2001_S4751469
CDF_2002_S4796047
CDF_2004_S5839831
CDF_2005_S6217184
CDF_2006_S6653332
CDF_2007_S7057202
CDF_2008_LEADINGJETS
CDF_2008_NOTE_9351
CDF_2008_S7540469
CDF_2008_S7541902
CDF_2008_S7782535
CDF_2008_S7828950
CDF_2008_S8095620
CDF_2009_S8057893
CDF_2009_S8233977
D0_2001_S4674421
D0_2004_S5992206
D0_2006_S6438750
D0_2007_S7075677
D0_2008_S6879055
D0_2008_S7554427
D0_2008_S7662670
D0_2008_S7719523
D0_2008_S7837160
D0_2008_S7863608
D0_2009_S8202443
DELPHI_1995_S3137023
DELPHI_1996_S3430090
DELPHI_2002_069_CONF_603
DELPHI_2003_WUD_03_11
ExampleAnalysis
ExampleTree
H1_1994_S2919893
H1_1995_S3167097
H1_2000_S4129130
JADE_OPAL_2000_S4300807
MC_LHC_LEADINGJETS
MC_TVT1960_ZJETS
OPAL_1998_S3780481
OPAL_2004_S6132243
PDG_Hadron_Multiplicities
PDG_Hadron_Multiplicities_Ratios
STAR_2006_S6870392
STAR_2008_S7993412
STAR_2009_UE_HELEN
StdAnalyses
ZEUS_2001_S4815815
