
(footprint GCT_FFC3B07-10-T (layer F.Cu) (tedit 65CDDB9F)
  (descr "")
  (attr smd)
  (fp_text reference REF** (at -5.575 -4.585 0) (layer F.SilkS)
    (effects (font (size 1.0 1.0) (thickness 0.15)))
  )
  (fp_text value GCT_FFC3B07-10-T (at 1.41 5.165 0) (layer F.Fab)
    (effects (font (size 1.0 1.0) (thickness 0.15)))
  )
  (pad 4 smd rect (at 1.5 -2.45) (size 0.6 1.7) (layers F.Cu F.Mask F.Paste) (solder_mask_margin 0.102))
  (pad 3 smd rect (at 2.5 -2.45) (size 0.6 1.7) (layers F.Cu F.Mask F.Paste) (solder_mask_margin 0.102))
  (pad 2 smd rect (at 3.5 -2.45) (size 0.6 1.7) (layers F.Cu F.Mask F.Paste) (solder_mask_margin 0.102))
  (pad 1 smd rect (at 4.5 -2.45) (size 0.6 1.7) (layers F.Cu F.Mask F.Paste) (solder_mask_margin 0.102))
  (pad S2 smd rect (at -7.25 0.0) (size 2.5 2.8) (layers F.Cu F.Mask F.Paste) (solder_mask_margin 0.102))
  (pad S1 smd rect (at 7.25 0.0) (size 2.5 2.8) (layers F.Cu F.Mask F.Paste) (solder_mask_margin 0.102))
  (pad 5 smd rect (at 0.5 -2.45) (size 0.6 1.7) (layers F.Cu F.Mask F.Paste) (solder_mask_margin 0.102))
  (pad 6 smd rect (at -0.5 -2.45) (size 0.6 1.7) (layers F.Cu F.Mask F.Paste) (solder_mask_margin 0.102))
  (pad 7 smd rect (at -1.5 -2.45) (size 0.6 1.7) (layers F.Cu F.Mask F.Paste) (solder_mask_margin 0.102))
  (pad 8 smd rect (at -2.5 -2.45) (size 0.6 1.7) (layers F.Cu F.Mask F.Paste) (solder_mask_margin 0.102))
  (pad 9 smd rect (at -3.5 -2.45) (size 0.6 1.7) (layers F.Cu F.Mask F.Paste) (solder_mask_margin 0.102))
  (pad 10 smd rect (at -4.5 -2.45) (size 0.6 1.7) (layers F.Cu F.Mask F.Paste) (solder_mask_margin 0.102))
  (fp_line (start -8.5 -1.35) (end 8.5 -1.35) (layer F.Fab) (width 0.1))
  (fp_line (start 8.5 -1.35) (end 8.5 3.95) (layer F.Fab) (width 0.1))
  (fp_line (start 8.5 3.95) (end -8.5 3.95) (layer F.Fab) (width 0.1))
  (fp_line (start -8.5 3.95) (end -8.5 -1.35) (layer F.Fab) (width 0.1))
  (fp_line (start -8.5 1.8) (end -8.5 3.95) (layer F.SilkS) (width 0.2))
  (fp_line (start -8.5 3.95) (end 8.5 3.95) (layer F.SilkS) (width 0.2))
  (fp_line (start 8.5 3.95) (end 8.5 1.8) (layer F.SilkS) (width 0.2))
  (fp_line (start -8.75 -3.55) (end -8.75 4.2) (layer F.CrtYd) (width 0.05))
  (fp_line (start -8.75 4.2) (end 8.75 4.2) (layer F.CrtYd) (width 0.05))
  (fp_line (start 8.75 4.2) (end 8.75 -3.55) (layer F.CrtYd) (width 0.05))
  (fp_line (start 8.75 -3.55) (end -8.75 -3.55) (layer F.CrtYd) (width 0.05))
  (fp_circle (center 4.5 -4.05) (end 4.6 -4.05) (layer F.Fab) (width 0.2))
  (fp_circle (center 4.5 -4.05) (end 4.6 -4.05) (layer F.SilkS) (width 0.2))
)