M48
; DRILL file {KiCad 7.0.7} date Mon Aug 12 11:48:13 2024
; FORMAT={-:-/ absolute / metric / decimal}
; #@! TF.CreationDate,2024-08-12T11:48:13+02:00
; #@! TF.GenerationSoftware,Kicad,Pcbnew,7.0.7
; #@! TF.FileFunction,NonPlated,1,4,NPTH
FMAT,2
METRIC
; #@! TA.AperFunction,NonPlated,NPTH,ComponentDrill
T1C2.000
; #@! TA.AperFunction,NonPlated,NPTH,ComponentDrill
T2C3.200
%
G90
G05
T1
X102.417Y-66.325
X102.417Y-75.225
T2
X65.875Y-46.775
X65.875Y-94.775
X105.875Y-46.775
X105.875Y-94.775
T0
M30
