%TF.GenerationSoftware,KiCad,Pcbnew,7.0.7*%
%TF.CreationDate,2023-08-25T16:24:43+02:00*%
%TF.ProjectId,Dark Sky v2r0,4461726b-2053-46b7-9920-763272302e6b,rev?*%
%TF.SameCoordinates,Original*%
%TF.FileFunction,Profile,NP*%
%FSLAX46Y46*%
G04 Gerber Fmt 4.6, Leading zero omitted, Abs format (unit mm)*
G04 Created by KiCad (PCBNEW 7.0.7) date 2023-08-25 16:24:43*
%MOMM*%
%LPD*%
G01*
G04 APERTURE LIST*
%TA.AperFunction,Profile*%
%ADD10C,0.100000*%
%TD*%
G04 APERTURE END LIST*
D10*
X59625000Y-44000000D02*
X109450000Y-44000000D01*
X109450000Y-97500000D01*
X59625000Y-97500000D01*
X59625000Y-44000000D01*
X102903553Y-80653553D02*
X102900001Y-89096447D01*
X101750000Y-90100000D02*
G75*
G03*
X102250001Y-90600000I500000J0D01*
G01*
X101753553Y-79650000D02*
X101750000Y-90100000D01*
X102899953Y-89096447D02*
G75*
G03*
X103400001Y-89596447I500047J47D01*
G01*
X103403553Y-80153553D02*
G75*
G03*
X102903553Y-80653553I47J-500047D01*
G01*
X107750000Y-79150000D02*
X102253553Y-79150000D01*
X103400001Y-89596447D02*
X107746448Y-89600000D01*
X107750000Y-80150000D02*
X103403553Y-80153553D01*
X102250001Y-90600000D02*
X107746448Y-90600000D01*
X107746448Y-90600000D02*
G75*
G03*
X107746448Y-89600000I-48J500000D01*
G01*
X107750000Y-80150000D02*
G75*
G03*
X107750000Y-79150000I0J500000D01*
G01*
X102253553Y-79149953D02*
G75*
G03*
X101753553Y-79650000I47J-500047D01*
G01*
M02*
