(footprint "CONN_FFC3B07-12-T_GCC" (version 20211014) (generator pcbnew)
  (layer "F.Cu")
  (tags "FFC3B07-12-T ")
  (attr smd)
  (fp_text reference "REF**" (at 0 -3.079001 unlocked) (layer F.SilkS)
    (effects (font (size 1 1) (thickness 0.15)))
  )
  (fp_text value CONN_FFC3B07-12-T_GCC (at 0 -3.079001 unlocked) (layer F.Fab)
    (effects (font (size 1 1) (thickness 0.15)))
  )
  (fp_text user "${REFERENCE}" (at 0 -3.079001 unlocked) (layer F.Fab)
    (effects (font (size 1 1) (thickness 0.15)))
  )
  (fp_line (start -9.8298 -4.183901) (end -9.8298 3.683) (layer "F.CrtYd") (width 0.1524))
  (fp_line (start -9.8298 3.683) (end 9.8298 3.683) (layer "F.CrtYd") (width 0.1524))
  (fp_line (start 9.8298 3.683) (end 9.8298 -4.183901) (layer "F.CrtYd") (width 0.1524))
  (fp_line (start 9.8298 -4.183901) (end -9.8298 -4.183901) (layer "F.CrtYd") (width 0.1524))
  (fp_circle (center -5.499999 -4.984001) (end -5.118999 -4.984001) (layer "F.Fab") (width 0.508) (fill none))
  (fp_circle (center -11.4808 -3.079001) (end -11.0998 -3.079001) (layer "F.SilkS") (width 0.508) (fill none))
  (fp_circle (center -11.4808 -3.079001) (end -11.0998 -3.079001) (layer "B.SilkS") (width 0.508) (fill none))
  (fp_line (start -9.7028 3.556) (end 9.7028 3.556) (layer "F.SilkS") (width 0.1524))
  (fp_line (start 9.7028 3.556) (end 9.7028 0.943628) (layer "F.SilkS") (width 0.1524))
  (fp_line (start 9.7028 -3.556001) (end 6.137539 -3.556001) (layer "F.SilkS") (width 0.1524))
  (fp_line (start -9.7028 -3.556001) (end -9.7028 -2.201629) (layer "F.SilkS") (width 0.1524))
  (fp_line (start -9.5758 3.429) (end 9.5758 3.429) (layer "F.Fab") (width 0.0254))
  (fp_line (start 9.5758 3.429) (end 9.5758 -3.429001) (layer "F.Fab") (width 0.0254))
  (fp_line (start 9.5758 -3.429001) (end -9.5758 -3.429001) (layer "F.Fab") (width 0.0254))
  (fp_line (start -9.5758 -3.429001) (end -9.5758 3.429) (layer "F.Fab") (width 0.0254))
  (fp_line (start -6.137539 -3.556001) (end -9.7028 -3.556001) (layer "F.SilkS") (width 0.1524))
  (fp_line (start -9.7028 0.943628) (end -9.7028 3.556) (layer "F.SilkS") (width 0.1524))
  (fp_line (start 9.7028 -2.201629) (end 9.7028 -3.556001) (layer "F.SilkS") (width 0.1524))
  (pad "1" smd rect (at -5.499999 -3.079001) (size 0.6096 1.7018) (layers "F.Cu" "F.Paste" "F.Mask"))
  (pad "2" smd rect (at -4.500001 -3.079001) (size 0.6096 1.7018) (layers "F.Cu" "F.Paste" "F.Mask"))
  (pad "3" smd rect (at -3.500001 -3.079001) (size 0.6096 1.7018) (layers "F.Cu" "F.Paste" "F.Mask"))
  (pad "4" smd rect (at -2.5 -3.079001) (size 0.6096 1.7018) (layers "F.Cu" "F.Paste" "F.Mask"))
  (pad "5" smd rect (at -1.5 -3.079001) (size 0.6096 1.7018) (layers "F.Cu" "F.Paste" "F.Mask"))
  (pad "6" smd rect (at -0.500002 -3.079001) (size 0.6096 1.7018) (layers "F.Cu" "F.Paste" "F.Mask"))
  (pad "7" smd rect (at 0.499999 -3.079001) (size 0.6096 1.7018) (layers "F.Cu" "F.Paste" "F.Mask"))
  (pad "8" smd rect (at 1.5 -3.079001) (size 0.6096 1.7018) (layers "F.Cu" "F.Paste" "F.Mask"))
  (pad "9" smd rect (at 2.5 -3.079001) (size 0.6096 1.7018) (layers "F.Cu" "F.Paste" "F.Mask"))
  (pad "10" smd rect (at 3.500001 -3.079001) (size 0.6096 1.7018) (layers "F.Cu" "F.Paste" "F.Mask"))
  (pad "11" smd rect (at 4.499999 -3.079001) (size 0.6096 1.7018) (layers "F.Cu" "F.Paste" "F.Mask"))
  (pad "12" smd rect (at 5.499999 -3.079001) (size 0.6096 1.7018) (layers "F.Cu" "F.Paste" "F.Mask"))
  (pad "13" smd rect (at -8.250001 -0.629 90) (size 2.4892 2.794) (layers "F.Cu" "F.Paste" "F.Mask"))
  (pad "14" smd rect (at 8.250001 -0.629 90) (size 2.4892 2.794) (layers "F.Cu" "F.Paste" "F.Mask"))
)
