(footprint "MOD144_EC200U_QWS" (version 20211014) (generator pcbnew)
  (layer "F.Cu")
  (tags "EC200UEUAA-N05-MN0AA ")
  (attr smd)
  (fp_text reference "REF**" (at 0 0 unlocked) (layer F.SilkS)
    (effects (font (size 1 1) (thickness 0.15)))
  )
  (fp_text value MOD144_EC200U_QWS (at 0 0 unlocked) (layer F.Fab)
    (effects (font (size 1 1) (thickness 0.15)))
  )
  (fp_text user "${REFERENCE}" (at 0 0 unlocked) (layer F.Fab)
    (effects (font (size 1 1) (thickness 0.15)))
  )
  (fp_text user "*" (at -17.635055 -12.6) (layer F.SilkS)
    (effects (font (size 1 1) (thickness 0.15)))
  )
  (fp_text user "*" (at -13.864934 -12.6) (layer F.Fab)
    (effects (font (size 1 1) (thickness 0.15)))
  )
  (fp_line (start -15.494 13.9954) (end 15.494 13.9954) (layer "F.Fab") (width 0.0254))
  (fp_line (start 15.494 13.9954) (end 15.494 -13.9954) (layer "F.Fab") (width 0.0254))
  (fp_line (start 15.494 -13.9954) (end -15.494 -13.9954) (layer "F.Fab") (width 0.0254))
  (fp_line (start -15.494 -13.9954) (end -15.494 13.9954) (layer "F.Fab") (width 0.0254))
  (fp_text user "*" (at -17.635055 -12.6 unlocked) (layer "F.SilkS")
    (effects (font (size 1 1) (thickness 0.15)))
  )
  (fp_text user "*" (at -13.864934 -12.6 unlocked) (layer "F.Fab")
    (effects (font (size 1 1) (thickness 0.15)))
  )
  (fp_poly (pts
      (xy -7.200002 -11.099997)
      (xy -7.200002 -8.100003)
      (xy -9.199998 -8.100003)
      (xy -9.199998 -10.53431)
      (xy -8.63431 -11.099997)
    ) (layer "F.Mask") (width 0) (fill solid))
  (fp_line (start -15.621 14.1224) (end -15.621 13.332738) (layer "F.SilkS") (width 0.1524))
  (fp_line (start -15.621 -14.1224) (end -12.882738 -14.1224) (layer "F.SilkS") (width 0.1524))
  (fp_line (start 15.621 -14.1224) (end 15.621 -13.332738) (layer "F.SilkS") (width 0.1524))
  (fp_line (start 15.621 14.1224) (end 13.282738 14.1224) (layer "F.SilkS") (width 0.1524))
  (fp_line (start -15.621 -13.332741) (end -15.621 -14.1224) (layer "F.SilkS") (width 0.1524))
  (fp_line (start -15.621 -3.732739) (end -15.621 -4.067259) (layer "F.SilkS") (width 0.1524))
  (fp_line (start -12.882741 14.1224) (end -15.621 14.1224) (layer "F.SilkS") (width 0.1524))
  (fp_line (start 15.621 13.332741) (end 15.621 14.1224) (layer "F.SilkS") (width 0.1524))
  (fp_line (start 15.621 -4.067259) (end 15.621 -3.732739) (layer "F.SilkS") (width 0.1524))
  (fp_line (start 13.282741 -14.1224) (end 15.621 -14.1224) (layer "F.SilkS") (width 0.1524))
  (fp_line (start 13.204001 -14.2494) (end 13.204001 -15.754058) (layer "F.CrtYd") (width 0.1524))
  (fp_line (start 13.204001 -15.754058) (end -12.803998 -15.754058) (layer "F.CrtYd") (width 0.1524))
  (fp_line (start -12.803998 -15.754058) (end -12.803998 -14.2494) (layer "F.CrtYd") (width 0.1524))
  (fp_line (start -12.803998 -14.2494) (end -15.748 -14.2494) (layer "F.CrtYd") (width 0.1524))
  (fp_line (start -15.748 -14.2494) (end -15.748 -13.254001) (layer "F.CrtYd") (width 0.1524))
  (fp_line (start -15.748 -13.254001) (end -17.254055 -13.254001) (layer "F.CrtYd") (width 0.1524))
  (fp_line (start -17.254055 -13.254001) (end -17.254055 -4.145999) (layer "F.CrtYd") (width 0.1524))
  (fp_line (start -17.254055 -4.145999) (end -15.748 -4.145999) (layer "F.CrtYd") (width 0.1524))
  (fp_line (start -15.748 -4.145999) (end -15.748 -3.653999) (layer "F.CrtYd") (width 0.1524))
  (fp_line (start -15.748 -3.653999) (end -17.254055 -3.653999) (layer "F.CrtYd") (width 0.1524))
  (fp_line (start -17.254055 -3.653999) (end -17.254055 13.253998) (layer "F.CrtYd") (width 0.1524))
  (fp_line (start -17.254055 13.253998) (end -15.748 13.253998) (layer "F.CrtYd") (width 0.1524))
  (fp_line (start -15.748 13.253998) (end -15.748 14.2494) (layer "F.CrtYd") (width 0.1524))
  (fp_line (start -15.748 14.2494) (end -12.804001 14.2494) (layer "F.CrtYd") (width 0.1524))
  (fp_line (start -12.804001 14.2494) (end -12.804001 15.754058) (layer "F.CrtYd") (width 0.1524))
  (fp_line (start -12.804001 15.754058) (end 13.203998 15.754058) (layer "F.CrtYd") (width 0.1524))
  (fp_line (start 13.203998 15.754058) (end 13.203998 14.2494) (layer "F.CrtYd") (width 0.1524))
  (fp_line (start 13.203998 14.2494) (end 15.748 14.2494) (layer "F.CrtYd") (width 0.1524))
  (fp_line (start 15.748 14.2494) (end 15.748 13.254001) (layer "F.CrtYd") (width 0.1524))
  (fp_line (start 15.748 13.254001) (end 17.254055 13.254001) (layer "F.CrtYd") (width 0.1524))
  (fp_line (start 17.254055 13.254001) (end 17.254055 -3.653999) (layer "F.CrtYd") (width 0.1524))
  (fp_line (start 17.254055 -3.653999) (end 15.748 -3.653999) (layer "F.CrtYd") (width 0.1524))
  (fp_line (start 15.748 -3.653999) (end 15.748 -4.145999) (layer "F.CrtYd") (width 0.1524))
  (fp_line (start 15.748 -4.145999) (end 17.254055 -4.145999) (layer "F.CrtYd") (width 0.1524))
  (fp_line (start 17.254055 -4.145999) (end 17.254055 -13.253998) (layer "F.CrtYd") (width 0.1524))
  (fp_line (start 17.254055 -13.253998) (end 15.748 -13.253998) (layer "F.CrtYd") (width 0.1524))
  (fp_line (start 15.748 -13.253998) (end 15.748 -14.2494) (layer "F.CrtYd") (width 0.1524))
  (fp_line (start 15.748 -14.2494) (end 13.204001 -14.2494) (layer "F.CrtYd") (width 0.1524))
  (fp_poly (pts
      (xy -7.200002 -11.099997)
      (xy -7.200002 -8.100003)
      (xy -9.199998 -8.100003)
      (xy -9.199998 -10.53431)
      (xy -8.63431 -11.099997)
    ) (layer "F.Cu") (width 0) (fill solid))
  (fp_poly (pts
      (xy -7.200002 -11.099997)
      (xy -7.200002 -8.100003)
      (xy -9.199998 -8.100003)
      (xy -9.199998 -10.53431)
      (xy -8.63431 -11.099997)
    ) (layer "F.Paste") (width 0) (fill solid))
  (pad "1" smd rect (at -15.749994 -12.600001) (size 2.500122 0.8) (layers "F.Cu" "F.Paste" "F.Mask"))
  (pad "2" smd rect (at -15.749994 -11.299998) (size 2.500122 0.8) (layers "F.Cu" "F.Paste" "F.Mask"))
  (pad "3" smd rect (at -15.749994 -9.999998) (size 2.500122 0.8) (layers "F.Cu" "F.Paste" "F.Mask"))
  (pad "4" smd rect (at -15.749994 -8.699998) (size 2.500122 0.8) (layers "F.Cu" "F.Paste" "F.Mask"))
  (pad "5" smd rect (at -15.749994 -7.399998) (size 2.500122 0.8) (layers "F.Cu" "F.Paste" "F.Mask"))
  (pad "6" smd rect (at -15.749994 -6.099998) (size 2.500122 0.8) (layers "F.Cu" "F.Paste" "F.Mask"))
  (pad "7" smd rect (at -15.749994 -4.799999) (size 2.500122 0.8) (layers "F.Cu" "F.Paste" "F.Mask"))
  (pad "141" smd rect (at -15.749994 -2.999999) (size 2.500122 0.8) (layers "F.Cu" "F.Paste" "F.Mask"))
  (pad "142" smd rect (at -15.749994 -1.699999) (size 2.500122 0.8) (layers "F.Cu" "F.Paste" "F.Mask"))
  (pad "8" smd rect (at -15.749994 -0.399999) (size 2.500122 0.8) (layers "F.Cu" "F.Paste" "F.Mask"))
  (pad "9" smd rect (at -15.749994 0.900001) (size 2.500122 0.8) (layers "F.Cu" "F.Paste" "F.Mask"))
  (pad "10" smd rect (at -15.749994 2.200001) (size 2.500122 0.8) (layers "F.Cu" "F.Paste" "F.Mask"))
  (pad "11" smd rect (at -15.749994 3.500001) (size 2.500122 0.8) (layers "F.Cu" "F.Paste" "F.Mask"))
  (pad "12" smd rect (at -15.749994 4.800001) (size 2.500122 0.8) (layers "F.Cu" "F.Paste" "F.Mask"))
  (pad "13" smd rect (at -15.749994 6.099998) (size 2.500122 0.8) (layers "F.Cu" "F.Paste" "F.Mask"))
  (pad "14" smd rect (at -15.749994 7.399998) (size 2.500122 0.8) (layers "F.Cu" "F.Paste" "F.Mask"))
  (pad "15" smd rect (at -15.749994 8.699998) (size 2.500122 0.8) (layers "F.Cu" "F.Paste" "F.Mask"))
  (pad "16" smd rect (at -15.749994 9.999998) (size 2.500122 0.8) (layers "F.Cu" "F.Paste" "F.Mask"))
  (pad "17" smd rect (at -15.749994 11.299998) (size 2.500122 0.8) (layers "F.Cu" "F.Paste" "F.Mask"))
  (pad "18" smd rect (at -15.749994 12.599998) (size 2.500122 0.8) (layers "F.Cu" "F.Paste" "F.Mask"))
  (pad "116" smd rect (at -12.150001 14.249997 90) (size 2.500122 0.8) (layers "F.Cu" "F.Paste" "F.Mask"))
  (pad "115" smd rect (at -10.850001 14.249997 90) (size 2.500122 0.8) (layers "F.Cu" "F.Paste" "F.Mask"))
  (pad "19" smd rect (at -9.550001 14.249997 90) (size 2.500122 0.8) (layers "F.Cu" "F.Paste" "F.Mask"))
  (pad "20" smd rect (at -8.250001 14.249997 90) (size 2.500122 0.8) (layers "F.Cu" "F.Paste" "F.Mask"))
  (pad "21" smd rect (at -6.950001 14.249997 90) (size 2.500122 0.8) (layers "F.Cu" "F.Paste" "F.Mask"))
  (pad "22" smd rect (at -5.650001 14.249997 90) (size 2.500122 0.8) (layers "F.Cu" "F.Paste" "F.Mask"))
  (pad "23" smd rect (at -4.350001 14.249997 90) (size 2.500122 0.8) (layers "F.Cu" "F.Paste" "F.Mask"))
  (pad "24" smd rect (at -3.050001 14.249997 90) (size 2.500122 0.8) (layers "F.Cu" "F.Paste" "F.Mask"))
  (pad "25" smd rect (at -1.750001 14.249997 90) (size 2.500122 0.8) (layers "F.Cu" "F.Paste" "F.Mask"))
  (pad "26" smd rect (at -0.450001 14.249997 90) (size 2.500122 0.8) (layers "F.Cu" "F.Paste" "F.Mask"))
  (pad "27" smd rect (at 0.849999 14.249997 90) (size 2.500122 0.8) (layers "F.Cu" "F.Paste" "F.Mask"))
  (pad "28" smd rect (at 2.149999 14.249997 90) (size 2.500122 0.8) (layers "F.Cu" "F.Paste" "F.Mask"))
  (pad "29" smd rect (at 3.449999 14.249997 90) (size 2.500122 0.8) (layers "F.Cu" "F.Paste" "F.Mask"))
  (pad "30" smd rect (at 4.749999 14.249997 90) (size 2.500122 0.8) (layers "F.Cu" "F.Paste" "F.Mask"))
  (pad "31" smd rect (at 6.049998 14.249997 90) (size 2.500122 0.8) (layers "F.Cu" "F.Paste" "F.Mask"))
  (pad "32" smd rect (at 7.349998 14.249997 90) (size 2.500122 0.8) (layers "F.Cu" "F.Paste" "F.Mask"))
  (pad "33" smd rect (at 8.649998 14.249997 90) (size 2.500122 0.8) (layers "F.Cu" "F.Paste" "F.Mask"))
  (pad "34" smd rect (at 9.949998 14.249997 90) (size 2.500122 0.8) (layers "F.Cu" "F.Paste" "F.Mask"))
  (pad "35" smd rect (at 11.249998 14.249997 90) (size 2.500122 0.8) (layers "F.Cu" "F.Paste" "F.Mask"))
  (pad "36" smd rect (at 12.549998 14.249997 90) (size 2.500122 0.8) (layers "F.Cu" "F.Paste" "F.Mask"))
  (pad "37" smd rect (at 15.749994 12.600001) (size 2.500122 0.8) (layers "F.Cu" "F.Paste" "F.Mask"))
  (pad "38" smd rect (at 15.749994 11.300001) (size 2.500122 0.8) (layers "F.Cu" "F.Paste" "F.Mask"))
  (pad "39" smd rect (at 15.749994 10.000001) (size 2.500122 0.8) (layers "F.Cu" "F.Paste" "F.Mask"))
  (pad "40" smd rect (at 15.749994 8.700001) (size 2.500122 0.8) (layers "F.Cu" "F.Paste" "F.Mask"))
  (pad "41" smd rect (at 15.749994 7.400001) (size 2.500122 0.8) (layers "F.Cu" "F.Paste" "F.Mask"))
  (pad "42" smd rect (at 15.749994 6.100001) (size 2.500122 0.8) (layers "F.Cu" "F.Paste" "F.Mask"))
  (pad "43" smd rect (at 15.749994 4.800001) (size 2.500122 0.8) (layers "F.Cu" "F.Paste" "F.Mask"))
  (pad "44" smd rect (at 15.749994 3.500001) (size 2.500122 0.8) (layers "F.Cu" "F.Paste" "F.Mask"))
  (pad "45" smd rect (at 15.749994 2.200001) (size 2.500122 0.8) (layers "F.Cu" "F.Paste" "F.Mask"))
  (pad "46" smd rect (at 15.749994 0.900001) (size 2.500122 0.8) (layers "F.Cu" "F.Paste" "F.Mask"))
  (pad "47" smd rect (at 15.749994 -0.399999) (size 2.500122 0.8) (layers "F.Cu" "F.Paste" "F.Mask"))
  (pad "143" smd rect (at 15.749994 -1.699999) (size 2.500122 0.8) (layers "F.Cu" "F.Paste" "F.Mask"))
  (pad "144" smd rect (at 15.749994 -2.999999) (size 2.500122 0.8) (layers "F.Cu" "F.Paste" "F.Mask"))
  (pad "48" smd rect (at 15.749994 -4.799999) (size 2.500122 0.8) (layers "F.Cu" "F.Paste" "F.Mask"))
  (pad "49" smd rect (at 15.749994 -6.099998) (size 2.500122 0.8) (layers "F.Cu" "F.Paste" "F.Mask"))
  (pad "50" smd rect (at 15.749994 -7.399998) (size 2.500122 0.8) (layers "F.Cu" "F.Paste" "F.Mask"))
  (pad "51" smd rect (at 15.749994 -8.699998) (size 2.500122 0.8) (layers "F.Cu" "F.Paste" "F.Mask"))
  (pad "52" smd rect (at 15.749994 -9.999998) (size 2.500122 0.8) (layers "F.Cu" "F.Paste" "F.Mask"))
  (pad "53" smd rect (at 15.749994 -11.299998) (size 2.500122 0.8) (layers "F.Cu" "F.Paste" "F.Mask"))
  (pad "54" smd rect (at 15.749994 -12.599998) (size 2.500122 0.8) (layers "F.Cu" "F.Paste" "F.Mask"))
  (pad "55" smd rect (at 12.550001 -14.249997 90) (size 2.500122 0.8) (layers "F.Cu" "F.Paste" "F.Mask"))
  (pad "56" smd rect (at 11.250001 -14.249997 90) (size 2.500122 0.8) (layers "F.Cu" "F.Paste" "F.Mask"))
  (pad "57" smd rect (at 9.950001 -14.249997 90) (size 2.500122 0.8) (layers "F.Cu" "F.Paste" "F.Mask"))
  (pad "58" smd rect (at 8.650001 -14.249997 90) (size 2.500122 0.8) (layers "F.Cu" "F.Paste" "F.Mask"))
  (pad "59" smd rect (at 7.350001 -14.249997 90) (size 2.500122 0.8) (layers "F.Cu" "F.Paste" "F.Mask"))
  (pad "60" smd rect (at 6.050001 -14.249997 90) (size 2.500122 0.8) (layers "F.Cu" "F.Paste" "F.Mask"))
  (pad "61" smd rect (at 4.750001 -14.249997 90) (size 2.500122 0.8) (layers "F.Cu" "F.Paste" "F.Mask"))
  (pad "62" smd rect (at 3.450001 -14.249997 90) (size 2.500122 0.8) (layers "F.Cu" "F.Paste" "F.Mask"))
  (pad "63" smd rect (at 2.150001 -14.249997 90) (size 2.500122 0.8) (layers "F.Cu" "F.Paste" "F.Mask"))
  (pad "64" smd rect (at 0.850001 -14.249997 90) (size 2.500122 0.8) (layers "F.Cu" "F.Paste" "F.Mask"))
  (pad "65" smd rect (at -0.449999 -14.249997 90) (size 2.500122 0.8) (layers "F.Cu" "F.Paste" "F.Mask"))
  (pad "66" smd rect (at -1.749999 -14.249997 90) (size 2.500122 0.8) (layers "F.Cu" "F.Paste" "F.Mask"))
  (pad "67" smd rect (at -3.049999 -14.249997 90) (size 2.500122 0.8) (layers "F.Cu" "F.Paste" "F.Mask"))
  (pad "68" smd rect (at -4.349999 -14.249997 90) (size 2.500122 0.8) (layers "F.Cu" "F.Paste" "F.Mask"))
  (pad "69" smd rect (at -5.649998 -14.249997 90) (size 2.500122 0.8) (layers "F.Cu" "F.Paste" "F.Mask"))
  (pad "70" smd rect (at -6.949998 -14.249997 90) (size 2.500122 0.8) (layers "F.Cu" "F.Paste" "F.Mask"))
  (pad "71" smd rect (at -8.249998 -14.249997 90) (size 2.500122 0.8) (layers "F.Cu" "F.Paste" "F.Mask"))
  (pad "72" smd rect (at -9.549998 -14.249997 90) (size 2.500122 0.8) (layers "F.Cu" "F.Paste" "F.Mask"))
  (pad "113" smd rect (at -10.849998 -14.249997 90) (size 2.500122 0.8) (layers "F.Cu" "F.Paste" "F.Mask"))
  (pad "114" smd rect (at -12.149998 -14.249997 90) (size 2.500122 0.8) (layers "F.Cu" "F.Paste" "F.Mask"))
  (pad "80" smd rect (at -0.8 0 90) (size 1.099998 1.099998) (layers "F.Cu" "F.Paste" "F.Mask"))
  (pad "83" smd rect (at -2.4 0 90) (size 1.099998 1.099998) (layers "F.Cu" "F.Paste" "F.Mask"))
  (pad "77" smd rect (at 0.8 0 90) (size 1.099998 1.099998) (layers "F.Cu" "F.Paste" "F.Mask"))
  (pad "74" smd rect (at 2.4 0 90) (size 1.099998 1.099998) (layers "F.Cu" "F.Paste" "F.Mask"))
  (pad "82" smd rect (at -2.4 -1.6 90) (size 1.099998 1.099998) (layers "F.Cu" "F.Paste" "F.Mask"))
  (pad "79" smd rect (at -0.8 -1.6 90) (size 1.099998 1.099998) (layers "F.Cu" "F.Paste" "F.Mask"))
  (pad "76" smd rect (at 0.8 -1.6 90) (size 1.099998 1.099998) (layers "F.Cu" "F.Paste" "F.Mask"))
  (pad "73" smd rect (at 2.4 -1.6 90) (size 1.099998 1.099998) (layers "F.Cu" "F.Paste" "F.Mask"))
  (pad "84" smd rect (at -2.4 1.6 90) (size 1.099998 1.099998) (layers "F.Cu" "F.Paste" "F.Mask"))
  (pad "81" smd rect (at -0.8 1.6 90) (size 1.099998 1.099998) (layers "F.Cu" "F.Paste" "F.Mask"))
  (pad "78" smd rect (at 0.8 1.6 90) (size 1.099998 1.099998) (layers "F.Cu" "F.Paste" "F.Mask"))
  (pad "75" smd rect (at 2.4 1.6 90) (size 1.099998 1.099998) (layers "F.Cu" "F.Paste" "F.Mask"))
  (pad "95" smd rect (at 1.6 -9.6) (size 1.999996 2.999994) (layers "F.Cu" "F.Paste" "F.Mask"))
  (pad "99" smd rect (at -1.6 -9.6) (size 1.999996 2.999994) (layers "F.Cu" "F.Paste" "F.Mask"))
  (pad "108" smd rect (at -8.2 -9.6) (size 0.127 0.127) (layers "F.Cu" "F.Paste" "F.Mask"))
  (pad "103" smd rect (at -5 -9.6) (size 1.999996 2.999994) (layers "F.Cu" "F.Paste" "F.Mask"))
  (pad "90" smd rect (at 5 -9.6) (size 1.999996 2.999994) (layers "F.Cu" "F.Paste" "F.Mask"))
  (pad "85" smd rect (at 8.2 -9.6) (size 1.999996 2.999994) (layers "F.Cu" "F.Paste" "F.Mask"))
  (pad "96" smd rect (at 1.6 -4.8) (size 1.999996 2.999994) (layers "F.Cu" "F.Paste" "F.Mask"))
  (pad "100" smd rect (at -1.6 -4.8) (size 1.999996 2.999994) (layers "F.Cu" "F.Paste" "F.Mask"))
  (pad "109" smd rect (at -8.2 -4.8) (size 1.999996 2.999994) (layers "F.Cu" "F.Paste" "F.Mask"))
  (pad "104" smd rect (at -5 -4.8) (size 1.999996 2.999994) (layers "F.Cu" "F.Paste" "F.Mask"))
  (pad "91" smd rect (at 5 -4.8) (size 1.999996 2.999994) (layers "F.Cu" "F.Paste" "F.Mask"))
  (pad "86" smd rect (at 8.2 -4.8) (size 1.999996 2.999994) (layers "F.Cu" "F.Paste" "F.Mask"))
  (pad "110" smd rect (at -8.2 0) (size 1.999996 2.999994) (layers "F.Cu" "F.Paste" "F.Mask"))
  (pad "105" smd rect (at -5 0) (size 1.999996 2.999994) (layers "F.Cu" "F.Paste" "F.Mask"))
  (pad "92" smd rect (at 5 0) (size 1.999996 2.999994) (layers "F.Cu" "F.Paste" "F.Mask"))
  (pad "87" smd rect (at 8.2 0) (size 1.999996 2.999994) (layers "F.Cu" "F.Paste" "F.Mask"))
  (pad "97" smd rect (at 1.6 4.8) (size 1.999996 2.999994) (layers "F.Cu" "F.Paste" "F.Mask"))
  (pad "101" smd rect (at -1.6 4.8) (size 1.999996 2.999994) (layers "F.Cu" "F.Paste" "F.Mask"))
  (pad "111" smd rect (at -8.2 4.8) (size 1.999996 2.999994) (layers "F.Cu" "F.Paste" "F.Mask"))
  (pad "106" smd rect (at -5 4.8) (size 1.999996 2.999994) (layers "F.Cu" "F.Paste" "F.Mask"))
  (pad "93" smd rect (at 5 4.8) (size 1.999996 2.999994) (layers "F.Cu" "F.Paste" "F.Mask"))
  (pad "88" smd rect (at 8.2 4.8) (size 1.999996 2.999994) (layers "F.Cu" "F.Paste" "F.Mask"))
  (pad "98" smd rect (at 1.6 9.6) (size 1.999996 2.999994) (layers "F.Cu" "F.Paste" "F.Mask"))
  (pad "102" smd rect (at -1.6 9.6) (size 1.999996 2.999994) (layers "F.Cu" "F.Paste" "F.Mask"))
  (pad "112" smd rect (at -8.2 9.6) (size 1.999996 2.999994) (layers "F.Cu" "F.Paste" "F.Mask"))
  (pad "107" smd rect (at -5 9.6) (size 1.999996 2.999994) (layers "F.Cu" "F.Paste" "F.Mask"))
  (pad "94" smd rect (at 5 9.6) (size 1.999996 2.999994) (layers "F.Cu" "F.Paste" "F.Mask"))
  (pad "89" smd rect (at 8.2 9.6) (size 1.999996 2.999994) (layers "F.Cu" "F.Paste" "F.Mask"))
  (pad "134" smd rect (at -13 -1 90) (size 1.099998 1.099998) (layers "F.Cu" "F.Paste" "F.Mask"))
  (pad "122" smd rect (at -11 -1 90) (size 1.099998 1.099998) (layers "F.Cu" "F.Paste" "F.Mask"))
  (pad "135" smd rect (at -13 1 90) (size 1.099998 1.099998) (layers "F.Cu" "F.Paste" "F.Mask"))
  (pad "123" smd rect (at -11 1 90) (size 1.099998 1.099998) (layers "F.Cu" "F.Paste" "F.Mask"))
  (pad "132" smd rect (at -13 -5 90) (size 1.099998 1.099998) (layers "F.Cu" "F.Paste" "F.Mask"))
  (pad "120" smd rect (at -11 -5 90) (size 1.099998 1.099998) (layers "F.Cu" "F.Paste" "F.Mask"))
  (pad "121" smd rect (at -11 -3 90) (size 1.099998 1.099998) (layers "F.Cu" "F.Paste" "F.Mask"))
  (pad "133" smd rect (at -13 -3 90) (size 1.099998 1.099998) (layers "F.Cu" "F.Paste" "F.Mask"))
  (pad "136" smd rect (at -13 3 90) (size 1.099998 1.099998) (layers "F.Cu" "F.Paste" "F.Mask"))
  (pad "124" smd rect (at -11 3 90) (size 1.099998 1.099998) (layers "F.Cu" "F.Paste" "F.Mask"))
  (pad "125" smd rect (at -11 5 90) (size 1.099998 1.099998) (layers "F.Cu" "F.Paste" "F.Mask"))
  (pad "137" smd rect (at -13 5 90) (size 1.099998 1.099998) (layers "F.Cu" "F.Paste" "F.Mask"))
  (pad "129" smd rect (at -13 -11 90) (size 1.099998 1.099998) (layers "F.Cu" "F.Paste" "F.Mask"))
  (pad "117" smd rect (at -11 -11 90) (size 1.099998 1.099998) (layers "F.Cu" "F.Paste" "F.Mask"))
  (pad "118" smd rect (at -11 -9 90) (size 1.099998 1.099998) (layers "F.Cu" "F.Paste" "F.Mask"))
  (pad "130" smd rect (at -13 -9 90) (size 1.099998 1.099998) (layers "F.Cu" "F.Paste" "F.Mask"))
  (pad "131" smd rect (at -13 -7 90) (size 1.099998 1.099998) (layers "F.Cu" "F.Paste" "F.Mask"))
  (pad "119" smd rect (at -11 -7 90) (size 1.099998 1.099998) (layers "F.Cu" "F.Paste" "F.Mask"))
  (pad "138" smd rect (at -13 7 90) (size 1.099998 1.099998) (layers "F.Cu" "F.Paste" "F.Mask"))
  (pad "126" smd rect (at -11 7 90) (size 1.099998 1.099998) (layers "F.Cu" "F.Paste" "F.Mask"))
  (pad "127" smd rect (at -11 9 90) (size 1.099998 1.099998) (layers "F.Cu" "F.Paste" "F.Mask"))
  (pad "139" smd rect (at -13 9 90) (size 1.099998 1.099998) (layers "F.Cu" "F.Paste" "F.Mask"))
  (pad "140" smd rect (at -13 11 90) (size 1.099998 1.099998) (layers "F.Cu" "F.Paste" "F.Mask"))
  (pad "128" smd rect (at -11 11 90) (size 1.099998 1.099998) (layers "F.Cu" "F.Paste" "F.Mask"))
)
