PCBNEW-LibModule-V1  
# encoding utf-8
Units mm
$INDEX
QFP50P700X700X120-32N
$EndINDEX
$MODULE QFP50P700X700X120-32N
Po 0 0 0 15 00000000 00000000 ~~
Li QFP50P700X700X120-32N
Cd 
Sc 00000000
At SMD
Op 0 0 0
.SolderMask 0
.SolderPaste 0
T0 -1.46283 -4.94457 1.00194 1.00194 0 0.05 N V 21 "QFP50P700X700X120-32N"
T1 -0.825435 4.96755 1.00051 1.00051 0 0.05 N V 21 "VAL**"
DS -2.53 -2.53 2.53 -2.53 0.127 27
DS 2.53 -2.53 2.53 2.53 0.127 27
DS 2.53 2.53 -2.53 2.53 0.127 27
DS -2.53 2.53 -2.53 -2.53 0.127 27
DS -2.53 -2.1 -2.53 -2.53 0.127 21
DS -2.53 -2.53 -2.1 -2.53 0.127 21
DS 2.1 -2.53 2.53 -2.53 0.127 21
DS 2.53 -2.53 2.53 -2.1 0.127 21
DS 2.53 2.1 2.53 2.53 0.127 21
DS 2.53 2.53 2.1 2.53 0.127 21
DS -2.1 2.53 -2.53 2.53 0.127 21
DS -2.53 2.53 -2.53 2.1 0.127 21
DC -4.316 -1.75 -4.216 -1.75 0.2 21
DS -2.13 -4.17 2.13 -4.17 0.05 26
DS 2.13 -4.17 2.13 -2.78 0.05 26
DS 2.13 -2.78 2.78 -2.78 0.05 26
DS 2.78 -2.78 2.78 -2.13 0.05 26
DS 2.78 -2.13 4.17 -2.13 0.05 26
DS 4.17 -2.13 4.17 2.13 0.05 26
DS 4.17 2.13 2.78 2.13 0.05 26
DS 2.78 2.13 2.78 2.78 0.05 26
DS 2.78 2.78 2.13 2.78 0.05 26
DS 2.13 2.78 2.13 4.17 0.05 26
DS 2.13 4.17 -2.13 4.17 0.05 26
DS -2.13 4.17 -2.13 2.78 0.05 26
DS -2.13 2.78 -2.78 2.78 0.05 26
DS -2.78 2.78 -2.78 2.13 0.05 26
DS -2.78 2.13 -4.17 2.13 0.05 26
DS -4.17 2.13 -4.17 -2.13 0.05 26
DS -4.17 -2.13 -2.78 -2.13 0.05 26
DS -2.78 -2.13 -2.78 -2.78 0.05 26
DS -2.78 -2.78 -2.13 -2.78 0.05 26
DS -2.13 -2.78 -2.13 -4.17 0.05 26
$PAD
Sh "1" R 1.44 0.26 0 0 0
At SMD N 00888000
.SolderMask 0
.SolderPaste 0
Ne 0 ""
Po -3.195 -1.75
$EndPAD
$PAD
Sh "2" R 1.44 0.26 0 0 0
At SMD N 00888000
.SolderMask 0
.SolderPaste 0
Ne 0 ""
Po -3.195 -1.25
$EndPAD
$PAD
Sh "3" R 1.44 0.26 0 0 0
At SMD N 00888000
.SolderMask 0
.SolderPaste 0
Ne 0 ""
Po -3.195 -0.75
$EndPAD
$PAD
Sh "4" R 1.44 0.26 0 0 0
At SMD N 00888000
.SolderMask 0
.SolderPaste 0
Ne 0 ""
Po -3.195 -0.25
$EndPAD
$PAD
Sh "5" R 1.44 0.26 0 0 0
At SMD N 00888000
.SolderMask 0
.SolderPaste 0
Ne 0 ""
Po -3.195 0.25
$EndPAD
$PAD
Sh "6" R 1.44 0.26 0 0 0
At SMD N 00888000
.SolderMask 0
.SolderPaste 0
Ne 0 ""
Po -3.195 0.75
$EndPAD
$PAD
Sh "7" R 1.44 0.26 0 0 0
At SMD N 00888000
.SolderMask 0
.SolderPaste 0
Ne 0 ""
Po -3.195 1.25
$EndPAD
$PAD
Sh "8" R 1.44 0.26 0 0 0
At SMD N 00888000
.SolderMask 0
.SolderPaste 0
Ne 0 ""
Po -3.195 1.75
$EndPAD
$PAD
Sh "9" R 1.44 0.26 0 0 900
At SMD N 00888000
.SolderMask 0
.SolderPaste 0
Ne 0 ""
Po -1.75 3.195
$EndPAD
$PAD
Sh "10" R 1.44 0.26 0 0 900
At SMD N 00888000
.SolderMask 0
.SolderPaste 0
Ne 0 ""
Po -1.25 3.195
$EndPAD
$PAD
Sh "11" R 1.44 0.26 0 0 900
At SMD N 00888000
.SolderMask 0
.SolderPaste 0
Ne 0 ""
Po -0.75 3.195
$EndPAD
$PAD
Sh "12" R 1.44 0.26 0 0 900
At SMD N 00888000
.SolderMask 0
.SolderPaste 0
Ne 0 ""
Po -0.25 3.195
$EndPAD
$PAD
Sh "13" R 1.44 0.26 0 0 900
At SMD N 00888000
.SolderMask 0
.SolderPaste 0
Ne 0 ""
Po 0.25 3.195
$EndPAD
$PAD
Sh "14" R 1.44 0.26 0 0 900
At SMD N 00888000
.SolderMask 0
.SolderPaste 0
Ne 0 ""
Po 0.75 3.195
$EndPAD
$PAD
Sh "15" R 1.44 0.26 0 0 900
At SMD N 00888000
.SolderMask 0
.SolderPaste 0
Ne 0 ""
Po 1.25 3.195
$EndPAD
$PAD
Sh "16" R 1.44 0.26 0 0 900
At SMD N 00888000
.SolderMask 0
.SolderPaste 0
Ne 0 ""
Po 1.75 3.195
$EndPAD
$PAD
Sh "17" R 1.44 0.26 0 0 1800
At SMD N 00888000
.SolderMask 0
.SolderPaste 0
Ne 0 ""
Po 3.195 1.75
$EndPAD
$PAD
Sh "18" R 1.44 0.26 0 0 1800
At SMD N 00888000
.SolderMask 0
.SolderPaste 0
Ne 0 ""
Po 3.195 1.25
$EndPAD
$PAD
Sh "19" R 1.44 0.26 0 0 1800
At SMD N 00888000
.SolderMask 0
.SolderPaste 0
Ne 0 ""
Po 3.195 0.75
$EndPAD
$PAD
Sh "20" R 1.44 0.26 0 0 1800
At SMD N 00888000
.SolderMask 0
.SolderPaste 0
Ne 0 ""
Po 3.195 0.25
$EndPAD
$PAD
Sh "21" R 1.44 0.26 0 0 1800
At SMD N 00888000
.SolderMask 0
.SolderPaste 0
Ne 0 ""
Po 3.195 -0.25
$EndPAD
$PAD
Sh "22" R 1.44 0.26 0 0 1800
At SMD N 00888000
.SolderMask 0
.SolderPaste 0
Ne 0 ""
Po 3.195 -0.75
$EndPAD
$PAD
Sh "23" R 1.44 0.26 0 0 1800
At SMD N 00888000
.SolderMask 0
.SolderPaste 0
Ne 0 ""
Po 3.195 -1.25
$EndPAD
$PAD
Sh "24" R 1.44 0.26 0 0 1800
At SMD N 00888000
.SolderMask 0
.SolderPaste 0
Ne 0 ""
Po 3.195 -1.75
$EndPAD
$PAD
Sh "25" R 1.44 0.26 0 0 2700
At SMD N 00888000
.SolderMask 0
.SolderPaste 0
Ne 0 ""
Po 1.75 -3.195
$EndPAD
$PAD
Sh "26" R 1.44 0.26 0 0 2700
At SMD N 00888000
.SolderMask 0
.SolderPaste 0
Ne 0 ""
Po 1.25 -3.195
$EndPAD
$PAD
Sh "27" R 1.44 0.26 0 0 2700
At SMD N 00888000
.SolderMask 0
.SolderPaste 0
Ne 0 ""
Po 0.75 -3.195
$EndPAD
$PAD
Sh "28" R 1.44 0.26 0 0 2700
At SMD N 00888000
.SolderMask 0
.SolderPaste 0
Ne 0 ""
Po 0.25 -3.195
$EndPAD
$PAD
Sh "29" R 1.44 0.26 0 0 2700
At SMD N 00888000
.SolderMask 0
.SolderPaste 0
Ne 0 ""
Po -0.25 -3.195
$EndPAD
$PAD
Sh "30" R 1.44 0.26 0 0 2700
At SMD N 00888000
.SolderMask 0
.SolderPaste 0
Ne 0 ""
Po -0.75 -3.195
$EndPAD
$PAD
Sh "31" R 1.44 0.26 0 0 2700
At SMD N 00888000
.SolderMask 0
.SolderPaste 0
Ne 0 ""
Po -1.25 -3.195
$EndPAD
$PAD
Sh "32" R 1.44 0.26 0 0 2700
At SMD N 00888000
.SolderMask 0
.SolderPaste 0
Ne 0 ""
Po -1.75 -3.195
$EndPAD
$EndMODULE QFP50P700X700X120-32N
