%TF.GenerationSoftware,KiCad,Pcbnew,7.0.7*%
%TF.CreationDate,2024-08-12T11:48:07+02:00*%
%TF.ProjectId,Dark Sky v5r0,4461726b-2053-46b7-9920-763572302e6b,rev?*%
%TF.SameCoordinates,Original*%
%TF.FileFunction,Paste,Top*%
%TF.FilePolarity,Positive*%
%FSLAX46Y46*%
G04 Gerber Fmt 4.6, Leading zero omitted, Abs format (unit mm)*
G04 Created by KiCad (PCBNEW 7.0.7) date 2024-08-12 11:48:07*
%MOMM*%
%LPD*%
G01*
G04 APERTURE LIST*
G04 Aperture macros list*
%AMRoundRect*
0 Rectangle with rounded corners*
0 $1 Rounding radius*
0 $2 $3 $4 $5 $6 $7 $8 $9 X,Y pos of 4 corners*
0 Add a 4 corners polygon primitive as box body*
4,1,4,$2,$3,$4,$5,$6,$7,$8,$9,$2,$3,0*
0 Add four circle primitives for the rounded corners*
1,1,$1+$1,$2,$3*
1,1,$1+$1,$4,$5*
1,1,$1+$1,$6,$7*
1,1,$1+$1,$8,$9*
0 Add four rect primitives between the rounded corners*
20,1,$1+$1,$2,$3,$4,$5,0*
20,1,$1+$1,$4,$5,$6,$7,0*
20,1,$1+$1,$6,$7,$8,$9,0*
20,1,$1+$1,$8,$9,$2,$3,0*%
G04 Aperture macros list end*
%ADD10RoundRect,0.225000X-0.250000X0.225000X-0.250000X-0.225000X0.250000X-0.225000X0.250000X0.225000X0*%
%ADD11RoundRect,0.200000X0.200000X0.275000X-0.200000X0.275000X-0.200000X-0.275000X0.200000X-0.275000X0*%
%ADD12RoundRect,0.225000X-0.225000X-0.250000X0.225000X-0.250000X0.225000X0.250000X-0.225000X0.250000X0*%
%ADD13RoundRect,0.200000X-0.275000X0.200000X-0.275000X-0.200000X0.275000X-0.200000X0.275000X0.200000X0*%
%ADD14RoundRect,0.200000X-0.200000X-0.275000X0.200000X-0.275000X0.200000X0.275000X-0.200000X0.275000X0*%
%ADD15R,0.500000X0.350000*%
%ADD16R,1.498600X0.889000*%
%ADD17R,0.711200X0.711200*%
%ADD18RoundRect,0.200000X0.275000X-0.200000X0.275000X0.200000X-0.275000X0.200000X-0.275000X-0.200000X0*%
%ADD19R,1.200000X1.200000*%
%ADD20RoundRect,0.218750X0.218750X0.256250X-0.218750X0.256250X-0.218750X-0.256250X0.218750X-0.256250X0*%
%ADD21R,1.003300X0.508000*%
%ADD22RoundRect,0.225000X0.250000X-0.225000X0.250000X0.225000X-0.250000X0.225000X-0.250000X-0.225000X0*%
%ADD23R,0.660400X0.304800*%
%ADD24RoundRect,0.250000X0.375000X0.625000X-0.375000X0.625000X-0.375000X-0.625000X0.375000X-0.625000X0*%
%ADD25RoundRect,0.150000X0.587500X0.150000X-0.587500X0.150000X-0.587500X-0.150000X0.587500X-0.150000X0*%
%ADD26RoundRect,0.150000X-0.587500X-0.150000X0.587500X-0.150000X0.587500X0.150000X-0.587500X0.150000X0*%
%ADD27RoundRect,0.150000X-0.150000X0.512500X-0.150000X-0.512500X0.150000X-0.512500X0.150000X0.512500X0*%
%ADD28R,1.066800X0.254000*%
%ADD29R,0.550000X1.145000*%
%ADD30R,1.145000X0.550000*%
%ADD31R,1.350000X0.400000*%
%ADD32R,1.900000X1.500000*%
G04 APERTURE END LIST*
%TO.C,U3*%
G36*
X76450000Y-70471179D02*
G01*
X76308579Y-70612600D01*
X76155030Y-70612600D01*
X76155030Y-70317630D01*
X76450000Y-70317630D01*
X76450000Y-70471179D01*
G37*
G36*
X76450000Y-72528821D02*
G01*
X76450000Y-72682370D01*
X76155030Y-72682370D01*
X76155030Y-72387400D01*
X76308579Y-72387400D01*
X76450000Y-72528821D01*
G37*
G36*
X76944970Y-70612600D02*
G01*
X76791421Y-70612600D01*
X76650000Y-70471179D01*
X76650000Y-70317630D01*
X76944970Y-70317630D01*
X76944970Y-70612600D01*
G37*
G36*
X76944970Y-72682370D02*
G01*
X76650000Y-72682370D01*
X76650000Y-72528821D01*
X76791421Y-72387400D01*
X76944970Y-72387400D01*
X76944970Y-72682370D01*
G37*
G36*
X76450000Y-70954021D02*
G01*
X76450000Y-71258579D01*
X76308579Y-71400000D01*
X76155030Y-71400000D01*
X76155030Y-70812600D01*
X76308579Y-70812600D01*
X76450000Y-70954021D01*
G37*
G36*
X76450000Y-71741421D02*
G01*
X76450000Y-72045979D01*
X76308579Y-72187400D01*
X76155030Y-72187400D01*
X76155030Y-71600000D01*
X76308579Y-71600000D01*
X76450000Y-71741421D01*
G37*
G36*
X76944970Y-71400000D02*
G01*
X76791421Y-71400000D01*
X76650000Y-71258579D01*
X76650000Y-70954021D01*
X76791421Y-70812600D01*
X76944970Y-70812600D01*
X76944970Y-71400000D01*
G37*
G36*
X76944970Y-72187400D02*
G01*
X76791421Y-72187400D01*
X76650000Y-72045979D01*
X76650000Y-71741421D01*
X76791421Y-71600000D01*
X76944970Y-71600000D01*
X76944970Y-72187400D01*
G37*
%TD*%
D10*
%TO.C,C15*%
X98675001Y-93850000D03*
X98675001Y-95400000D03*
%TD*%
D11*
%TO.C,R8*%
X81025000Y-72600000D03*
X79375000Y-72600000D03*
%TD*%
D12*
%TO.C,C5*%
X75575000Y-59050000D03*
X77125000Y-59050000D03*
%TD*%
D13*
%TO.C,R5*%
X107350000Y-51850000D03*
X107350000Y-53500000D03*
%TD*%
D14*
%TO.C,R11*%
X89675000Y-65952500D03*
X91325000Y-65952500D03*
%TD*%
D13*
%TO.C,R17*%
X79150000Y-82000000D03*
X79150000Y-83650000D03*
%TD*%
D15*
%TO.C,U7*%
X94950001Y-93950000D03*
X94950001Y-93300000D03*
X94950001Y-92650000D03*
X94950001Y-92000000D03*
X97000000Y-92000000D03*
X97000000Y-92650000D03*
X97000000Y-93300000D03*
X97000000Y-93950000D03*
%TD*%
D11*
%TO.C,R13*%
X96800001Y-90125000D03*
X95150001Y-90125000D03*
%TD*%
%TO.C,R4*%
X72625000Y-59075000D03*
X70975000Y-59075000D03*
%TD*%
D16*
%TO.C,U1*%
X83044198Y-51800023D03*
X83044198Y-53300023D03*
X83044198Y-54800025D03*
X83044198Y-56300024D03*
X83044198Y-57800024D03*
X83044198Y-59300023D03*
X83044198Y-60800023D03*
X83044198Y-62300025D03*
X83044198Y-63800025D03*
X100544198Y-63800025D03*
X100544198Y-62300025D03*
X100544198Y-60800023D03*
X100544198Y-59300023D03*
X100544198Y-57800024D03*
X100544198Y-56300024D03*
X100544198Y-54800025D03*
X100544198Y-53300023D03*
X100544198Y-51800023D03*
D17*
X91650000Y-56900000D03*
X92750000Y-56900000D03*
X93850000Y-56900000D03*
X91649898Y-57999998D03*
X92749898Y-57999998D03*
X93849899Y-57999998D03*
X91650000Y-59099996D03*
X92750000Y-59099996D03*
X93850000Y-59099996D03*
%TD*%
D18*
%TO.C,R2*%
X66750000Y-89400000D03*
X66750000Y-87750000D03*
%TD*%
D10*
%TO.C,C8*%
X85847450Y-81049999D03*
X85847450Y-82599999D03*
%TD*%
D12*
%TO.C,C11*%
X79425000Y-70900000D03*
X80975000Y-70900000D03*
%TD*%
D19*
%TO.C,D2*%
X79450000Y-63575000D03*
X76650000Y-63575000D03*
%TD*%
D13*
%TO.C,R15*%
X82150000Y-81950000D03*
X82150000Y-83600000D03*
%TD*%
D20*
%TO.C,FB1*%
X68137500Y-70600000D03*
X66562500Y-70600000D03*
%TD*%
D21*
%TO.C,U5*%
X88144900Y-76449998D03*
X88144900Y-77399999D03*
X88144900Y-78350000D03*
X90850000Y-78350000D03*
X90850000Y-76449998D03*
%TD*%
D22*
%TO.C,C3*%
X79755700Y-48649900D03*
X79755700Y-47099900D03*
%TD*%
D14*
%TO.C,R14*%
X89675000Y-72602500D03*
X91325000Y-72602500D03*
%TD*%
D12*
%TO.C,C6*%
X75825000Y-68500000D03*
X77375000Y-68500000D03*
%TD*%
D23*
%TO.C,U3*%
X75521300Y-70499999D03*
X75521300Y-71000001D03*
X75521300Y-71500000D03*
X75521300Y-71999999D03*
X75521300Y-72500001D03*
X77578700Y-72500001D03*
X77578700Y-71999999D03*
X77578700Y-71500000D03*
X77578700Y-71000001D03*
X77578700Y-70499999D03*
%TD*%
D10*
%TO.C,C7*%
X86047450Y-76624999D03*
X86047450Y-78174999D03*
%TD*%
D24*
%TO.C,F1*%
X69950000Y-62750000D03*
X67150000Y-62750000D03*
%TD*%
D25*
%TO.C,Q3*%
X81237500Y-87625000D03*
X81237500Y-85725000D03*
X79362500Y-86675000D03*
%TD*%
D26*
%TO.C,Q2*%
X65887500Y-83500000D03*
X65887500Y-85400000D03*
X67762500Y-84450000D03*
%TD*%
D20*
%TO.C,FB2*%
X74037500Y-63575000D03*
X72462500Y-63575000D03*
%TD*%
D14*
%TO.C,R19*%
X85550000Y-84700000D03*
X87200000Y-84700000D03*
%TD*%
D11*
%TO.C,R6*%
X73775000Y-71000000D03*
X72125000Y-71000000D03*
%TD*%
D10*
%TO.C,C9*%
X92847450Y-81299999D03*
X92847450Y-82849999D03*
%TD*%
D26*
%TO.C,Q1*%
X65887500Y-78475000D03*
X65887500Y-80375000D03*
X67762500Y-79425000D03*
%TD*%
D21*
%TO.C,U4*%
X87944900Y-81124998D03*
X87944900Y-82074999D03*
X87944900Y-83025000D03*
X90650000Y-83025000D03*
X90650000Y-81124998D03*
%TD*%
D27*
%TO.C,U2*%
X69300000Y-65537500D03*
X68350000Y-65537500D03*
X67400000Y-65537500D03*
X67400000Y-67812500D03*
X68350000Y-67812500D03*
X69300000Y-67812500D03*
%TD*%
D28*
%TO.C,U6*%
X103242607Y-71449972D03*
X103242607Y-70799986D03*
X103242607Y-70150000D03*
X101591607Y-70150000D03*
X101591607Y-70799986D03*
X101591607Y-71449972D03*
%TD*%
D29*
%TO.C,U8*%
X90700000Y-68255000D03*
X89900000Y-68255000D03*
X89100000Y-68255000D03*
X88300000Y-68255000D03*
X87500000Y-68255000D03*
X86700000Y-68255000D03*
D30*
X86602500Y-69352500D03*
D29*
X86700000Y-70450000D03*
X87500000Y-70450000D03*
X88300000Y-70450000D03*
X89100000Y-70450000D03*
X89900000Y-70450000D03*
X90700000Y-70450000D03*
D30*
X90797500Y-69352500D03*
%TD*%
D11*
%TO.C,R9*%
X96800001Y-95875000D03*
X95150001Y-95875000D03*
%TD*%
D13*
%TO.C,R16*%
X79150000Y-78350000D03*
X79150000Y-80000000D03*
%TD*%
D14*
%TO.C,R7*%
X72125000Y-72650000D03*
X73775000Y-72650000D03*
%TD*%
D12*
%TO.C,C13*%
X86650000Y-65952500D03*
X88200000Y-65952500D03*
%TD*%
D11*
%TO.C,R10*%
X88275000Y-72602500D03*
X86625000Y-72602500D03*
%TD*%
D26*
%TO.C,Q4*%
X103675000Y-51700000D03*
X103675000Y-53600000D03*
X105550000Y-52650000D03*
%TD*%
D22*
%TO.C,C12*%
X96800000Y-71125000D03*
X96800000Y-69575000D03*
%TD*%
D18*
%TO.C,R1*%
X79805700Y-55699900D03*
X79805700Y-54049900D03*
%TD*%
D19*
%TO.C,D3*%
X68325000Y-58975000D03*
X68325000Y-56175000D03*
%TD*%
D22*
%TO.C,C14*%
X98625001Y-91900000D03*
X98625001Y-90350000D03*
%TD*%
D10*
%TO.C,C2*%
X65300000Y-60075000D03*
X65300000Y-61625000D03*
%TD*%
%TO.C,C1*%
X79805700Y-57599900D03*
X79805700Y-59149900D03*
%TD*%
D13*
%TO.C,R12*%
X84700000Y-68527500D03*
X84700000Y-70177500D03*
%TD*%
D10*
%TO.C,C4*%
X79805700Y-50649900D03*
X79805700Y-52199900D03*
%TD*%
D31*
%TO.C,J2*%
X63787500Y-65600000D03*
X63787500Y-66250000D03*
X63787500Y-66900000D03*
X63787500Y-67550000D03*
X63787500Y-68200000D03*
D32*
X61087500Y-65900000D03*
X61087500Y-67900000D03*
%TD*%
D10*
%TO.C,C10*%
X92947450Y-76624999D03*
X92947450Y-78174999D03*
%TD*%
D13*
%TO.C,R3*%
X66675000Y-74575000D03*
X66675000Y-76225000D03*
%TD*%
D14*
%TO.C,R18*%
X103400000Y-55300000D03*
X105050000Y-55300000D03*
%TD*%
M02*
