(footprint "DQC10_P84X2P4" (version 20211014) (generator pcbnew)
  (layer "F.Cu")
  (tedit 6478A54A)
  (tags "BQ24210DQCT ")
  (attr smd)
  (fp_text reference "REF**" (at 0.2 -2.425 unlocked) (layer "F.SilkS")
    (effects (font (size 1 1) (thickness 0.15)))
    (tstamp 93667f77-98a0-4821-b41b-c2d9f2bf7a44)
  )
  (fp_text value "DQC10_P84X2P4" (at 0 0 unlocked) (layer "F.Fab")
    (effects (font (size 1 1) (thickness 0.15)))
    (tstamp 86a04ab5-1597-46d0-9b88-ce0b7a420c90)
  )
  (fp_text user "${REFERENCE}" (at 0 0 unlocked) (layer "F.Fab")
    (effects (font (size 1 1) (thickness 0.15)))
    (tstamp e5c011a2-c2c1-488a-941a-13e97936a237)
  )
  (fp_poly (pts
      (xy -0.39497 0.8874)
      (xy -0.39497 1.18237)
      (xy -0.1 1.18237)
      (xy -0.1 1.028821)
      (xy -0.241421 0.8874)
    ) (layer "F.Paste") (width 0) (fill solid) (tstamp 53187bda-ba50-48c2-ab4d-6d5a88a72e25))
  (fp_poly (pts
      (xy 0.1 -1.18237)
      (xy 0.1 -1.028821)
      (xy 0.241421 -0.8874)
      (xy 0.39497 -0.8874)
      (xy 0.39497 -1.18237)
    ) (layer "F.Paste") (width 0) (fill solid) (tstamp 563829dd-6068-4240-86ac-d1bdebc9b5e1))
  (fp_poly (pts
      (xy -0.39497 0.1)
      (xy -0.39497 0.6874)
      (xy -0.241421 0.6874)
      (xy -0.1 0.545979)
      (xy -0.1 0.241421)
      (xy -0.241421 0.1)
    ) (layer "F.Paste") (width 0) (fill solid) (tstamp 88690ad9-4913-41f6-a944-47bcef8c5fe8))
  (fp_poly (pts
      (xy -0.39497 -0.6874)
      (xy -0.39497 -0.1)
      (xy -0.241421 -0.1)
      (xy -0.1 -0.241421)
      (xy -0.1 -0.545979)
      (xy -0.241421 -0.6874)
    ) (layer "F.Paste") (width 0) (fill solid) (tstamp 99d618f3-c1d0-4b33-b89f-e3e39dc7f3e7))
  (fp_poly (pts
      (xy 0.241421 -0.6874)
      (xy 0.1 -0.545979)
      (xy 0.1 -0.241421)
      (xy 0.241421 -0.1)
      (xy 0.39497 -0.1)
      (xy 0.39497 -0.6874)
    ) (layer "F.Paste") (width 0) (fill solid) (tstamp a001e8d2-48fd-49d4-aafd-73f90087500e))
  (fp_poly (pts
      (xy 0.241421 0.1)
      (xy 0.1 0.241421)
      (xy 0.1 0.545979)
      (xy 0.241421 0.6874)
      (xy 0.39497 0.6874)
      (xy 0.39497 0.1)
    ) (layer "F.Paste") (width 0) (fill solid) (tstamp b5e039b2-5946-4172-8f88-eb66c534e288))
  (fp_poly (pts
      (xy 0.241421 0.8874)
      (xy 0.1 1.028821)
      (xy 0.1 1.18237)
      (xy 0.39497 1.18237)
      (xy 0.39497 0.8874)
    ) (layer "F.Paste") (width 0) (fill solid) (tstamp bc663769-f248-4977-b50e-9b14fbba8fcd))
  (fp_poly (pts
      (xy -0.39497 -1.18237)
      (xy -0.39497 -0.8874)
      (xy -0.241421 -0.8874)
      (xy -0.1 -1.028821)
      (xy -0.1 -1.18237)
    ) (layer "F.Paste") (width 0) (fill solid) (tstamp d8e3dbd3-7ef8-41b3-95d0-6c1465bb731e))
  (fp_line (start -0.629253 -1.5494) (end -1.0541 -1.5494) (layer "F.SilkS") (width 0.1524) (tstamp 41974bb3-8276-4398-a41e-2db55ccd0cde))
  (fp_line (start -1.0541 1.5494) (end -0.629253 1.5494) (layer "F.SilkS") (width 0.1524) (tstamp 58a7628e-5bc8-4e18-9a54-4aef86ee188a))
  (fp_line (start 1.0541 -1.5494) (end 0.629253 -1.5494) (layer "F.SilkS") (width 0.1524) (tstamp bb3b98f1-97c4-417a-8c57-35c3d36a8fcf))
  (fp_line (start 0.629253 1.5494) (end 1.0541 1.5494) (layer "F.SilkS") (width 0.1524) (tstamp fc4e81ff-132c-4756-9362-c8e32b513212))
  (fp_arc (start -1.69164 -0.926171) (mid -1.7867 -1) (end -1.69164 -1.073829) (layer "F.SilkS") (width 0.1524) (tstamp d1cbd095-5a87-46ff-9bb7-8151449e2ba9))
  (fp_poly (pts
      (xy -0.5334 -1.3208)
      (xy -0.2 -1.3208)
      (xy -0.2 1.3208)
      (xy -0.5334 1.3208)
    ) (layer "F.Mask") (width 0) (fill solid) (tstamp 05da659d-8267-4764-8ad8-5e79e7e7c788))
  (fp_poly (pts
      (xy -0.5334 -0.5874)
      (xy 0.5334 -0.5874)
      (xy 0.5334 -0.2)
      (xy -0.5334 -0.2)
    ) (layer "F.Mask") (width 0) (fill solid) (tstamp 0c3169d4-8ef1-4729-bdad-2b9342dbc61b))
  (fp_poly (pts
      (xy 0.2 -1.3208)
      (xy 0.5334 -1.3208)
      (xy 0.5334 1.3208)
      (xy 0.2 1.3208)
    ) (layer "F.Mask") (width 0) (fill solid) (tstamp 1683397f-1413-40e6-9534-ec98aa3fba09))
  (fp_poly (pts
      (xy -0.5334 0.2)
      (xy 0.5334 0.2)
      (xy 0.5334 0.5874)
      (xy -0.5334 0.5874)
    ) (layer "F.Mask") (width 0) (fill solid) (tstamp 28710f64-c563-4ec3-a0ab-a0e063b3502f))
  (fp_poly (pts
      (xy -0.5334 0.9874)
      (xy 0.5334 0.9874)
      (xy 0.5334 1.3208)
      (xy -0.5334 1.3208)
    ) (layer "F.Mask") (width 0) (fill solid) (tstamp a0796e0e-3ae0-4505-929d-e6762b96bdff))
  (fp_poly (pts
      (xy -0.5334 -1.3208)
      (xy 0.5334 -1.3208)
      (xy 0.5334 -0.9874)
      (xy -0.5334 -0.9874)
    ) (layer "F.Mask") (width 0) (fill solid) (tstamp da1d7ae2-36f2-4f0d-b720-52a67d8f1e74))
  (fp_line (start 1.6129 -1.8034) (end 1.6129 1.8034) (layer "F.CrtYd") (width 0.1524) (tstamp 19a931d2-4825-4654-a311-49070fd7e51f))
  (fp_line (start -1.6129 1.8034) (end -1.6129 -1.8034) (layer "F.CrtYd") (width 0.1524) (tstamp c37319d6-e72d-4658-ae1d-106ecb625989))
  (fp_line (start 1.6129 1.8034) (end -1.6129 1.8034) (layer "F.CrtYd") (width 0.1524) (tstamp f4434006-ff79-4f35-8b95-4169aad8184b))
  (fp_line (start -1.6129 -1.8034) (end 1.6129 -1.8034) (layer "F.CrtYd") (width 0.1524) (tstamp f9021555-57a0-4412-8634-f69fbc0d15e6))
  (fp_line (start 1.0541 1.5494) (end 1.0541 -1.5494) (layer "F.Fab") (width 0.0254) (tstamp 22c7de07-e6ed-45bf-ab65-310bc8bb0ecd))
  (fp_line (start -1.0541 -1.5494) (end -1.0541 1.5494) (layer "F.Fab") (width 0.0254) (tstamp 4e9821ba-fb2f-420b-a622-a722ec5935cc))
  (fp_line (start 1.0541 -1.5494) (end -1.0541 -1.5494) (layer "F.Fab") (width 0.0254) (tstamp 519ab79b-fa87-4d47-b2fd-33f2c58304d3))
  (fp_line (start -1.0541 1.5494) (end 1.0541 1.5494) (layer "F.Fab") (width 0.0254) (tstamp ec1b1fc3-3ee5-49fa-9e0f-7b2cd877b1fe))
  (fp_arc (start 0.3048 -1.5494) (mid 0 -1.2446) (end -0.3048 -1.5494) (layer "F.Fab") (width 0.0254) (tstamp cbecacf7-2216-46b8-aa03-73b741a51ba4))
  (fp_circle (center -1.7105 -1) (end -1.6343 -1) (layer "F.Fab") (width 0.0254) (fill none) (tstamp dc05cd84-c35a-4b77-b96a-3cf87229efb4))
  (pad "1" smd rect (at -1.0287 -1.000001) (size 0.6604 0.3048) (layers "F.Cu" "F.Paste" "F.Mask") (tstamp 6745a413-cb99-4f18-b250-8493069864d4))
  (pad "2" smd rect (at -1.0287 -0.499999) (size 0.6604 0.3048) (layers "F.Cu" "F.Paste" "F.Mask") (tstamp 92e99a6f-f770-4e41-a34a-be34aa49dd6c))
  (pad "3" smd rect (at -1.0287 0) (size 0.6604 0.3048) (layers "F.Cu" "F.Paste" "F.Mask") (tstamp 10f54f4b-f19a-499a-89db-916ee18005c6))
  (pad "4" smd rect (at -1.0287 0.499999) (size 0.6604 0.3048) (layers "F.Cu" "F.Paste" "F.Mask") (tstamp 8d7d34de-399b-497e-8cd6-56588eb2869d))
  (pad "5" smd rect (at -1.0287 1.000001) (size 0.6604 0.3048) (layers "F.Cu" "F.Paste" "F.Mask") (tstamp d7f022a5-e091-4a21-bb2b-f033b3bdf81e))
  (pad "6" smd rect (at 1.0287 1.000001) (size 0.6604 0.3048) (layers "F.Cu" "F.Paste" "F.Mask") (tstamp 81624bd2-05d6-4046-91f2-4c53f283f654))
  (pad "7" smd rect (at 1.0287 0.499999) (size 0.6604 0.3048) (layers "F.Cu" "F.Paste" "F.Mask") (tstamp 4aa81968-b592-499e-9ef7-5fc9ad6b6469))
  (pad "8" smd rect (at 1.0287 0) (size 0.6604 0.3048) (layers "F.Cu" "F.Paste" "F.Mask") (tstamp 7358c27a-2fbb-4d7e-b4bb-11cf44f3330a))
  (pad "9" smd rect (at 1.0287 -0.499999) (size 0.6604 0.3048) (layers "F.Cu" "F.Paste" "F.Mask") (tstamp cea489be-eec7-461e-bfa6-43a24da1b115))
  (pad "10" smd rect (at 1.0287 -1.000001) (size 0.6604 0.3048) (layers "F.Cu" "F.Paste" "F.Mask") (tstamp 1ff2515b-329f-4a89-bcbf-3328b74dc3cc))
  (pad "11" smd rect (at 0 0) (size 0.9398 2.5146) (layers "F.Cu" "F.Mask") (tstamp d32cbe47-334f-4991-99a2-536df173ae1e))
)
