(module SIM7200-6-0-18-00-A (layer F.Cu) (tedit 60C1DAB3)
  (fp_text reference REF** (at 0 7.7462) (layer F.SilkS)
    (effects (font (size 1 1) (thickness 0.15)))
  )
  (fp_text value SIM7200-6-0-18-00-A_GCT (at 0 7.7462) (layer F.SilkS)
    (effects (font (size 1 1) (thickness 0.15)))
  )
  (fp_text user "Copyright 2016 Accelerated Designs. All rights reserved." (at 0 0) (layer Cmts.User)
    (effects (font (size 0.127 0.127) (thickness 0.002)))
  )
  (fp_text user * (at -4.7 7.7462) (layer F.SilkS)
    (effects (font (size 1 1) (thickness 0.15)))
  )
  (fp_text user * (at -4.7 7.7462) (layer F.Fab)
    (effects (font (size 1 1) (thickness 0.15)))
  )
  (fp_text user * (at -4.7 7.7462) (layer F.SilkS)
    (effects (font (size 1 1) (thickness 0.15)))
  )
  (fp_text user * (at -4.7 7.7462) (layer F.Fab)
    (effects (font (size 1 1) (thickness 0.15)))
  )
  (fp_line (start -7.4803 8.3058) (end -4.143741 8.3058) (layer F.SilkS) (width 0.1524))
  (fp_line (start 7.4803 8.3058) (end 7.4803 -2.14916) (layer F.SilkS) (width 0.1524))
  (fp_line (start 7.4803 -8.3058) (end -7.4803 -8.3058) (layer F.SilkS) (width 0.1524))
  (fp_line (start -7.4803 -8.3058) (end -7.4803 -4.00844) (layer F.SilkS) (width 0.1524))
  (fp_line (start -7.3533 8.1788) (end 7.3533 8.1788) (layer F.Fab) (width 0.1524))
  (fp_line (start 7.3533 8.1788) (end 7.3533 -8.1788) (layer F.Fab) (width 0.1524))
  (fp_line (start 7.3533 -8.1788) (end -7.3533 -8.1788) (layer F.Fab) (width 0.1524))
  (fp_line (start -7.3533 -8.1788) (end -7.3533 8.1788) (layer F.Fab) (width 0.1524))
  (fp_line (start -0.127 -8.0518) (end 0.127 -8.0518) (layer F.SilkS) (width 0.1524))
  (fp_line (start 0.127 -8.0518) (end 0.127 -8.3058) (layer F.SilkS) (width 0.1524))
  (fp_line (start 0.127 -8.3058) (end -0.127 -8.3058) (layer F.SilkS) (width 0.1524))
  (fp_line (start -0.127 -8.3058) (end -0.127 -8.0518) (layer F.SilkS) (width 0.1524))
  (fp_line (start 0 -8.1788) (end 0 -8.1788) (layer F.Fab) (width 0.1524))
  (fp_line (start 0 -8.1788) (end 0 -8.1788) (layer F.Fab) (width 0.1524))
  (fp_line (start 0 -8.1788) (end 0 -8.1788) (layer F.Fab) (width 0.1524))
  (fp_line (start 0 -8.1788) (end 0 -8.1788) (layer F.Fab) (width 0.1524))
  (fp_line (start 3.633739 8.3058) (end 7.4803 8.3058) (layer F.SilkS) (width 0.1524))
  (fp_line (start -7.4803 -2.14916) (end -7.4803 8.3058) (layer F.SilkS) (width 0.1524))
  (fp_line (start 7.4803 -4.00844) (end 7.4803 -8.3058) (layer F.SilkS) (width 0.1524))
  (fp_line (start 7.6073 -8.4328) (end -7.6073 -8.4328) (layer F.CrtYd) (width 0.1524))
  (fp_line (start -7.6073 -8.4328) (end -7.6073 8.4328) (layer F.CrtYd) (width 0.1524))
  (fp_line (start -7.6073 8.4328) (end 7.6073 8.4328) (layer F.CrtYd) (width 0.1524))
  (fp_line (start 7.6073 8.4328) (end 7.6073 -8.4328) (layer F.CrtYd) (width 0.1524))
  (pad C1 smd rect (at -2.160001 7.7462) (size 0.762 1.2446) (layers F.Cu F.Paste F.Mask))
  (pad C2 smd rect (at 0.379999 7.7462) (size 0.762 1.2446) (layers F.Cu F.Paste F.Mask))
  (pad C3 smd rect (at 2.919999 7.7462) (size 0.762 1.2446) (layers F.Cu F.Paste F.Mask))
  (pad C5 smd rect (at -3.430001 7.7462) (size 0.762 1.2446) (layers F.Cu F.Paste F.Mask))
  (pad C6 smd rect (at -0.890001 7.7462) (size 0.762 1.2446) (layers F.Cu F.Paste F.Mask))
  (pad C7 smd rect (at 1.649999 7.7462) (size 0.762 1.2446) (layers F.Cu F.Paste F.Mask))
  (pad 7 smd rect (at -7.15 -3.0788) (size 0.9906 1.1938) (layers F.Cu F.Paste F.Mask))
  (pad 8 smd rect (at 7.15 -3.0788) (size 0.9906 1.1938) (layers F.Cu F.Paste F.Mask))
)
