(module Inductor_THT:Choke_Schaffner_RN212-04-12.5x18.0mm (layer F.Cu) (tedit 5E9DD558)
  (descr "Current-compensated Chokes, Scaffner, RN212-04, 12.5mmx18.0mm https://www.schaffner.com/products/download/product/datasheet/rn-series-common-mode-chokes-new/")
  (tags "chokes schaffner tht")
  (fp_text reference REF** (at -1.373 -14.5) (layer F.SilkS)
    (effects (font (size 1 1) (thickness 0.15)))
  )
  (fp_text value Choke_TLF_9UA (at 3.937 6.477) (layer F.Fab)
    (effects (font (size 1 1) (thickness 0.15)))
  )
  (fp_line (start -2.8575 3.1115) (end -1.3335 4.5085) (layer F.SilkS) (width 0.12))
  (fp_line (start -2.75 4.318) (end 9.75 4.318) (layer F.Fab) (width 0.1))
  (fp_text user %R (at 3.246 -6.5) (layer F.Fab)
    (effects (font (size 1 1) (thickness 0.15)))
  )
  (fp_line (start 10 -12.75) (end -3 -12.75) (layer F.CrtYd) (width 0.05))
  (fp_line (start 10 4.572) (end 10 -12.75) (layer F.CrtYd) (width 0.05))
  (fp_line (start -3 4.572) (end 10 4.572) (layer F.CrtYd) (width 0.05))
  (fp_line (start -3 -12.75) (end -3 4.572) (layer F.CrtYd) (width 0.05))
  (fp_line (start -2.87 4.5) (end -2.87 -12.62) (layer F.SilkS) (width 0.12))
  (fp_line (start 9.87 4.5) (end -2.87 4.5) (layer F.SilkS) (width 0.12))
  (fp_line (start 9.87 -12.62) (end 9.87 4.5) (layer F.SilkS) (width 0.12))
  (fp_line (start -2.87 -12.62) (end 9.87 -12.62) (layer F.SilkS) (width 0.12))
  (fp_line (start -2.75 -11.182) (end -2.75 -12.5) (layer F.Fab) (width 0.1))
  (fp_line (start -2.75 4.318) (end -2.75 -11.182) (layer F.Fab) (width 0.1))
  (fp_line (start 9.75 4.5) (end -2.75 4.5) (layer F.Fab) (width 0.1))
  (fp_line (start 9.75 -12.5) (end 9.75 4.318) (layer F.Fab) (width 0.1))
  (fp_line (start -2.75 -12.5) (end 9.75 -12.5) (layer F.Fab) (width 0.1))
  (pad 4 thru_hole circle (at 0 -8) (size 2 2) (drill 0.9) (layers *.Cu *.Mask))
  (pad 3 thru_hole circle (at 6.992 -8) (size 2 2) (drill 0.9) (layers *.Cu *.Mask))
  (pad 2 thru_hole circle (at 6.992 0) (size 2 2) (drill 0.9) (layers *.Cu *.Mask))
  (pad 1 thru_hole rect (at 0 -0.03) (size 2 2) (drill 0.9) (layers *.Cu *.Mask))
  (model ${KISYS3DMOD}/Inductor_THT.3dshapes/Choke_Schaffner_RN212-04-12.5x18.0mm.wrl
    (at (xyz 0 0 0))
    (scale (xyz 1 1 1))
    (rotate (xyz 0 0 0))
  )
)
