%TF.GenerationSoftware,KiCad,Pcbnew,7.0.7*%
%TF.CreationDate,2023-08-25T16:24:43+02:00*%
%TF.ProjectId,Dark Sky v2r0,4461726b-2053-46b7-9920-763272302e6b,rev?*%
%TF.SameCoordinates,Original*%
%TF.FileFunction,Soldermask,Bot*%
%TF.FilePolarity,Negative*%
%FSLAX46Y46*%
G04 Gerber Fmt 4.6, Leading zero omitted, Abs format (unit mm)*
G04 Created by KiCad (PCBNEW 7.0.7) date 2023-08-25 16:24:43*
%MOMM*%
%LPD*%
G01*
G04 APERTURE LIST*
G04 Aperture macros list*
%AMRoundRect*
0 Rectangle with rounded corners*
0 $1 Rounding radius*
0 $2 $3 $4 $5 $6 $7 $8 $9 X,Y pos of 4 corners*
0 Add a 4 corners polygon primitive as box body*
4,1,4,$2,$3,$4,$5,$6,$7,$8,$9,$2,$3,0*
0 Add four circle primitives for the rounded corners*
1,1,$1+$1,$2,$3*
1,1,$1+$1,$4,$5*
1,1,$1+$1,$6,$7*
1,1,$1+$1,$8,$9*
0 Add four rect primitives between the rounded corners*
20,1,$1+$1,$2,$3,$4,$5,0*
20,1,$1+$1,$4,$5,$6,$7,0*
20,1,$1+$1,$6,$7,$8,$9,0*
20,1,$1+$1,$8,$9,$2,$3,0*%
G04 Aperture macros list end*
%ADD10C,3.200000*%
%ADD11O,1.900000X1.200000*%
%ADD12C,1.450000*%
%ADD13RoundRect,0.218750X-0.256250X0.218750X-0.256250X-0.218750X0.256250X-0.218750X0.256250X0.218750X0*%
%ADD14R,1.700000X1.700000*%
%ADD15O,1.700000X1.700000*%
%ADD16RoundRect,0.250000X-0.750000X0.600000X-0.750000X-0.600000X0.750000X-0.600000X0.750000X0.600000X0*%
%ADD17O,2.000000X1.700000*%
%ADD18C,2.000000*%
G04 APERTURE END LIST*
D10*
%TO.C,H4*%
X105875000Y-94775000D03*
%TD*%
%TO.C,H2*%
X105875000Y-46775000D03*
%TD*%
%TO.C,H1*%
X65875000Y-46775000D03*
%TD*%
D11*
%TO.C,J2*%
X61087500Y-63400000D03*
D12*
X63787500Y-64400000D03*
X63787500Y-69400000D03*
D11*
X61087500Y-70400000D03*
%TD*%
D10*
%TO.C,H3*%
X65875000Y-94775000D03*
%TD*%
D13*
%TO.C,D1*%
X103400000Y-56525000D03*
X103400000Y-58100000D03*
%TD*%
D14*
%TO.C,J1*%
X62800000Y-75700000D03*
D15*
X62800000Y-78240000D03*
X62800000Y-80780000D03*
X62800000Y-83320000D03*
X62800000Y-85860000D03*
X62800000Y-88400000D03*
%TD*%
D16*
%TO.C,J5*%
X72575000Y-82250000D03*
D17*
X72575000Y-84750000D03*
%TD*%
D14*
%TO.C,JP1*%
X86700000Y-83550000D03*
D15*
X89240000Y-83550000D03*
%TD*%
D16*
%TO.C,J4*%
X62850000Y-56150000D03*
D17*
X62850000Y-58650000D03*
%TD*%
D14*
%TO.C,JP2*%
X86647450Y-88375000D03*
D15*
X89187450Y-88375000D03*
%TD*%
D18*
%TO.C,SW2*%
X86350000Y-79400000D03*
X92850000Y-79400000D03*
X86350000Y-74900000D03*
X92850000Y-74900000D03*
%TD*%
%TO.C,SW1*%
X75850000Y-55450000D03*
X75850000Y-48950000D03*
X71350000Y-55450000D03*
X71350000Y-48950000D03*
%TD*%
D14*
%TO.C,J3*%
X95715000Y-95100000D03*
D15*
X93175000Y-95100000D03*
X90635000Y-95100000D03*
X88095000Y-95100000D03*
X85555000Y-95100000D03*
X83015000Y-95100000D03*
X80475000Y-95100000D03*
X77935000Y-95100000D03*
X75395000Y-95100000D03*
X72855000Y-95100000D03*
%TD*%
M02*
