PCBNEW-LibModule-V1  2019-04-23 11:35:48
# encoding utf-8
Units mm
$INDEX
BG96MA
$EndINDEX
$MODULE BG96MA
Po 0 0 0 15 5cbeea84 00000000 ~~
Li BG96MA
Cd BG96MA
Kw Integrated Circuit
Sc 0
At SMD
AR 
Op 0 0 0
T0 -0.325 0 1.27 1.27 0 0.254 N V 21 N "IC**"
T1 -0.325 0 1.27 1.27 0 0.254 N I 21 N "BG96MA"
DS -11.25 -13.25 11.25 -13.25 0.2 24
DS 11.25 -13.25 11.25 13.25 0.2 24
DS 11.25 13.25 -11.25 13.25 0.2 24
DS -11.25 13.25 -11.25 -13.25 0.2 24
DS -11.25 -13.25 11.25 -13.25 0.1 21
DS 11.25 -13.25 11.25 13.25 0.1 21
DS 11.25 13.25 -11.25 13.25 0.1 21
DS -11.25 13.25 -11.25 -13.25 0.1 21
DS -12.9 -14.25 12.25 -14.25 0.1 24
DS 12.25 -14.25 12.25 14.25 0.1 24
DS 12.25 14.25 -12.9 14.25 0.1 24
DS -12.9 14.25 -12.9 -14.25 0.1 24
DS -12.9 -14.25 12.25 -14.25 0.1 24
DS 12.25 -14.25 12.25 14.25 0.1 24
DS 12.25 14.25 -12.9 14.25 0.1 24
DS -12.9 14.25 -12.9 -14.25 0.1 24
DS -11.8 -9.8 -11.8 -9.8 0.2 21
DS -11.8 -9.6 -11.8 -9.6 0.2 21
DA -11.8 -9.7 -11.800 -9.8 1800 0.2 21
DA -11.8 -9.7 -11.800 -9.6 1800 0.2 21
$PAD
Po -9.180 -9.7
Sh "1" R 0.700 1.150 0 0 900
At SMD N 00888000
Ne 0 ""
$EndPAD
$PAD
Po -9.180 -8.6
Sh "2" R 0.700 1.150 0 0 900
At SMD N 00888000
Ne 0 ""
$EndPAD
$PAD
Po -9.180 -7.5
Sh "3" R 0.700 1.150 0 0 900
At SMD N 00888000
Ne 0 ""
$EndPAD
$PAD
Po -9.180 -6.4
Sh "4" R 0.700 1.150 0 0 900
At SMD N 00888000
Ne 0 ""
$EndPAD
$PAD
Po -9.180 -5.3
Sh "5" R 0.700 1.150 0 0 900
At SMD N 00888000
Ne 0 ""
$EndPAD
$PAD
Po -9.180 -4.2
Sh "6" R 0.700 1.150 0 0 900
At SMD N 00888000
Ne 0 ""
$EndPAD
$PAD
Po -9.180 -3.1
Sh "7" R 0.700 1.150 0 0 900
At SMD N 00888000
Ne 0 ""
$EndPAD
$PAD
Po -9.180 -2
Sh "8" R 0.700 1.150 0 0 900
At SMD N 00888000
Ne 0 ""
$EndPAD
$PAD
Po -9.180 -0.9
Sh "9" R 0.700 1.150 0 0 900
At SMD N 00888000
Ne 0 ""
$EndPAD
$PAD
Po -9.180 0.2
Sh "10" R 0.700 1.150 0 0 900
At SMD N 00888000
Ne 0 ""
$EndPAD
$PAD
Po -9.180 1.9
Sh "11" R 0.700 1.150 0 0 900
At SMD N 00888000
Ne 0 ""
$EndPAD
$PAD
Po -9.180 3
Sh "12" R 0.700 1.150 0 0 900
At SMD N 00888000
Ne 0 ""
$EndPAD
$PAD
Po -9.180 4.1
Sh "13" R 0.700 1.150 0 0 900
At SMD N 00888000
Ne 0 ""
$EndPAD
$PAD
Po -9.180 5.2
Sh "14" R 0.700 1.150 0 0 900
At SMD N 00888000
Ne 0 ""
$EndPAD
$PAD
Po -9.180 6.3
Sh "15" R 0.700 1.150 0 0 900
At SMD N 00888000
Ne 0 ""
$EndPAD
$PAD
Po -9.180 7.4
Sh "16" R 0.700 1.150 0 0 900
At SMD N 00888000
Ne 0 ""
$EndPAD
$PAD
Po -9.180 8.5
Sh "17" R 0.700 1.150 0 0 900
At SMD N 00888000
Ne 0 ""
$EndPAD
$PAD
Po -9.180 9.6
Sh "18" R 0.700 1.150 0 0 900
At SMD N 00888000
Ne 0 ""
$EndPAD
$PAD
Po -7.450 11.025
Sh "19" R 0.700 1.150 0 0 0
At SMD N 00888000
Ne 0 ""
$EndPAD
$PAD
Po -6.350 11.025
Sh "20" R 0.700 1.150 0 0 0
At SMD N 00888000
Ne 0 ""
$EndPAD
$PAD
Po -5.250 11.025
Sh "21" R 0.700 1.150 0 0 0
At SMD N 00888000
Ne 0 ""
$EndPAD
$PAD
Po -4.150 11.025
Sh "22" R 0.700 1.150 0 0 0
At SMD N 00888000
Ne 0 ""
$EndPAD
$PAD
Po -3.050 11.025
Sh "23" R 0.700 1.150 0 0 0
At SMD N 00888000
Ne 0 ""
$EndPAD
$PAD
Po -1.950 11.025
Sh "24" R 0.700 1.150 0 0 0
At SMD N 00888000
Ne 0 ""
$EndPAD
$PAD
Po 0.550 11.025
Sh "25" R 0.700 1.150 0 0 0
At SMD N 00888000
Ne 0 ""
$EndPAD
$PAD
Po 1.650 11.025
Sh "26" R 0.700 1.150 0 0 0
At SMD N 00888000
Ne 0 ""
$EndPAD
$PAD
Po 2.750 11.025
Sh "27" R 0.700 1.150 0 0 0
At SMD N 00888000
Ne 0 ""
$EndPAD
$PAD
Po 3.850 11.025
Sh "28" R 0.700 1.150 0 0 0
At SMD N 00888000
Ne 0 ""
$EndPAD
$PAD
Po 4.950 11.025
Sh "29" R 0.700 1.150 0 0 0
At SMD N 00888000
Ne 0 ""
$EndPAD
$PAD
Po 6.050 11.025
Sh "30" R 0.700 1.150 0 0 0
At SMD N 00888000
Ne 0 ""
$EndPAD
$PAD
Po 7.150 11.025
Sh "31" R 0.700 1.150 0 0 0
At SMD N 00888000
Ne 0 ""
$EndPAD
$PAD
Po 9.180 9.8
Sh "32" R 0.700 1.150 0 0 900
At SMD N 00888000
Ne 0 ""
$EndPAD
$PAD
Po 9.180 8.7
Sh "33" R 0.700 1.150 0 0 900
At SMD N 00888000
Ne 0 ""
$EndPAD
$PAD
Po 9.180 7.6
Sh "34" R 0.700 1.150 0 0 900
At SMD N 00888000
Ne 0 ""
$EndPAD
$PAD
Po 9.180 6.5
Sh "35" R 0.700 1.150 0 0 900
At SMD N 00888000
Ne 0 ""
$EndPAD
$PAD
Po 9.180 5.4
Sh "36" R 0.700 1.150 0 0 900
At SMD N 00888000
Ne 0 ""
$EndPAD
$PAD
Po 9.180 4.3
Sh "37" R 0.700 1.150 0 0 900
At SMD N 00888000
Ne 0 ""
$EndPAD
$PAD
Po 9.180 3.2
Sh "38" R 0.700 1.150 0 0 900
At SMD N 00888000
Ne 0 ""
$EndPAD
$PAD
Po 9.180 2.1
Sh "39" R 0.700 1.150 0 0 900
At SMD N 00888000
Ne 0 ""
$EndPAD
$PAD
Po 9.180 0.2
Sh "40" R 0.700 1.150 0 0 900
At SMD N 00888000
Ne 0 ""
$EndPAD
$PAD
Po 9.180 -0.9
Sh "41" R 0.700 1.150 0 0 900
At SMD N 00888000
Ne 0 ""
$EndPAD
$PAD
Po 9.180 -2
Sh "42" R 0.700 1.150 0 0 900
At SMD N 00888000
Ne 0 ""
$EndPAD
$PAD
Po 9.180 -3.1
Sh "43" R 0.700 1.150 0 0 900
At SMD N 00888000
Ne 0 ""
$EndPAD
$PAD
Po 9.180 -4.2
Sh "44" R 0.700 1.150 0 0 900
At SMD N 00888000
Ne 0 ""
$EndPAD
$PAD
Po 9.180 -5.3
Sh "45" R 0.700 1.150 0 0 900
At SMD N 00888000
Ne 0 ""
$EndPAD
$PAD
Po 9.180 -6.4
Sh "46" R 0.700 1.150 0 0 900
At SMD N 00888000
Ne 0 ""
$EndPAD
$PAD
Po 9.180 -7.5
Sh "47" R 0.700 1.150 0 0 900
At SMD N 00888000
Ne 0 ""
$EndPAD
$PAD
Po 9.180 -8.6
Sh "48" R 0.700 1.150 0 0 900
At SMD N 00888000
Ne 0 ""
$EndPAD
$PAD
Po 9.180 -9.7
Sh "49" R 0.700 1.150 0 0 900
At SMD N 00888000
Ne 0 ""
$EndPAD
$PAD
Po 7.150 -11.025
Sh "50" R 0.700 1.150 0 0 0
At SMD N 00888000
Ne 0 ""
$EndPAD
$PAD
Po 6.050 -11.025
Sh "51" R 0.700 1.150 0 0 0
At SMD N 00888000
Ne 0 ""
$EndPAD
$PAD
Po 4.950 -11.025
Sh "52" R 0.700 1.150 0 0 0
At SMD N 00888000
Ne 0 ""
$EndPAD
$PAD
Po 3.850 -11.025
Sh "53" R 0.700 1.150 0 0 0
At SMD N 00888000
Ne 0 ""
$EndPAD
$PAD
Po 2.750 -11.025
Sh "54" R 0.700 1.150 0 0 0
At SMD N 00888000
Ne 0 ""
$EndPAD
$PAD
Po 1.650 -11.025
Sh "55" R 0.700 1.150 0 0 0
At SMD N 00888000
Ne 0 ""
$EndPAD
$PAD
Po 0.550 -11.025
Sh "56" R 0.700 1.150 0 0 0
At SMD N 00888000
Ne 0 ""
$EndPAD
$PAD
Po -1.950 -11.025
Sh "57" R 0.700 1.150 0 0 0
At SMD N 00888000
Ne 0 ""
$EndPAD
$PAD
Po -3.050 -11.025
Sh "58" R 0.700 1.150 0 0 0
At SMD N 00888000
Ne 0 ""
$EndPAD
$PAD
Po -4.150 -11.025
Sh "59" R 0.700 1.150 0 0 0
At SMD N 00888000
Ne 0 ""
$EndPAD
$PAD
Po -5.250 -11.025
Sh "60" R 0.700 1.150 0 0 0
At SMD N 00888000
Ne 0 ""
$EndPAD
$PAD
Po -6.350 -11.025
Sh "61" R 0.700 1.150 0 0 0
At SMD N 00888000
Ne 0 ""
$EndPAD
$PAD
Po -7.450 -11.025
Sh "62" R 0.700 1.150 0 0 0
At SMD N 00888000
Ne 0 ""
$EndPAD
$PAD
Po -5.950 -4.25
Sh "63" R 1.000 1.000 0 0 0
At SMD N 00888000
Ne 0 ""
$EndPAD
$PAD
Po -5.950 -2.55
Sh "64" R 1.000 1.000 0 0 0
At SMD N 00888000
Ne 0 ""
$EndPAD
$PAD
Po -5.950 -0.85
Sh "65" R 1.000 1.000 0 0 0
At SMD N 00888000
Ne 0 ""
$EndPAD
$PAD
Po -5.950 0.85
Sh "66" R 1.000 1.000 0 0 0
At SMD N 00888000
Ne 0 ""
$EndPAD
$PAD
Po -5.950 2.55
Sh "67" R 1.000 1.000 0 0 0
At SMD N 00888000
Ne 0 ""
$EndPAD
$PAD
Po -5.950 4.25
Sh "68" R 1.000 1.000 0 0 0
At SMD N 00888000
Ne 0 ""
$EndPAD
$PAD
Po -2.550 7.65
Sh "69" R 1.000 1.000 0 0 0
At SMD N 00888000
Ne 0 ""
$EndPAD
$PAD
Po -0.850 7.65
Sh "70" R 1.000 1.000 0 0 0
At SMD N 00888000
Ne 0 ""
$EndPAD
$PAD
Po 0.850 7.65
Sh "71" R 1.000 1.000 0 0 0
At SMD N 00888000
Ne 0 ""
$EndPAD
$PAD
Po 2.550 7.65
Sh "72" R 1.000 1.000 0 0 0
At SMD N 00888000
Ne 0 ""
$EndPAD
$PAD
Po 5.950 4.25
Sh "73" R 1.000 1.000 0 0 0
At SMD N 00888000
Ne 0 ""
$EndPAD
$PAD
Po 5.950 2.55
Sh "74" R 1.000 1.000 0 0 0
At SMD N 00888000
Ne 0 ""
$EndPAD
$PAD
Po 5.950 0.85
Sh "75" R 1.000 1.000 0 0 0
At SMD N 00888000
Ne 0 ""
$EndPAD
$PAD
Po 5.950 -0.85
Sh "76" R 1.000 1.000 0 0 0
At SMD N 00888000
Ne 0 ""
$EndPAD
$PAD
Po 5.950 -2.55
Sh "77" R 1.000 1.000 0 0 0
At SMD N 00888000
Ne 0 ""
$EndPAD
$PAD
Po 5.950 -4.25
Sh "78" R 1.000 1.000 0 0 0
At SMD N 00888000
Ne 0 ""
$EndPAD
$PAD
Po 2.550 -7.65
Sh "79" R 1.000 1.000 0 0 0
At SMD N 00888000
Ne 0 ""
$EndPAD
$PAD
Po 0.850 -7.65
Sh "80" R 1.000 1.000 0 0 0
At SMD N 00888000
Ne 0 ""
$EndPAD
$PAD
Po -0.850 -7.65
Sh "81" R 1.000 1.000 0 0 0
At SMD N 00888000
Ne 0 ""
$EndPAD
$PAD
Po -2.550 -7.65
Sh "82" R 1.000 1.000 0 0 0
At SMD N 00888000
Ne 0 ""
$EndPAD
$PAD
Po -4.250 -4.25
Sh "83" R 1.000 1.000 0 0 0
At SMD N 00888000
Ne 0 ""
$EndPAD
$PAD
Po -4.250 -2.55
Sh "84" R 1.000 1.000 0 0 0
At SMD N 00888000
Ne 0 ""
$EndPAD
$PAD
Po -4.250 -0.85
Sh "85" R 1.000 1.000 0 0 0
At SMD N 00888000
Ne 0 ""
$EndPAD
$PAD
Po -4.250 0.85
Sh "86" R 1.000 1.000 0 0 0
At SMD N 00888000
Ne 0 ""
$EndPAD
$PAD
Po -4.250 2.55
Sh "87" R 1.000 1.000 0 0 0
At SMD N 00888000
Ne 0 ""
$EndPAD
$PAD
Po -4.250 4.25
Sh "88" R 1.000 1.000 0 0 0
At SMD N 00888000
Ne 0 ""
$EndPAD
$PAD
Po -2.550 5.95
Sh "89" R 1.000 1.000 0 0 0
At SMD N 00888000
Ne 0 ""
$EndPAD
$PAD
Po -0.850 5.95
Sh "90" R 1.000 1.000 0 0 0
At SMD N 00888000
Ne 0 ""
$EndPAD
$PAD
Po 0.850 5.95
Sh "91" R 1.000 1.000 0 0 0
At SMD N 00888000
Ne 0 ""
$EndPAD
$PAD
Po 2.550 5.95
Sh "92" R 1.000 1.000 0 0 0
At SMD N 00888000
Ne 0 ""
$EndPAD
$PAD
Po 4.250 4.25
Sh "93" R 1.000 1.000 0 0 0
At SMD N 00888000
Ne 0 ""
$EndPAD
$PAD
Po 4.250 2.55
Sh "94" R 1.000 1.000 0 0 0
At SMD N 00888000
Ne 0 ""
$EndPAD
$PAD
Po 4.250 0.85
Sh "95" R 1.000 1.000 0 0 0
At SMD N 00888000
Ne 0 ""
$EndPAD
$PAD
Po 4.250 -0.85
Sh "96" R 1.000 1.000 0 0 0
At SMD N 00888000
Ne 0 ""
$EndPAD
$PAD
Po 4.250 -2.55
Sh "97" R 1.000 1.000 0 0 0
At SMD N 00888000
Ne 0 ""
$EndPAD
$PAD
Po 4.250 -4.25
Sh "98" R 1.000 1.000 0 0 0
At SMD N 00888000
Ne 0 ""
$EndPAD
$PAD
Po 2.550 -5.95
Sh "99" R 1.000 1.000 0 0 0
At SMD N 00888000
Ne 0 ""
$EndPAD
$PAD
Po 0.850 -5.95
Sh "100" R 1.000 1.000 0 0 0
At SMD N 00888000
Ne 0 ""
$EndPAD
$PAD
Po -0.850 -5.95
Sh "101" R 1.000 1.000 0 0 0
At SMD N 00888000
Ne 0 ""
$EndPAD
$PAD
Po -2.550 -5.95
Sh "102" R 1.000 1.000 0 0 0
At SMD N 00888000
Ne 0 ""
$EndPAD
$EndMODULE BG96MA
$EndLIBRARY
