(module LOGO (layer F.Cu)
  (at 0 0)
 (fp_text reference "G***" (at 0 0) (layer F.SilkS) hide
  (effects (font (thickness 0.3)))
  )
  (fp_text value "LOGO" (at 0.75 0) (layer F.SilkS) hide
  (effects (font (thickness 0.3)))
  )
  (fp_poly (pts (xy -8.371421 -8.237702) (xy -8.258326 -8.236516) (xy -8.145528 -8.234263) (xy -8.036980 -8.231003) (xy -7.936634 -8.226798) (xy -7.848439 -8.221710) (xy -7.776347 -8.215800) (xy -7.772400 -8.215397)
     (xy -7.466897 -8.180977) (xy -7.179010 -8.142455) (xy -6.906344 -8.099255) (xy -6.646500 -8.050795) (xy -6.397085 -7.996498) (xy -6.155700 -7.935783) (xy -5.919951 -7.868073) (xy -5.687440 -7.792787)
     (xy -5.455771 -7.709346) (xy -5.222548 -7.617172) (xy -5.120640 -7.574474) (xy -4.818715 -7.437081) (xy -4.515202 -7.281812) (xy -4.213103 -7.110585) (xy -3.915418 -6.925319) (xy -3.625148 -6.727933)
     (xy -3.345295 -6.520346) (xy -3.078859 -6.304476) (xy -2.926080 -6.171233) (xy -2.862254 -6.112435) (xy -2.788440 -6.041912) (xy -2.708009 -5.963084) (xy -2.624332 -5.879368) (xy -2.540779 -5.794181)
     (xy -2.460720 -5.710943) (xy -2.387526 -5.633070) (xy -2.324567 -5.563980) (xy -2.301649 -5.538016) (xy -2.049359 -5.233256) (xy -1.811619 -4.914468) (xy -1.588635 -4.582020) (xy -1.380612 -4.236278)
     (xy -1.187757 -3.877609) (xy -1.010278 -3.506379) (xy -0.848379 -3.122955) (xy -0.702267 -2.727705) (xy -0.675040 -2.647515) (xy -0.563442 -2.291544) (xy -0.469142 -1.941298) (xy -0.391431 -1.593087)
     (xy -0.329601 -1.243219) (xy -0.282942 -0.888002) (xy -0.250747 -0.523745) (xy -0.242917 -0.396240) (xy -0.239717 -0.320644) (xy -0.237463 -0.230691) (xy -0.236122 -0.129872) (xy -0.235656 -0.021679)
     (xy -0.236030 0.090397) (xy -0.237209 0.202865) (xy -0.239156 0.312233) (xy -0.241837 0.415010) (xy -0.245214 0.507705) (xy -0.249253 0.586826) (xy -0.253571 0.645160) (xy -0.273819 0.842950)
     (xy -0.298610 1.045822) (xy -0.327097 1.247903) (xy -0.358436 1.443320) (xy -0.391780 1.626201) (xy -0.402809 1.681480) (xy -0.493454 2.075146) (xy -0.602987 2.462038) (xy -0.730944 2.841581)
     (xy -0.876861 3.213200) (xy -1.040275 3.576320) (xy -1.220722 3.930366) (xy -1.417739 4.274763) (xy -1.630862 4.608936) (xy -1.859627 4.932311) (xy -2.103571 5.244311) (xy -2.362231 5.544363)
     (xy -2.635142 5.831891) (xy -2.921841 6.106320) (xy -3.221864 6.367076) (xy -3.534748 6.613583) (xy -3.860029 6.845266) (xy -4.197244 7.061551) (xy -4.545929 7.261863) (xy -4.905620 7.445626)
     (xy -5.136505 7.552126) (xy -5.513148 7.707767) (xy -5.896110 7.844120) (xy -6.285129 7.961120) (xy -6.679942 8.058706) (xy -7.080289 8.136813) (xy -7.485907 8.195378) (xy -7.896535 8.234338)
     (xy -7.975600 8.239549) (xy -8.035551 8.242368) (xy -8.111927 8.244625) (xy -8.201241 8.246325) (xy -8.300005 8.247470) (xy -8.404733 8.248064) (xy -8.511935 8.248109) (xy -8.618126 8.247610)
     (xy -8.719816 8.246570) (xy -8.813519 8.244991) (xy -8.895746 8.242877) (xy -8.963011 8.240231) (xy -8.991600 8.238601) (xy -9.403462 8.201417) (xy -9.810309 8.144782) (xy -10.211635 8.068894)
     (xy -10.606931 7.973949) (xy -10.995691 7.860147) (xy -11.377406 7.727683) (xy -11.751569 7.576755) (xy -12.117673 7.407561) (xy -12.475209 7.220297) (xy -12.823670 7.015162) (xy -13.162548 6.792352)
     (xy -13.491337 6.552066) (xy -13.648152 6.428371) (xy -13.796090 6.305074) (xy -13.949596 6.170283) (xy -14.104690 6.027798) (xy -14.257389 5.881418) (xy -14.403712 5.734942) (xy -14.539678 5.592169)
     (xy -14.635467 5.486400) (xy -14.900642 5.170932) (xy -15.148398 4.845287) (xy -15.378568 4.510029) (xy -15.590980 4.165722) (xy -15.785468 3.812931) (xy -15.961861 3.452217) (xy -16.119991 3.084147)
     (xy -16.259688 2.709283) (xy -16.380783 2.328190) (xy -16.483108 1.941431) (xy -16.566494 1.549571) (xy -16.630770 1.153172) (xy -16.675769 0.752800) (xy -16.701321 0.349019) (xy -16.707258 -0.057609)
     (xy -16.693410 -0.466519) (xy -16.659607 -0.877147) (xy -16.625683 -1.153160) (xy -16.560306 -1.549515) (xy -16.475442 -1.941012) (xy -16.371491 -2.326985) (xy -16.248848 -2.706767) (xy -16.107913 -3.079689)
     (xy -15.949082 -3.445084) (xy -15.772753 -3.802285) (xy -15.579323 -4.150625) (xy -15.369191 -4.489435) (xy -15.142754 -4.818049) (xy -14.900409 -5.135798) (xy -14.642554 -5.442016) (xy -14.369587 -5.736035)
     (xy -14.081904 -6.017188) (xy -13.779905 -6.284807) (xy -13.463985 -6.538224) (xy -13.380720 -6.600883) (xy -13.049802 -6.834032) (xy -12.707311 -7.050720) (xy -12.354239 -7.250458) (xy -11.991577 -7.432757)
     (xy -11.620316 -7.597127) (xy -11.241445 -7.743079) (xy -10.855956 -7.870124) (xy -10.744200 -7.903036) (xy -10.447729 -7.981772) (xy -10.142994 -8.050169) (xy -9.828034 -8.108549) (xy -9.500883 -8.157235)
     (xy -9.159578 -8.196549) (xy -8.802154 -8.226813) (xy -8.747760 -8.230543) (xy -8.672985 -8.234241) (xy -8.582702 -8.236626) (xy -8.480864 -8.237759) (xy -8.371421 -8.237702) )(layer F.SilkS) (width  0.010000)
  )
  (fp_poly (pts (xy 11.590546 -2.687329) (xy 11.596454 -2.674485) (xy 11.605626 -2.645622) (xy 11.617090 -2.604596) (xy 11.629874 -2.555261) (xy 11.643006 -2.501471) (xy 11.655513 -2.447082) (xy 11.666424 -2.395949)
     (xy 11.673971 -2.356495) (xy 11.681234 -2.305825) (xy 11.687854 -2.241776) (xy 11.693657 -2.168374) (xy 11.698471 -2.089644) (xy 11.702122 -2.009609) (xy 11.704438 -1.932296) (xy 11.705245 -1.861729)
     (xy 11.704371 -1.801932) (xy 11.701643 -1.756931) (xy 11.700235 -1.745540) (xy 11.693540 -1.700894) (xy 11.488110 -1.699903) (xy 11.270363 -1.694115) (xy 11.069587 -1.678963) (xy 10.990576 -1.669827)
     (xy 10.942312 -1.663622) (xy 10.978132 -1.616671) (xy 11.054326 -1.504682) (xy 11.125065 -1.376756) (xy 11.188576 -1.236939) (xy 11.243086 -1.089280) (xy 11.286822 -0.937824) (xy 11.299687 -0.882697)
     (xy 11.307284 -0.845712) (xy 11.313029 -0.811145) (xy 11.317175 -0.775241) (xy 11.319974 -0.734243) (xy 11.321679 -0.684393) (xy 11.322543 -0.621936) (xy 11.322817 -0.543115) (xy 11.322820 -0.538480)
     (xy 11.322454 -0.450198) (xy 11.321129 -0.378685) (xy 11.318660 -0.320405) (xy 11.314859 -0.271823) (xy 11.309541 -0.229404) (xy 11.305133 -0.203200) (xy 11.258562 0.001437) (xy 11.196617 0.193208)
     (xy 11.118957 0.372918) (xy 11.025240 0.541372) (xy 10.931680 0.677670) (xy 10.803805 0.831108) (xy 10.661959 0.969925) (xy 10.506474 1.093934) (xy 10.337679 1.202951) (xy 10.155905 1.296790)
     (xy 9.961484 1.375264) (xy 9.754745 1.438187) (xy 9.536020 1.485374) (xy 9.477812 1.494952) (xy 9.426642 1.502359) (xy 9.378736 1.508002) (xy 9.330012 1.512106) (xy 9.276387 1.514896)
     (xy 9.213780 1.516600) (xy 9.138107 1.517443) (xy 9.067800 1.517647) (xy 8.962310 1.517118) (xy 8.871544 1.515066) (xy 8.789929 1.511017) (xy 8.711896 1.504495) (xy 8.631874 1.495028)
     (xy 8.544293 1.482138) (xy 8.443581 1.465353) (xy 8.433348 1.463577) (xy 8.383738 1.455083) (xy 8.349904 1.450103) (xy 8.327611 1.448626) (xy 8.312624 1.450644) (xy 8.300706 1.456149)
     (xy 8.290226 1.463277) (xy 8.248053 1.500588) (xy 8.208460 1.548094) (xy 8.179059 1.596577) (xy 8.177686 1.599535) (xy 8.160552 1.653934) (xy 8.161918 1.703176) (xy 8.182342 1.749373)
     (xy 8.222377 1.794636) (xy 8.231067 1.802298) (xy 8.261225 1.824940) (xy 8.296924 1.845338) (xy 8.339614 1.863771) (xy 8.390742 1.880517) (xy 8.451756 1.895853) (xy 8.524104 1.910058)
     (xy 8.609235 1.923408) (xy 8.708596 1.936181) (xy 8.823637 1.948656) (xy 8.955803 1.961110) (xy 9.106545 1.973820) (xy 9.138920 1.976407) (xy 9.298062 1.989438) (xy 9.439689 2.001969)
     (xy 9.566592 2.014306) (xy 9.681558 2.026757) (xy 9.787377 2.039632) (xy 9.886839 2.053236) (xy 9.982733 2.067879) (xy 10.013873 2.072959) (xy 10.244497 2.117128) (xy 10.457153 2.170357)
     (xy 10.652150 2.232827) (xy 10.829799 2.304719) (xy 10.990408 2.386215) (xy 11.134287 2.477494) (xy 11.261745 2.578738) (xy 11.373091 2.690128) (xy 11.468636 2.811844) (xy 11.548688 2.944068)
     (xy 11.567608 2.981433) (xy 11.610631 3.075946) (xy 11.644498 3.165602) (xy 11.671995 3.258723) (xy 11.695909 3.363630) (xy 11.696462 3.366362) (xy 11.703996 3.405994) (xy 11.709701 3.442940)
     (xy 11.713820 3.481013) (xy 11.716597 3.524029) (xy 11.718277 3.575802) (xy 11.719103 3.640146) (xy 11.719320 3.720875) (xy 11.719320 3.723640) (xy 11.719106 3.804124) (xy 11.718340 3.867942)
     (xy 11.716781 3.918744) (xy 11.714192 3.960182) (xy 11.710331 3.995906) (xy 11.704959 4.029567) (xy 11.697837 4.064817) (xy 11.696541 4.070749) (xy 11.645362 4.257273) (xy 11.576172 4.435176)
     (xy 11.489582 4.603971) (xy 11.386202 4.763169) (xy 11.266642 4.912283) (xy 11.131515 5.050825) (xy 10.981430 5.178306) (xy 10.816998 5.294237) (xy 10.638830 5.398132) (xy 10.447536 5.489501)
     (xy 10.243728 5.567858) (xy 10.028015 5.632712) (xy 9.801009 5.683577) (xy 9.646920 5.709016) (xy 9.475578 5.729033) (xy 9.292667 5.742351) (xy 9.105912 5.748643) (xy 8.923041 5.747577)
     (xy 8.829040 5.743849) (xy 8.591826 5.726542) (xy 8.367538 5.700482) (xy 8.158662 5.665974) (xy 8.097987 5.653728) (xy 7.883648 5.601146) (xy 7.682721 5.536984) (xy 7.495687 5.461711)
     (xy 7.323032 5.375795) (xy 7.165238 5.279706) (xy 7.022790 5.173910) (xy 6.896171 5.058876) (xy 6.785864 4.935074) (xy 6.692354 4.802970) (xy 6.616123 4.663033) (xy 6.557655 4.515732)
     (xy 6.517435 4.361536) (xy 6.495945 4.200911) (xy 6.492240 4.098663) (xy 6.498162 3.971712) (xy 6.504474 3.931755) (xy 7.796990 3.931755) (xy 7.810295 4.037101) (xy 7.842097 4.136426)
     (xy 7.891800 4.229231) (xy 7.958810 4.315017) (xy 8.042529 4.393283) (xy 8.142362 4.463532) (xy 8.257713 4.525262) (xy 8.387985 4.577975) (xy 8.532583 4.621170) (xy 8.690910 4.654350)
     (xy 8.818880 4.672426) (xy 8.877638 4.677258) (xy 8.950664 4.680398) (xy 9.032634 4.681878) (xy 9.118226 4.681733) (xy 9.202117 4.679994) (xy 9.278984 4.676697) (xy 9.343505 4.671874)
     (xy 9.368905 4.668976) (xy 9.542156 4.638308) (xy 9.700197 4.594394) (xy 9.843345 4.537101) (xy 9.971915 4.466292) (xy 10.086222 4.381832) (xy 10.128170 4.344056) (xy 10.206696 4.258284)
     (xy 10.266852 4.169153) (xy 10.308781 4.078170) (xy 10.332625 3.986845) (xy 10.338525 3.896689) (xy 10.326624 3.809210) (xy 10.297064 3.725919) (xy 10.249987 3.648324) (xy 10.185535 3.577935)
     (xy 10.103851 3.516262) (xy 10.047219 3.484367) (xy 9.989252 3.456928) (xy 9.928961 3.432085) (xy 9.864633 3.409498) (xy 9.794553 3.388831) (xy 9.717007 3.369745) (xy 9.630280 3.351901)
     (xy 9.532658 3.334962) (xy 9.422426 3.318589) (xy 9.297869 3.302445) (xy 9.157273 3.286191) (xy 8.998924 3.269489) (xy 8.915400 3.261143) (xy 8.754546 3.244682) (xy 8.612891 3.228849)
     (xy 8.490663 3.213674) (xy 8.388090 3.199187) (xy 8.305399 3.185418) (xy 8.250691 3.174250) (xy 8.216366 3.167699) (xy 8.190153 3.165192) (xy 8.178104 3.167116) (xy 8.169235 3.177493)
     (xy 8.150050 3.200418) (xy 8.123159 3.232757) (xy 8.091171 3.271378) (xy 8.082657 3.281680) (xy 8.003703 3.381447) (xy 7.939802 3.472059) (xy 7.889530 3.556257) (xy 7.851464 3.636782)
     (xy 7.824182 3.716375) (xy 7.806262 3.797776) (xy 7.802780 3.820889) (xy 7.796990 3.931755) (xy 6.504474 3.931755) (xy 6.516845 3.853446) (xy 6.549666 3.738341) (xy 6.597998 3.620876)
     (xy 6.624752 3.566596) (xy 6.694288 3.448654) (xy 6.779732 3.334655) (xy 6.883024 3.222081) (xy 6.910607 3.195071) (xy 7.003198 3.111571) (xy 7.096741 3.039174) (xy 7.198472 2.972574)
     (xy 7.272015 2.930101) (xy 7.365991 2.878090) (xy 7.289950 2.819847) (xy 7.185209 2.729700) (xy 7.093888 2.630691) (xy 7.017873 2.525322) (xy 6.959054 2.416097) (xy 6.930767 2.343710)
     (xy 6.907378 2.265561) (xy 6.891601 2.192494) (xy 6.882603 2.118014) (xy 6.879551 2.035631) (xy 6.880964 1.955800) (xy 6.883812 1.892453) (xy 6.887777 1.843724) (xy 6.893682 1.803912)
     (xy 6.902350 1.767315) (xy 6.913240 1.732280) (xy 6.963573 1.612277) (xy 7.032298 1.495329) (xy 7.117504 1.383626) (xy 7.217283 1.279361) (xy 7.329722 1.184724) (xy 7.452914 1.101908)
     (xy 7.472680 1.090367) (xy 7.508879 1.070159) (xy 7.540371 1.053491) (xy 7.561340 1.043422) (xy 7.563810 1.042451) (xy 7.574644 1.036820) (xy 7.573161 1.028995) (xy 7.557561 1.014869)
     (xy 7.548644 1.007843) (xy 7.409486 0.886763) (xy 7.282411 0.750352) (xy 7.168650 0.600459) (xy 7.069430 0.438928) (xy 6.985980 0.267607) (xy 6.919528 0.088343) (xy 6.905106 0.040384)
     (xy 6.876436 -0.078606) (xy 6.853930 -0.210909) (xy 6.838119 -0.350315) (xy 6.829534 -0.490613) (xy 6.829372 -0.517138) (xy 8.304847 -0.517138) (xy 8.306758 -0.432789) (xy 8.311383 -0.354817)
     (xy 8.318721 -0.288496) (xy 8.324516 -0.256072) (xy 8.362655 -0.115095) (xy 8.412600 0.010431) (xy 8.475258 0.122205) (xy 8.551531 0.221921) (xy 8.612734 0.284736) (xy 8.708164 0.361323)
     (xy 8.810260 0.419700) (xy 8.917470 0.459488) (xy 9.028238 0.480303) (xy 9.141011 0.481767) (xy 9.254236 0.463496) (xy 9.294740 0.452036) (xy 9.379031 0.416814) (xy 9.464572 0.365326)
     (xy 9.547154 0.300875) (xy 9.622565 0.226769) (xy 9.686596 0.146312) (xy 9.689384 0.142240) (xy 9.756104 0.026829) (xy 9.808840 -0.100515) (xy 9.847566 -0.236957) (xy 9.872258 -0.379666)
     (xy 9.882890 -0.525807) (xy 9.879437 -0.672547) (xy 9.861874 -0.817051) (xy 9.830175 -0.956488) (xy 9.784316 -1.088023) (xy 9.724272 -1.208822) (xy 9.701711 -1.245278) (xy 9.633215 -1.335594)
     (xy 9.553391 -1.415714) (xy 9.465741 -1.482771) (xy 9.373768 -1.533901) (xy 9.325011 -1.553376) (xy 9.215895 -1.581992) (xy 9.110093 -1.591114) (xy 9.005824 -1.580599) (xy 8.901304 -1.550307)
     (xy 8.818880 -1.513076) (xy 8.712244 -1.446470) (xy 8.615065 -1.362991) (xy 8.528536 -1.264331) (xy 8.453853 -1.152184) (xy 8.392211 -1.028240) (xy 8.344804 -0.894193) (xy 8.324370 -0.812800)
     (xy 8.315412 -0.755695) (xy 8.309173 -0.683866) (xy 8.305652 -0.602589) (xy 8.304847 -0.517138) (xy 6.829372 -0.517138) (xy 6.828705 -0.625594) (xy 6.836164 -0.749046) (xy 6.836991 -0.756920)
     (xy 6.868463 -0.958958) (xy 6.918184 -1.152057) (xy 6.986180 -1.336278) (xy 7.072481 -1.511679) (xy 7.177115 -1.678320) (xy 7.300111 -1.836261) (xy 7.416470 -1.961091) (xy 7.571396 -2.100735)
     (xy 7.740140 -2.226217) (xy 7.921306 -2.336851) (xy 8.113503 -2.431949) (xy 8.315334 -2.510822) (xy 8.525408 -2.572784) (xy 8.742331 -2.617146) (xy 8.748122 -2.618070) (xy 8.814757 -2.626062)
     (xy 8.896934 -2.631882) (xy 8.989993 -2.635534) (xy 9.089273 -2.637021) (xy 9.190113 -2.636345) (xy 9.287851 -2.633509) (xy 9.377828 -2.628516) (xy 9.455382 -2.621370) (xy 9.483852 -2.617620)
     (xy 9.671201 -2.582560) (xy 9.847150 -2.533820) (xy 10.016615 -2.469826) (xy 10.162658 -2.400492) (xy 10.271996 -2.343742) (xy 10.386178 -2.400434) (xy 10.557548 -2.477965) (xy 10.733531 -2.542183)
     (xy 10.917823 -2.594185) (xy 11.114119 -2.635066) (xy 11.247120 -2.655813) (xy 11.296138 -2.662119) (xy 11.350855 -2.668429) (xy 11.407553 -2.674400) (xy 11.462513 -2.679693) (xy 11.512018 -2.683966)
     (xy 11.552348 -2.686878) (xy 11.579786 -2.688087) (xy 11.590546 -2.687329) )(layer F.SilkS) (width  0.010000)
  )
  (fp_poly (pts (xy 4.406634 -2.134289) (xy 4.565455 -2.111771) (xy 4.713092 -2.073352) (xy 4.848893 -2.019511) (xy 4.972204 -1.950724) (xy 5.082374 -1.867468) (xy 5.178750 -1.770221) (xy 5.260680 -1.659460)
     (xy 5.327511 -1.535662) (xy 5.368704 -1.430461) (xy 5.376694 -1.406928) (xy 5.383951 -1.385871) (xy 5.390512 -1.366261) (xy 5.396418 -1.347073) (xy 5.401705 -1.327278) (xy 5.406414 -1.305850)
     (xy 5.410581 -1.281761) (xy 5.414246 -1.253984) (xy 5.417447 -1.221492) (xy 5.420223 -1.183258) (xy 5.422612 -1.138254) (xy 5.424653 -1.085453) (xy 5.426384 -1.023829) (xy 5.427844 -0.952353)
     (xy 5.429071 -0.869999) (xy 5.430104 -0.775740) (xy 5.430981 -0.668547) (xy 5.431741 -0.547395) (xy 5.432422 -0.411256) (xy 5.433063 -0.259102) (xy 5.433702 -0.089906) (xy 5.434378 0.097358)
     (xy 5.435130 0.303718) (xy 5.435285 0.345440) (xy 5.436073 0.553370) (xy 5.436815 0.741962) (xy 5.437525 0.912199) (xy 5.438219 1.065062) (xy 5.438912 1.201534) (xy 5.439617 1.322597)
     (xy 5.440351 1.429232) (xy 5.441128 1.522423) (xy 5.441963 1.603150) (xy 5.442871 1.672397) (xy 5.443866 1.731145) (xy 5.444965 1.780377) (xy 5.446181 1.821074) (xy 5.447529 1.854219)
     (xy 5.449025 1.880793) (xy 5.450684 1.901780) (xy 5.452519 1.918160) (xy 5.454547 1.930917) (xy 5.456782 1.941033) (xy 5.459238 1.949488) (xy 5.459642 1.950720) (xy 5.489765 2.017832)
     (xy 5.529946 2.069633) (xy 5.561236 2.094390) (xy 5.602602 2.109131) (xy 5.654224 2.109651) (xy 5.712162 2.096264) (xy 5.753999 2.078967) (xy 5.781366 2.066182) (xy 5.802907 2.059608)
     (xy 5.822086 2.060780) (xy 5.842365 2.071235) (xy 5.867206 2.092509) (xy 5.900073 2.126136) (xy 5.928206 2.156233) (xy 6.021592 2.268264) (xy 6.106784 2.393499) (xy 6.180129 2.525933)
     (xy 6.237978 2.659563) (xy 6.243405 2.674547) (xy 6.271303 2.753214) (xy 6.227407 2.810111) (xy 6.179659 2.865603) (xy 6.119264 2.926045) (xy 6.051443 2.986710) (xy 5.981415 3.042866)
     (xy 5.930083 3.079517) (xy 5.786058 3.164537) (xy 5.634681 3.231164) (xy 5.474059 3.280185) (xy 5.415640 3.293261) (xy 5.360837 3.302035) (xy 5.293324 3.309162) (xy 5.218414 3.314435)
     (xy 5.141416 3.317645) (xy 5.067643 3.318584) (xy 5.002405 3.317043) (xy 4.951015 3.312814) (xy 4.943701 3.311761) (xy 4.798292 3.279145) (xy 4.662378 3.228872) (xy 4.536594 3.161570)
     (xy 4.421576 3.077869) (xy 4.317960 2.978397) (xy 4.226381 2.863784) (xy 4.147474 2.734660) (xy 4.081877 2.591653) (xy 4.030223 2.435393) (xy 4.020410 2.397760) (xy 4.017530 2.385889)
     (xy 4.014915 2.373922) (xy 4.012548 2.360849) (xy 4.010414 2.345664) (xy 4.008494 2.327360) (xy 4.006772 2.304928) (xy 4.005231 2.277362) (xy 4.003854 2.243655) (xy 4.002624 2.202798)
     (xy 4.001524 2.153784) (xy 4.000537 2.095607) (xy 3.999647 2.027258) (xy 3.998837 1.947731) (xy 3.998089 1.856018) (xy 3.997386 1.751111) (xy 3.996713 1.632003) (xy 3.996051 1.497687)
     (xy 3.995384 1.347156) (xy 3.994696 1.179402) (xy 3.993968 0.993417) (xy 3.993185 0.788195) (xy 3.993124 0.772160) (xy 3.992250 0.552313) (xy 3.991369 0.352056) (xy 3.990471 0.170655)
     (xy 3.989549 0.007379) (xy 3.988594 -0.138503) (xy 3.987597 -0.267722) (xy 3.986550 -0.381011) (xy 3.985445 -0.479100) (xy 3.984273 -0.562722) (xy 3.983026 -0.632608) (xy 3.981695 -0.689490)
     (xy 3.980272 -0.734099) (xy 3.978748 -0.767166) (xy 3.977116 -0.789423) (xy 3.975366 -0.801602) (xy 3.974968 -0.802991) (xy 3.942761 -0.871752) (xy 3.899626 -0.923538) (xy 3.846480 -0.957882)
     (xy 3.784239 -0.974320) (xy 3.713821 -0.972386) (xy 3.663755 -0.960953) (xy 3.615881 -0.946545) (xy 3.585089 -0.988893) (xy 3.537741 -1.058533) (xy 3.486776 -1.141428) (xy 3.435595 -1.231763)
     (xy 3.387594 -1.323720) (xy 3.377578 -1.344043) (xy 3.349444 -1.405232) (xy 3.320519 -1.474141) (xy 3.292512 -1.546106) (xy 3.267132 -1.616466) (xy 3.246089 -1.680558) (xy 3.231092 -1.733719)
     (xy 3.225786 -1.758000) (xy 3.223242 -1.775783) (xy 3.225500 -1.788779) (xy 3.235762 -1.800686) (xy 3.257235 -1.815203) (xy 3.293124 -1.836028) (xy 3.293665 -1.836337) (xy 3.438749 -1.912443)
     (xy 3.589340 -1.978843) (xy 3.742536 -2.034760) (xy 3.895436 -2.079419) (xy 4.045139 -2.112042) (xy 4.188743 -2.131852) (xy 4.323349 -2.138073) (xy 4.406634 -2.134289) )(layer F.SilkS) (width  0.010000)
  )
  (fp_poly (pts (xy 14.018655 -3.846238) (xy 14.063612 -3.838029) (xy 14.119029 -3.824940) (xy 14.182060 -3.807746) (xy 14.249858 -3.787225) (xy 14.319578 -3.764150) (xy 14.388371 -3.739300) (xy 14.452600 -3.713780)
     (xy 14.577931 -3.655559) (xy 14.700775 -3.587628) (xy 14.816805 -3.512799) (xy 14.921693 -3.433884) (xy 15.011113 -3.353695) (xy 15.019231 -3.345517) (xy 15.077862 -3.285744) (xy 14.962088 -3.047492)
     (xy 14.928182 -2.977535) (xy 14.887750 -2.893809) (xy 14.842994 -2.800897) (xy 14.796118 -2.703379) (xy 14.749325 -2.605836) (xy 14.704819 -2.512850) (xy 14.688668 -2.479040) (xy 14.551796 -2.192857)
     (xy 14.422840 -1.924295) (xy 14.301354 -1.672458) (xy 14.186891 -1.436449) (xy 14.079004 -1.215371) (xy 13.977247 -1.008327) (xy 13.881172 -0.814419) (xy 13.790333 -0.632751) (xy 13.704283 -0.462426)
     (xy 13.622575 -0.302546) (xy 13.544762 -0.152214) (xy 13.470397 -0.010534) (xy 13.399035 0.123392) (xy 13.330227 0.250461) (xy 13.318002 0.272814) (xy 13.289565 0.325145) (xy 13.265103 0.370960)
     (xy 13.246078 0.407454) (xy 13.233952 0.431824) (xy 13.230185 0.441264) (xy 13.230200 0.441278) (xy 13.240647 0.441616) (xy 13.269677 0.441796) (xy 13.315556 0.441823) (xy 13.376547 0.441704)
     (xy 13.450915 0.441445) (xy 13.536924 0.441053) (xy 13.632839 0.440533) (xy 13.736925 0.439891) (xy 13.847445 0.439135) (xy 13.865860 0.439002) (xy 14.498320 0.434395) (xy 14.498320 -1.125649)
     (xy 14.587220 -1.141588) (xy 14.740817 -1.165682) (xy 14.901863 -1.184643) (xy 15.064373 -1.198021) (xy 15.222365 -1.205368) (xy 15.369853 -1.206238) (xy 15.427960 -1.204533) (xy 15.497327 -1.201233)
     (xy 15.569147 -1.197076) (xy 15.639699 -1.192349) (xy 15.705264 -1.187338) (xy 15.762121 -1.182330) (xy 15.806549 -1.177612) (xy 15.834831 -1.173470) (xy 15.836900 -1.173039) (xy 15.859760 -1.168013)
     (xy 15.859760 0.436880) (xy 16.702652 0.436880) (xy 16.708725 0.461076) (xy 16.710911 0.484325) (xy 16.710748 0.524158) (xy 16.708523 0.577010) (xy 16.704523 0.639315) (xy 16.699034 0.707509)
     (xy 16.692344 0.778026) (xy 16.684738 0.847302) (xy 16.676505 0.911773) (xy 16.667982 0.967567) (xy 16.639452 1.114481) (xy 16.604454 1.260649) (xy 16.565093 1.397503) (xy 16.553719 1.432560)
     (xy 16.524913 1.518920) (xy 16.192336 1.521598) (xy 15.859760 1.524277) (xy 15.859760 3.207354) (xy 15.770860 3.228618) (xy 15.657446 3.254241) (xy 15.551629 3.274637) (xy 15.448626 3.290352)
     (xy 15.343657 3.301933) (xy 15.231939 3.309924) (xy 15.108692 3.314872) (xy 14.996160 3.317035) (xy 14.921895 3.317761) (xy 14.852330 3.318130) (xy 14.790664 3.318148) (xy 14.740097 3.317823)
     (xy 14.703830 3.317163) (xy 14.686280 3.316309) (xy 14.654888 3.313411) (xy 14.612733 3.309727) (xy 14.571980 3.306306) (xy 14.498320 3.300266) (xy 14.498320 1.516786) (xy 14.018260 1.510259)
     (xy 13.929948 1.509126) (xy 13.824090 1.507883) (xy 13.703458 1.506557) (xy 13.570827 1.505175) (xy 13.428968 1.503764) (xy 13.280654 1.502350) (xy 13.128660 1.500961) (xy 12.975758 1.499623)
     (xy 12.824721 1.498364) (xy 12.678321 1.497211) (xy 12.667492 1.497128) (xy 12.513124 1.495927) (xy 12.377836 1.494795) (xy 12.260386 1.493701) (xy 12.159533 1.492612) (xy 12.074036 1.491498)
     (xy 12.002656 1.490327) (xy 11.944150 1.489067) (xy 11.897279 1.487687) (xy 11.860801 1.486155) (xy 11.833476 1.484439) (xy 11.814062 1.482508) (xy 11.801320 1.480330) (xy 11.794007 1.477874)
     (xy 11.790885 1.475108) (xy 11.790749 1.474798) (xy 11.788327 1.459650) (xy 11.785559 1.428033) (xy 11.782706 1.383790) (xy 11.780028 1.330764) (xy 11.778600 1.295955) (xy 11.777443 1.150125)
     (xy 11.784705 1.008780) (xy 11.799951 0.875032) (xy 11.822746 0.751992) (xy 11.852656 0.642772) (xy 11.879981 0.570686) (xy 11.888422 0.552147) (xy 11.904898 0.516684) (xy 11.928950 0.465267)
     (xy 11.960117 0.398867) (xy 11.997940 0.318456) (xy 12.041958 0.225004) (xy 12.091713 0.119481) (xy 12.146743 0.002860) (xy 12.206590 -0.123890) (xy 12.270793 -0.259798) (xy 12.338893 -0.403893)
     (xy 12.410429 -0.555203) (xy 12.484943 -0.712759) (xy 12.561973 -0.875589) (xy 12.641060 -1.042722) (xy 12.721745 -1.213188) (xy 12.803567 -1.386015) (xy 12.886066 -1.560234) (xy 12.968784 -1.734873)
     (xy 13.051259 -1.908961) (xy 13.133032 -2.081527) (xy 13.213643 -2.251601) (xy 13.292633 -2.418212) (xy 13.369541 -2.580388) (xy 13.443907 -2.737160) (xy 13.515273 -2.887556) (xy 13.583177 -3.030605)
     (xy 13.647160 -3.165337) (xy 13.706762 -3.290780) (xy 13.761524 -3.405965) (xy 13.810985 -3.509919) (xy 13.854686 -3.601673) (xy 13.892166 -3.680255) (xy 13.922967 -3.744695) (xy 13.946627 -3.794021)
     (xy 13.962688 -3.827263) (xy 13.970689 -3.843450) (xy 13.971505 -3.844912) (xy 13.987003 -3.848791) (xy 14.018655 -3.846238) )(layer F.SilkS) (width  0.010000)
  )
  (fp_poly (pts (xy 4.555893 -3.855939) (xy 4.626907 -3.846769) (xy 4.685778 -3.831915) (xy 4.686557 -3.831641) (xy 4.794762 -3.784002) (xy 4.888029 -3.722629) (xy 4.966733 -3.647150) (xy 5.031247 -3.557191)
     (xy 5.081942 -3.452378) (xy 5.091480 -3.426718) (xy 5.106420 -3.368093) (xy 5.115681 -3.297211) (xy 5.118949 -3.221413) (xy 5.115914 -3.148040) (xy 5.106263 -3.084432) (xy 5.106059 -3.083560)
     (xy 5.071152 -2.977912) (xy 5.019224 -2.881934) (xy 4.951940 -2.797345) (xy 4.870960 -2.725864) (xy 4.777948 -2.669208) (xy 4.674566 -2.629098) (xy 4.663440 -2.625987) (xy 4.611769 -2.615813)
     (xy 4.548667 -2.608935) (xy 4.481971 -2.605734) (xy 4.419521 -2.606592) (xy 4.370108 -2.611716) (xy 4.297964 -2.630629) (xy 4.219820 -2.661530) (xy 4.143334 -2.701363) (xy 4.138852 -2.704038)
     (xy 4.068307 -2.757135) (xy 4.003818 -2.826446) (xy 3.948180 -2.908125) (xy 3.904186 -2.998330) (xy 3.885095 -3.053080) (xy 3.874860 -3.102810) (xy 3.868630 -3.165432) (xy 3.866517 -3.233893)
     (xy 3.868637 -3.301143) (xy 3.875104 -3.360129) (xy 3.879747 -3.383280) (xy 3.915567 -3.489295) (xy 3.968129 -3.585463) (xy 4.035746 -3.670102) (xy 4.116732 -3.741526) (xy 4.209398 -3.798052)
     (xy 4.312059 -3.837993) (xy 4.343400 -3.846220) (xy 4.406798 -3.855976) (xy 4.480076 -3.859112) (xy 4.555893 -3.855939) )(layer F.SilkS) (width  0.010000)
  )
)
