(footprint "IC18_ESP32-C3-WROOM-02-N4_EXP" (version 20211014) (generator pcbnew)
  (layer "F.Cu")
  (tedit 6482F8D7)
  (tags "ESP32-C3-WROOM-02-N4 ")
  (attr smd)
  (fp_text reference "REF**" (at 0 3.094914 unlocked) (layer "F.SilkS")
    (effects (font (size 1 1) (thickness 0.15)))
    (tstamp a9690b8a-291c-4e4b-9507-2678d734eb14)
  )
  (fp_text value "IC18_ESP32-C3-WROOM-02-N4_EXP" (at 0 3.094914 unlocked) (layer "F.Fab")
    (effects (font (size 1 1) (thickness 0.15)))
    (tstamp 068e0483-275b-46cc-982a-0ff1786c3d41)
  )
  (fp_text user "${REFERENCE}" (at 0 3.094914 unlocked) (layer "F.Fab")
    (effects (font (size 1 1) (thickness 0.15)))
    (tstamp 919e5111-ffb0-46f0-a366-92294657ae48)
  )
  (fp_line (start 9.1313 -10.1219) (end -9.1313 -10.1219) (layer "F.SilkS") (width 0.1524) (tstamp 6d06ac8a-1eaa-4729-8e1b-f5f986af5b4a))
  (fp_line (start 9.1313 -3.682327) (end 9.1313 -10.1219) (layer "F.SilkS") (width 0.1524) (tstamp 9ecd62a1-028b-4302-8a84-a4e34c950174))
  (fp_line (start -9.1313 10.1219) (end 9.1313 10.1219) (layer "F.SilkS") (width 0.1524) (tstamp a9461d93-f1d1-4497-961f-3d8b4917a96e))
  (fp_line (start -9.1313 -10.1219) (end -9.1313 -3.682327) (layer "F.SilkS") (width 0.1524) (tstamp d70a7364-0a41-4e7a-865e-7e54e5588b3d))
  (fp_circle (center -10.675 -2.9) (end -10.294 -2.9) (layer "F.SilkS") (width 0.508) (fill none) (tstamp ffcdfa39-bc4e-49d0-acb0-8b5d14b3a0df))
  (fp_line (start 9.7533 -10.2489) (end -9.7533 -10.2489) (layer "F.CrtYd") (width 0.1524) (tstamp 1503e9e5-3d34-42eb-8dd9-49004567dd85))
  (fp_line (start -9.7533 10.2489) (end 9.7533 10.2489) (layer "F.CrtYd") (width 0.1524) (tstamp 7aa2d8b6-a41e-484e-8fae-6eaf3c9b50e2))
  (fp_line (start 9.7533 10.2489) (end 9.7533 -10.2489) (layer "F.CrtYd") (width 0.1524) (tstamp 9189e55c-3f50-4101-8ec0-b008b5a37edd))
  (fp_line (start -9.7533 -10.2489) (end -9.7533 10.2489) (layer "F.CrtYd") (width 0.1524) (tstamp 9dd515c6-dfd3-4fc5-abe2-a9b8d2b98a2f))
  (fp_line (start 9.0043 9.9949) (end 9.0043 -9.9949) (layer "F.Fab") (width 0.0254) (tstamp 263e5696-7107-45aa-997c-51b0e27b067d))
  (fp_line (start 9.0043 -9.9949) (end -9.0043 -9.9949) (layer "F.Fab") (width 0.0254) (tstamp 79ea7022-1199-4a13-9852-38fce6a2edac))
  (fp_line (start -9.0043 -9.9949) (end -9.0043 9.9949) (layer "F.Fab") (width 0.0254) (tstamp 9b85ccd6-b92f-447e-bba7-d9080e360992))
  (fp_line (start -9.0043 9.9949) (end 9.0043 9.9949) (layer "F.Fab") (width 0.0254) (tstamp c7adb180-cac4-4e08-bba9-6fc53c45552e))
  (pad "1" smd rect (at -8.75 -2.905087) (size 1.4986 0.889) (layers "F.Cu" "F.Paste" "F.Mask") (tstamp 98a06312-78d5-435e-b18e-8e15658e8cd7))
  (pad "2" smd rect (at -8.75 -1.405087) (size 1.4986 0.889) (layers "F.Cu" "F.Paste" "F.Mask") (tstamp aa278a0d-9aaa-400e-a711-4ffb24eae2b6))
  (pad "3" smd rect (at -8.75 0.094915) (size 1.4986 0.889) (layers "F.Cu" "F.Paste" "F.Mask") (tstamp ef8d123c-12c5-4871-9738-12c9efc3137a))
  (pad "4" smd rect (at -8.75 1.594914) (size 1.4986 0.889) (layers "F.Cu" "F.Paste" "F.Mask") (tstamp 2ba4b661-1124-4eaf-bee4-8a5fb57301ac))
  (pad "5" smd rect (at -8.75 3.094914) (size 1.4986 0.889) (layers "F.Cu" "F.Paste" "F.Mask") (tstamp defd568e-8531-458a-92a1-746818cd1260))
  (pad "6" smd rect (at -8.75 4.594913) (size 1.4986 0.889) (layers "F.Cu" "F.Paste" "F.Mask") (tstamp 16853fc1-2802-404c-863d-af24686a53ab))
  (pad "7" smd rect (at -8.75 6.094913) (size 1.4986 0.889) (layers "F.Cu" "F.Paste" "F.Mask") (tstamp 67c46f8a-8ebb-479c-86bc-a810cd66bb92))
  (pad "8" smd rect (at -8.75 7.594915) (size 1.4986 0.889) (layers "F.Cu" "F.Paste" "F.Mask") (tstamp cec2c00d-b786-4841-9416-8e713ad0e1ca))
  (pad "9" smd rect (at -8.75 9.094915) (size 1.4986 0.889) (layers "F.Cu" "F.Paste" "F.Mask") (tstamp b0fa1b17-40d6-4888-9106-6a049f5a2ba7))
  (pad "10" smd rect (at 8.75 9.094915) (size 1.4986 0.889) (layers "F.Cu" "F.Paste" "F.Mask") (tstamp 2a722e3b-fca7-48c9-bcd2-6b10073f1f23))
  (pad "11" smd rect (at 8.75 7.594915) (size 1.4986 0.889) (layers "F.Cu" "F.Paste" "F.Mask") (tstamp d11bdf8f-bc1a-4e02-852a-5ff8ca074f8b))
  (pad "12" smd rect (at 8.75 6.094913) (size 1.4986 0.889) (layers "F.Cu" "F.Paste" "F.Mask") (tstamp d9578c44-559c-4121-9098-135bc34b67fb))
  (pad "13" smd rect (at 8.75 4.594913) (size 1.4986 0.889) (layers "F.Cu" "F.Paste" "F.Mask") (tstamp fbb06cd4-8ec4-438e-b8bd-7d506540f9c8))
  (pad "14" smd rect (at 8.75 3.094914) (size 1.4986 0.889) (layers "F.Cu" "F.Paste" "F.Mask") (tstamp f264d4f7-ad5e-4dcb-b3a8-a3b229b3d707))
  (pad "15" smd rect (at 8.75 1.594914) (size 1.4986 0.889) (layers "F.Cu" "F.Paste" "F.Mask") (tstamp cbba37cc-9c26-4477-8cf2-405ca617e1f9))
  (pad "16" smd rect (at 8.75 0.094915) (size 1.4986 0.889) (layers "F.Cu" "F.Paste" "F.Mask") (tstamp d2f769cc-f8fc-42b6-9c6b-442b4bfd3b35))
  (pad "17" smd rect (at 8.75 -1.405087) (size 1.4986 0.889) (layers "F.Cu" "F.Paste" "F.Mask") (tstamp 844915b2-b6e7-4758-945e-f5b5342afdba))
  (pad "18" smd rect (at 8.75 -2.905087) (size 1.4986 0.889) (layers "F.Cu" "F.Paste" "F.Mask") (tstamp 2a0f1452-d65a-414e-b9de-6629cceb2995))
  (pad "19" smd rect (at -0.144198 2.19489) (size 0.7112 0.7112) (layers "F.Cu" "F.Paste" "F.Mask") (tstamp 778f725e-f4ed-46cf-bf2f-d1a6c4ee0d7b))
  (pad "20" smd rect (at 0.955802 2.19489) (size 0.7112 0.7112) (layers "F.Cu" "F.Paste" "F.Mask") (tstamp cc9a9312-38fc-4d00-b848-012061dcb89c))
  (pad "21" smd rect (at 2.055802 2.19489) (size 0.7112 0.7112) (layers "F.Cu" "F.Paste" "F.Mask") (tstamp cc2f772d-66f5-4ef2-bf72-bf4cabe8468e))
  (pad "22" smd rect (at -0.1443 3.294888) (size 0.7112 0.7112) (layers "F.Cu" "F.Paste" "F.Mask") (tstamp 070e0d81-a149-4bfe-9739-d93b5c04a929))
  (pad "23" smd rect (at 0.9557 3.294888) (size 0.7112 0.7112) (layers "F.Cu" "F.Paste" "F.Mask") (tstamp 81bc28fc-d79d-45fd-ace2-0a9b01445cbf))
  (pad "24" smd rect (at 2.055701 3.294888) (size 0.7112 0.7112) (layers "F.Cu" "F.Paste" "F.Mask") (tstamp 8118897a-716e-4a85-89b5-b4cc3f6f7315))
  (pad "25" smd rect (at -0.144198 4.394886) (size 0.7112 0.7112) (layers "F.Cu" "F.Paste" "F.Mask") (tstamp dba793d2-6772-45fd-ab4a-10b0299ea321))
  (pad "26" smd rect (at 0.955802 4.394886) (size 0.7112 0.7112) (layers "F.Cu" "F.Paste" "F.Mask") (tstamp 43606ef2-14fd-4069-ae54-3abba668fc58))
  (pad "27" smd rect (at 2.055802 4.394886) (size 0.7112 0.7112) (layers "F.Cu" "F.Paste" "F.Mask") (tstamp e4825e0a-b389-4078-aca2-eef102d72b5a))
)
