(kicad_sch (version 20230121) (generator eeschema)

  (uuid 3c811405-f5e1-448d-b8b8-eef19b0ae5a8)

  (paper "A3")

  (lib_symbols
    (symbol "AP7366-33W5-7:AP7366-33W5-7" (pin_names (offset 0.254)) (in_bom yes) (on_board yes)
      (property "Reference" "U" (at 20.32 10.16 0)
        (effects (font (size 1.524 1.524)))
      )
      (property "Value" "AP7366-33W5-7" (at 20.32 7.62 0)
        (effects (font (size 1.524 1.524)))
      )
      (property "Footprint" "SOT25-YE_DIO" (at 0 0 0)
        (effects (font (size 1.27 1.27) italic) hide)
      )
      (property "Datasheet" "AP7366-33W5-7" (at 0 0 0)
        (effects (font (size 1.27 1.27) italic) hide)
      )
      (property "ki_locked" "" (at 0 0 0)
        (effects (font (size 1.27 1.27)))
      )
      (property "ki_keywords" "AP7366-33W5-7" (at 0 0 0)
        (effects (font (size 1.27 1.27)) hide)
      )
      (property "ki_fp_filters" "SOT25-YE_DIO SOT25-YE_DIO-M SOT25-YE_DIO-L" (at 0 0 0)
        (effects (font (size 1.27 1.27)) hide)
      )
      (symbol "AP7366-33W5-7_0_1"
        (polyline
          (pts
            (xy 7.62 -10.16)
            (xy 33.02 -10.16)
          )
          (stroke (width 0.127) (type default))
          (fill (type none))
        )
        (polyline
          (pts
            (xy 7.62 5.08)
            (xy 7.62 -10.16)
          )
          (stroke (width 0.127) (type default))
          (fill (type none))
        )
        (polyline
          (pts
            (xy 33.02 -10.16)
            (xy 33.02 5.08)
          )
          (stroke (width 0.127) (type default))
          (fill (type none))
        )
        (polyline
          (pts
            (xy 33.02 5.08)
            (xy 7.62 5.08)
          )
          (stroke (width 0.127) (type default))
          (fill (type none))
        )
        (pin input line (at 0 0 0) (length 7.62)
          (name "IN" (effects (font (size 1.27 1.27))))
          (number "1" (effects (font (size 1.27 1.27))))
        )
        (pin power_out line (at 0 -2.54 0) (length 7.62)
          (name "GND" (effects (font (size 1.27 1.27))))
          (number "2" (effects (font (size 1.27 1.27))))
        )
        (pin input line (at 0 -5.08 0) (length 7.62)
          (name "EN" (effects (font (size 1.27 1.27))))
          (number "3" (effects (font (size 1.27 1.27))))
        )
        (pin no_connect line (at 40.64 -5.08 180) (length 7.62)
          (name "NC" (effects (font (size 1.27 1.27))))
          (number "4" (effects (font (size 1.27 1.27))))
        )
        (pin output line (at 40.64 -2.54 180) (length 7.62)
          (name "OUT" (effects (font (size 1.27 1.27))))
          (number "5" (effects (font (size 1.27 1.27))))
        )
      )
    )
    (symbol "Connector_Generic:Conn_01x08" (pin_names (offset 1.016) hide) (in_bom yes) (on_board yes)
      (property "Reference" "J" (at 0 10.16 0)
        (effects (font (size 1.27 1.27)))
      )
      (property "Value" "Conn_01x08" (at 0 -12.7 0)
        (effects (font (size 1.27 1.27)))
      )
      (property "Footprint" "" (at 0 0 0)
        (effects (font (size 1.27 1.27)) hide)
      )
      (property "Datasheet" "~" (at 0 0 0)
        (effects (font (size 1.27 1.27)) hide)
      )
      (property "ki_keywords" "connector" (at 0 0 0)
        (effects (font (size 1.27 1.27)) hide)
      )
      (property "ki_description" "Generic connector, single row, 01x08, script generated (kicad-library-utils/schlib/autogen/connector/)" (at 0 0 0)
        (effects (font (size 1.27 1.27)) hide)
      )
      (property "ki_fp_filters" "Connector*:*_1x??_*" (at 0 0 0)
        (effects (font (size 1.27 1.27)) hide)
      )
      (symbol "Conn_01x08_1_1"
        (rectangle (start -1.27 -10.033) (end 0 -10.287)
          (stroke (width 0.1524) (type default))
          (fill (type none))
        )
        (rectangle (start -1.27 -7.493) (end 0 -7.747)
          (stroke (width 0.1524) (type default))
          (fill (type none))
        )
        (rectangle (start -1.27 -4.953) (end 0 -5.207)
          (stroke (width 0.1524) (type default))
          (fill (type none))
        )
        (rectangle (start -1.27 -2.413) (end 0 -2.667)
          (stroke (width 0.1524) (type default))
          (fill (type none))
        )
        (rectangle (start -1.27 0.127) (end 0 -0.127)
          (stroke (width 0.1524) (type default))
          (fill (type none))
        )
        (rectangle (start -1.27 2.667) (end 0 2.413)
          (stroke (width 0.1524) (type default))
          (fill (type none))
        )
        (rectangle (start -1.27 5.207) (end 0 4.953)
          (stroke (width 0.1524) (type default))
          (fill (type none))
        )
        (rectangle (start -1.27 7.747) (end 0 7.493)
          (stroke (width 0.1524) (type default))
          (fill (type none))
        )
        (rectangle (start -1.27 8.89) (end 1.27 -11.43)
          (stroke (width 0.254) (type default))
          (fill (type background))
        )
        (pin passive line (at -5.08 7.62 0) (length 3.81)
          (name "Pin_1" (effects (font (size 1.27 1.27))))
          (number "1" (effects (font (size 1.27 1.27))))
        )
        (pin passive line (at -5.08 5.08 0) (length 3.81)
          (name "Pin_2" (effects (font (size 1.27 1.27))))
          (number "2" (effects (font (size 1.27 1.27))))
        )
        (pin passive line (at -5.08 2.54 0) (length 3.81)
          (name "Pin_3" (effects (font (size 1.27 1.27))))
          (number "3" (effects (font (size 1.27 1.27))))
        )
        (pin passive line (at -5.08 0 0) (length 3.81)
          (name "Pin_4" (effects (font (size 1.27 1.27))))
          (number "4" (effects (font (size 1.27 1.27))))
        )
        (pin passive line (at -5.08 -2.54 0) (length 3.81)
          (name "Pin_5" (effects (font (size 1.27 1.27))))
          (number "5" (effects (font (size 1.27 1.27))))
        )
        (pin passive line (at -5.08 -5.08 0) (length 3.81)
          (name "Pin_6" (effects (font (size 1.27 1.27))))
          (number "6" (effects (font (size 1.27 1.27))))
        )
        (pin passive line (at -5.08 -7.62 0) (length 3.81)
          (name "Pin_7" (effects (font (size 1.27 1.27))))
          (number "7" (effects (font (size 1.27 1.27))))
        )
        (pin passive line (at -5.08 -10.16 0) (length 3.81)
          (name "Pin_8" (effects (font (size 1.27 1.27))))
          (number "8" (effects (font (size 1.27 1.27))))
        )
      )
    )
    (symbol "Connector_Generic:Conn_01x10" (pin_names (offset 1.016) hide) (in_bom yes) (on_board yes)
      (property "Reference" "J" (at 0 12.7 0)
        (effects (font (size 1.27 1.27)))
      )
      (property "Value" "Conn_01x10" (at 0 -15.24 0)
        (effects (font (size 1.27 1.27)))
      )
      (property "Footprint" "" (at 0 0 0)
        (effects (font (size 1.27 1.27)) hide)
      )
      (property "Datasheet" "~" (at 0 0 0)
        (effects (font (size 1.27 1.27)) hide)
      )
      (property "ki_keywords" "connector" (at 0 0 0)
        (effects (font (size 1.27 1.27)) hide)
      )
      (property "ki_description" "Generic connector, single row, 01x10, script generated (kicad-library-utils/schlib/autogen/connector/)" (at 0 0 0)
        (effects (font (size 1.27 1.27)) hide)
      )
      (property "ki_fp_filters" "Connector*:*_1x??_*" (at 0 0 0)
        (effects (font (size 1.27 1.27)) hide)
      )
      (symbol "Conn_01x10_1_1"
        (rectangle (start -1.27 -12.573) (end 0 -12.827)
          (stroke (width 0.1524) (type default))
          (fill (type none))
        )
        (rectangle (start -1.27 -10.033) (end 0 -10.287)
          (stroke (width 0.1524) (type default))
          (fill (type none))
        )
        (rectangle (start -1.27 -7.493) (end 0 -7.747)
          (stroke (width 0.1524) (type default))
          (fill (type none))
        )
        (rectangle (start -1.27 -4.953) (end 0 -5.207)
          (stroke (width 0.1524) (type default))
          (fill (type none))
        )
        (rectangle (start -1.27 -2.413) (end 0 -2.667)
          (stroke (width 0.1524) (type default))
          (fill (type none))
        )
        (rectangle (start -1.27 0.127) (end 0 -0.127)
          (stroke (width 0.1524) (type default))
          (fill (type none))
        )
        (rectangle (start -1.27 2.667) (end 0 2.413)
          (stroke (width 0.1524) (type default))
          (fill (type none))
        )
        (rectangle (start -1.27 5.207) (end 0 4.953)
          (stroke (width 0.1524) (type default))
          (fill (type none))
        )
        (rectangle (start -1.27 7.747) (end 0 7.493)
          (stroke (width 0.1524) (type default))
          (fill (type none))
        )
        (rectangle (start -1.27 10.287) (end 0 10.033)
          (stroke (width 0.1524) (type default))
          (fill (type none))
        )
        (rectangle (start -1.27 11.43) (end 1.27 -13.97)
          (stroke (width 0.254) (type default))
          (fill (type background))
        )
        (pin passive line (at -5.08 10.16 0) (length 3.81)
          (name "Pin_1" (effects (font (size 1.27 1.27))))
          (number "1" (effects (font (size 1.27 1.27))))
        )
        (pin passive line (at -5.08 -12.7 0) (length 3.81)
          (name "Pin_10" (effects (font (size 1.27 1.27))))
          (number "10" (effects (font (size 1.27 1.27))))
        )
        (pin passive line (at -5.08 7.62 0) (length 3.81)
          (name "Pin_2" (effects (font (size 1.27 1.27))))
          (number "2" (effects (font (size 1.27 1.27))))
        )
        (pin passive line (at -5.08 5.08 0) (length 3.81)
          (name "Pin_3" (effects (font (size 1.27 1.27))))
          (number "3" (effects (font (size 1.27 1.27))))
        )
        (pin passive line (at -5.08 2.54 0) (length 3.81)
          (name "Pin_4" (effects (font (size 1.27 1.27))))
          (number "4" (effects (font (size 1.27 1.27))))
        )
        (pin passive line (at -5.08 0 0) (length 3.81)
          (name "Pin_5" (effects (font (size 1.27 1.27))))
          (number "5" (effects (font (size 1.27 1.27))))
        )
        (pin passive line (at -5.08 -2.54 0) (length 3.81)
          (name "Pin_6" (effects (font (size 1.27 1.27))))
          (number "6" (effects (font (size 1.27 1.27))))
        )
        (pin passive line (at -5.08 -5.08 0) (length 3.81)
          (name "Pin_7" (effects (font (size 1.27 1.27))))
          (number "7" (effects (font (size 1.27 1.27))))
        )
        (pin passive line (at -5.08 -7.62 0) (length 3.81)
          (name "Pin_8" (effects (font (size 1.27 1.27))))
          (number "8" (effects (font (size 1.27 1.27))))
        )
        (pin passive line (at -5.08 -10.16 0) (length 3.81)
          (name "Pin_9" (effects (font (size 1.27 1.27))))
          (number "9" (effects (font (size 1.27 1.27))))
        )
      )
    )
    (symbol "Device:CP" (pin_numbers hide) (pin_names (offset 0.254)) (in_bom yes) (on_board yes)
      (property "Reference" "C" (at 0.635 2.54 0)
        (effects (font (size 1.27 1.27)) (justify left))
      )
      (property "Value" "Device_CP" (at 0.635 -2.54 0)
        (effects (font (size 1.27 1.27)) (justify left))
      )
      (property "Footprint" "" (at 0.9652 -3.81 0)
        (effects (font (size 1.27 1.27)) hide)
      )
      (property "Datasheet" "" (at 0 0 0)
        (effects (font (size 1.27 1.27)) hide)
      )
      (property "ki_fp_filters" "CP_*" (at 0 0 0)
        (effects (font (size 1.27 1.27)) hide)
      )
      (symbol "CP_0_1"
        (rectangle (start -2.286 0.508) (end 2.286 1.016)
          (stroke (width 0) (type default))
          (fill (type none))
        )
        (polyline
          (pts
            (xy -1.778 2.286)
            (xy -0.762 2.286)
          )
          (stroke (width 0) (type default))
          (fill (type none))
        )
        (polyline
          (pts
            (xy -1.27 2.794)
            (xy -1.27 1.778)
          )
          (stroke (width 0) (type default))
          (fill (type none))
        )
        (rectangle (start 2.286 -0.508) (end -2.286 -1.016)
          (stroke (width 0) (type default))
          (fill (type outline))
        )
      )
      (symbol "CP_1_1"
        (pin passive line (at 0 3.81 270) (length 2.794)
          (name "~" (effects (font (size 1.27 1.27))))
          (number "1" (effects (font (size 1.27 1.27))))
        )
        (pin passive line (at 0 -3.81 90) (length 2.794)
          (name "~" (effects (font (size 1.27 1.27))))
          (number "2" (effects (font (size 1.27 1.27))))
        )
      )
    )
    (symbol "Device:C_Small" (pin_numbers hide) (pin_names (offset 0.254) hide) (in_bom yes) (on_board yes)
      (property "Reference" "C" (at 0.254 1.778 0)
        (effects (font (size 1.27 1.27)) (justify left))
      )
      (property "Value" "C_Small" (at 0.254 -2.032 0)
        (effects (font (size 1.27 1.27)) (justify left))
      )
      (property "Footprint" "" (at 0 0 0)
        (effects (font (size 1.27 1.27)) hide)
      )
      (property "Datasheet" "~" (at 0 0 0)
        (effects (font (size 1.27 1.27)) hide)
      )
      (property "ki_keywords" "capacitor cap" (at 0 0 0)
        (effects (font (size 1.27 1.27)) hide)
      )
      (property "ki_description" "Unpolarized capacitor, small symbol" (at 0 0 0)
        (effects (font (size 1.27 1.27)) hide)
      )
      (property "ki_fp_filters" "C_*" (at 0 0 0)
        (effects (font (size 1.27 1.27)) hide)
      )
      (symbol "C_Small_0_1"
        (polyline
          (pts
            (xy -1.524 -0.508)
            (xy 1.524 -0.508)
          )
          (stroke (width 0.3302) (type default))
          (fill (type none))
        )
        (polyline
          (pts
            (xy -1.524 0.508)
            (xy 1.524 0.508)
          )
          (stroke (width 0.3048) (type default))
          (fill (type none))
        )
      )
      (symbol "C_Small_1_1"
        (pin passive line (at 0 2.54 270) (length 2.032)
          (name "~" (effects (font (size 1.27 1.27))))
          (number "1" (effects (font (size 1.27 1.27))))
        )
        (pin passive line (at 0 -2.54 90) (length 2.032)
          (name "~" (effects (font (size 1.27 1.27))))
          (number "2" (effects (font (size 1.27 1.27))))
        )
      )
    )
    (symbol "Device:R_Small" (pin_numbers hide) (pin_names (offset 0.254) hide) (in_bom yes) (on_board yes)
      (property "Reference" "R" (at 0.762 0.508 0)
        (effects (font (size 1.27 1.27)) (justify left))
      )
      (property "Value" "R_Small" (at 0.762 -1.016 0)
        (effects (font (size 1.27 1.27)) (justify left))
      )
      (property "Footprint" "" (at 0 0 0)
        (effects (font (size 1.27 1.27)) hide)
      )
      (property "Datasheet" "~" (at 0 0 0)
        (effects (font (size 1.27 1.27)) hide)
      )
      (property "ki_keywords" "R resistor" (at 0 0 0)
        (effects (font (size 1.27 1.27)) hide)
      )
      (property "ki_description" "Resistor, small symbol" (at 0 0 0)
        (effects (font (size 1.27 1.27)) hide)
      )
      (property "ki_fp_filters" "R_*" (at 0 0 0)
        (effects (font (size 1.27 1.27)) hide)
      )
      (symbol "R_Small_0_1"
        (rectangle (start -0.762 1.778) (end 0.762 -1.778)
          (stroke (width 0.2032) (type default))
          (fill (type none))
        )
      )
      (symbol "R_Small_1_1"
        (pin passive line (at 0 2.54 270) (length 0.762)
          (name "~" (effects (font (size 1.27 1.27))))
          (number "1" (effects (font (size 1.27 1.27))))
        )
        (pin passive line (at 0 -2.54 90) (length 0.762)
          (name "~" (effects (font (size 1.27 1.27))))
          (number "2" (effects (font (size 1.27 1.27))))
        )
      )
    )
    (symbol "Mechanical:MountingHole_Pad" (pin_numbers hide) (pin_names (offset 1.016) hide) (in_bom yes) (on_board yes)
      (property "Reference" "H" (at 0 6.35 0)
        (effects (font (size 1.27 1.27)))
      )
      (property "Value" "MountingHole_Pad" (at 0 4.445 0)
        (effects (font (size 1.27 1.27)))
      )
      (property "Footprint" "" (at 0 0 0)
        (effects (font (size 1.27 1.27)) hide)
      )
      (property "Datasheet" "~" (at 0 0 0)
        (effects (font (size 1.27 1.27)) hide)
      )
      (property "ki_keywords" "mounting hole" (at 0 0 0)
        (effects (font (size 1.27 1.27)) hide)
      )
      (property "ki_description" "Mounting Hole with connection" (at 0 0 0)
        (effects (font (size 1.27 1.27)) hide)
      )
      (property "ki_fp_filters" "MountingHole*Pad*" (at 0 0 0)
        (effects (font (size 1.27 1.27)) hide)
      )
      (symbol "MountingHole_Pad_0_1"
        (circle (center 0 1.27) (radius 1.27)
          (stroke (width 1.27) (type default))
          (fill (type none))
        )
      )
      (symbol "MountingHole_Pad_1_1"
        (pin input line (at 0 -2.54 90) (length 2.54)
          (name "1" (effects (font (size 1.27 1.27))))
          (number "1" (effects (font (size 1.27 1.27))))
        )
      )
    )
    (symbol "RAK3172:RAK3172" (pin_names (offset 0.254)) (in_bom yes) (on_board yes)
      (property "Reference" "U" (at 35.56 10.16 0)
        (effects (font (size 1.524 1.524)))
      )
      (property "Value" "RAK3172" (at 35.56 7.62 0)
        (effects (font (size 1.524 1.524)))
      )
      (property "Footprint" "RAK3172_RAK" (at 0 0 0)
        (effects (font (size 1.27 1.27) italic) hide)
      )
      (property "Datasheet" "RAK3172" (at 0 0 0)
        (effects (font (size 1.27 1.27) italic) hide)
      )
      (property "ki_locked" "" (at 0 0 0)
        (effects (font (size 1.27 1.27)))
      )
      (property "ki_keywords" "RAK3172" (at 0 0 0)
        (effects (font (size 1.27 1.27)) hide)
      )
      (property "ki_fp_filters" "RAK3172_RAK" (at 0 0 0)
        (effects (font (size 1.27 1.27)) hide)
      )
      (symbol "RAK3172_0_1"
        (polyline
          (pts
            (xy 7.62 -43.18)
            (xy 63.5 -43.18)
          )
          (stroke (width 0.127) (type default))
          (fill (type none))
        )
        (polyline
          (pts
            (xy 7.62 5.08)
            (xy 7.62 -43.18)
          )
          (stroke (width 0.127) (type default))
          (fill (type none))
        )
        (polyline
          (pts
            (xy 63.5 -43.18)
            (xy 63.5 5.08)
          )
          (stroke (width 0.127) (type default))
          (fill (type none))
        )
        (polyline
          (pts
            (xy 63.5 5.08)
            (xy 7.62 5.08)
          )
          (stroke (width 0.127) (type default))
          (fill (type none))
        )
        (pin bidirectional line (at 0 0 0) (length 7.62)
          (name "PA3/UART2_RX" (effects (font (size 1.27 1.27))))
          (number "1" (effects (font (size 1.27 1.27))))
        )
        (pin bidirectional line (at 0 -22.86 0) (length 7.62)
          (name "PA11/I2C_SDA" (effects (font (size 1.27 1.27))))
          (number "10" (effects (font (size 1.27 1.27))))
        )
        (pin power_out line (at 0 -25.4 0) (length 7.62)
          (name "GND" (effects (font (size 1.27 1.27))))
          (number "11" (effects (font (size 1.27 1.27))))
        )
        (pin unspecified line (at 0 -27.94 0) (length 7.62)
          (name "RF" (effects (font (size 1.27 1.27))))
          (number "12" (effects (font (size 1.27 1.27))))
        )
        (pin bidirectional line (at 0 -30.48 0) (length 7.62)
          (name "PA7/SPI1_MOSI" (effects (font (size 1.27 1.27))))
          (number "13" (effects (font (size 1.27 1.27))))
        )
        (pin bidirectional line (at 0 -33.02 0) (length 7.62)
          (name "PA6/SPI1_MISO" (effects (font (size 1.27 1.27))))
          (number "14" (effects (font (size 1.27 1.27))))
        )
        (pin bidirectional line (at 0 -35.56 0) (length 7.62)
          (name "PA5/SPI1_CLK" (effects (font (size 1.27 1.27))))
          (number "15" (effects (font (size 1.27 1.27))))
        )
        (pin bidirectional line (at 0 -38.1 0) (length 7.62)
          (name "PA4/SPI1_NSS" (effects (font (size 1.27 1.27))))
          (number "16" (effects (font (size 1.27 1.27))))
        )
        (pin power_out line (at 71.12 -38.1 180) (length 7.62)
          (name "GND" (effects (font (size 1.27 1.27))))
          (number "17" (effects (font (size 1.27 1.27))))
        )
        (pin power_out line (at 71.12 -35.56 180) (length 7.62)
          (name "GND" (effects (font (size 1.27 1.27))))
          (number "18" (effects (font (size 1.27 1.27))))
        )
        (pin bidirectional line (at 71.12 -33.02 180) (length 7.62)
          (name "PA8" (effects (font (size 1.27 1.27))))
          (number "19" (effects (font (size 1.27 1.27))))
        )
        (pin bidirectional line (at 0 -2.54 0) (length 7.62)
          (name "PA2/UART2_TX" (effects (font (size 1.27 1.27))))
          (number "2" (effects (font (size 1.27 1.27))))
        )
        (pin bidirectional line (at 71.12 -30.48 180) (length 7.62)
          (name "PA9" (effects (font (size 1.27 1.27))))
          (number "20" (effects (font (size 1.27 1.27))))
        )
        (pin unspecified line (at 71.12 -27.94 180) (length 7.62)
          (name "BOOT0" (effects (font (size 1.27 1.27))))
          (number "21" (effects (font (size 1.27 1.27))))
        )
        (pin unspecified line (at 71.12 -25.4 180) (length 7.62)
          (name "RST" (effects (font (size 1.27 1.27))))
          (number "22" (effects (font (size 1.27 1.27))))
        )
        (pin power_out line (at 71.12 -22.86 180) (length 7.62)
          (name "GND" (effects (font (size 1.27 1.27))))
          (number "23" (effects (font (size 1.27 1.27))))
        )
        (pin power_in line (at 71.12 -20.32 180) (length 7.62)
          (name "VDD" (effects (font (size 1.27 1.27))))
          (number "24" (effects (font (size 1.27 1.27))))
        )
        (pin bidirectional line (at 71.12 -17.78 180) (length 7.62)
          (name "PA10/ADC4" (effects (font (size 1.27 1.27))))
          (number "25" (effects (font (size 1.27 1.27))))
        )
        (pin bidirectional line (at 71.12 -15.24 180) (length 7.62)
          (name "PB2/AD3" (effects (font (size 1.27 1.27))))
          (number "26" (effects (font (size 1.27 1.27))))
        )
        (pin bidirectional line (at 71.12 -12.7 180) (length 7.62)
          (name "PB12" (effects (font (size 1.27 1.27))))
          (number "27" (effects (font (size 1.27 1.27))))
        )
        (pin power_out line (at 71.12 -10.16 180) (length 7.62)
          (name "GND" (effects (font (size 1.27 1.27))))
          (number "28" (effects (font (size 1.27 1.27))))
        )
        (pin bidirectional line (at 71.12 -7.62 180) (length 7.62)
          (name "PA0" (effects (font (size 1.27 1.27))))
          (number "29" (effects (font (size 1.27 1.27))))
        )
        (pin bidirectional line (at 0 -5.08 0) (length 7.62)
          (name "PA15/ADC5" (effects (font (size 1.27 1.27))))
          (number "3" (effects (font (size 1.27 1.27))))
        )
        (pin bidirectional line (at 71.12 -5.08 180) (length 7.62)
          (name "PB5" (effects (font (size 1.27 1.27))))
          (number "30" (effects (font (size 1.27 1.27))))
        )
        (pin bidirectional line (at 71.12 -2.54 180) (length 7.62)
          (name "PB4/ADC2" (effects (font (size 1.27 1.27))))
          (number "31" (effects (font (size 1.27 1.27))))
        )
        (pin bidirectional line (at 71.12 0 180) (length 7.62)
          (name "PB3/ADC1" (effects (font (size 1.27 1.27))))
          (number "32" (effects (font (size 1.27 1.27))))
        )
        (pin bidirectional line (at 0 -7.62 0) (length 7.62)
          (name "PB6/UART1_TX" (effects (font (size 1.27 1.27))))
          (number "4" (effects (font (size 1.27 1.27))))
        )
        (pin bidirectional line (at 0 -10.16 0) (length 7.62)
          (name "PB7/UART1_RX" (effects (font (size 1.27 1.27))))
          (number "5" (effects (font (size 1.27 1.27))))
        )
        (pin bidirectional line (at 0 -12.7 0) (length 7.62)
          (name "PA1" (effects (font (size 1.27 1.27))))
          (number "6" (effects (font (size 1.27 1.27))))
        )
        (pin bidirectional line (at 0 -15.24 0) (length 7.62)
          (name "PA13/SWDIO" (effects (font (size 1.27 1.27))))
          (number "7" (effects (font (size 1.27 1.27))))
        )
        (pin bidirectional line (at 0 -17.78 0) (length 7.62)
          (name "PA14/SWCLK" (effects (font (size 1.27 1.27))))
          (number "8" (effects (font (size 1.27 1.27))))
        )
        (pin bidirectional line (at 0 -20.32 0) (length 7.62)
          (name "PA12/I2C_SCL" (effects (font (size 1.27 1.27))))
          (number "9" (effects (font (size 1.27 1.27))))
        )
      )
    )
    (symbol "power:+3.3V" (power) (pin_names (offset 0)) (in_bom yes) (on_board yes)
      (property "Reference" "#PWR" (at 0 -3.81 0)
        (effects (font (size 1.27 1.27)) hide)
      )
      (property "Value" "+3.3V" (at 0 3.556 0)
        (effects (font (size 1.27 1.27)))
      )
      (property "Footprint" "" (at 0 0 0)
        (effects (font (size 1.27 1.27)) hide)
      )
      (property "Datasheet" "" (at 0 0 0)
        (effects (font (size 1.27 1.27)) hide)
      )
      (property "ki_keywords" "power-flag" (at 0 0 0)
        (effects (font (size 1.27 1.27)) hide)
      )
      (property "ki_description" "Power symbol creates a global label with name \"+3.3V\"" (at 0 0 0)
        (effects (font (size 1.27 1.27)) hide)
      )
      (symbol "+3.3V_0_1"
        (polyline
          (pts
            (xy -0.762 1.27)
            (xy 0 2.54)
          )
          (stroke (width 0) (type default))
          (fill (type none))
        )
        (polyline
          (pts
            (xy 0 0)
            (xy 0 2.54)
          )
          (stroke (width 0) (type default))
          (fill (type none))
        )
        (polyline
          (pts
            (xy 0 2.54)
            (xy 0.762 1.27)
          )
          (stroke (width 0) (type default))
          (fill (type none))
        )
      )
      (symbol "+3.3V_1_1"
        (pin power_in line (at 0 0 90) (length 0) hide
          (name "+3V3" (effects (font (size 1.27 1.27))))
          (number "1" (effects (font (size 1.27 1.27))))
        )
      )
    )
    (symbol "power:+3V3" (power) (pin_names (offset 0)) (in_bom yes) (on_board yes)
      (property "Reference" "#PWR" (at 0 -3.81 0)
        (effects (font (size 1.27 1.27)) hide)
      )
      (property "Value" "+3V3" (at 0 3.556 0)
        (effects (font (size 1.27 1.27)))
      )
      (property "Footprint" "" (at 0 0 0)
        (effects (font (size 1.27 1.27)) hide)
      )
      (property "Datasheet" "" (at 0 0 0)
        (effects (font (size 1.27 1.27)) hide)
      )
      (property "ki_keywords" "power-flag" (at 0 0 0)
        (effects (font (size 1.27 1.27)) hide)
      )
      (property "ki_description" "Power symbol creates a global label with name \"+3V3\"" (at 0 0 0)
        (effects (font (size 1.27 1.27)) hide)
      )
      (symbol "+3V3_0_1"
        (polyline
          (pts
            (xy -0.762 1.27)
            (xy 0 2.54)
          )
          (stroke (width 0) (type default))
          (fill (type none))
        )
        (polyline
          (pts
            (xy 0 0)
            (xy 0 2.54)
          )
          (stroke (width 0) (type default))
          (fill (type none))
        )
        (polyline
          (pts
            (xy 0 2.54)
            (xy 0.762 1.27)
          )
          (stroke (width 0) (type default))
          (fill (type none))
        )
      )
      (symbol "+3V3_1_1"
        (pin power_in line (at 0 0 90) (length 0) hide
          (name "+3V3" (effects (font (size 1.27 1.27))))
          (number "1" (effects (font (size 1.27 1.27))))
        )
      )
    )
    (symbol "power:GND" (power) (pin_names (offset 0)) (in_bom yes) (on_board yes)
      (property "Reference" "#PWR" (at 0 -6.35 0)
        (effects (font (size 1.27 1.27)) hide)
      )
      (property "Value" "GND" (at 0 -3.81 0)
        (effects (font (size 1.27 1.27)))
      )
      (property "Footprint" "" (at 0 0 0)
        (effects (font (size 1.27 1.27)) hide)
      )
      (property "Datasheet" "" (at 0 0 0)
        (effects (font (size 1.27 1.27)) hide)
      )
      (property "ki_keywords" "power-flag" (at 0 0 0)
        (effects (font (size 1.27 1.27)) hide)
      )
      (property "ki_description" "Power symbol creates a global label with name \"GND\" , ground" (at 0 0 0)
        (effects (font (size 1.27 1.27)) hide)
      )
      (symbol "GND_0_1"
        (polyline
          (pts
            (xy 0 0)
            (xy 0 -1.27)
            (xy 1.27 -1.27)
            (xy 0 -2.54)
            (xy -1.27 -1.27)
            (xy 0 -1.27)
          )
          (stroke (width 0) (type default))
          (fill (type none))
        )
      )
      (symbol "GND_1_1"
        (pin power_in line (at 0 0 270) (length 0) hide
          (name "GND" (effects (font (size 1.27 1.27))))
          (number "1" (effects (font (size 1.27 1.27))))
        )
      )
    )
    (symbol "power:PWR_FLAG" (power) (pin_numbers hide) (pin_names (offset 0) hide) (in_bom yes) (on_board yes)
      (property "Reference" "#FLG" (at 0 1.905 0)
        (effects (font (size 1.27 1.27)) hide)
      )
      (property "Value" "PWR_FLAG" (at 0 3.81 0)
        (effects (font (size 1.27 1.27)))
      )
      (property "Footprint" "" (at 0 0 0)
        (effects (font (size 1.27 1.27)) hide)
      )
      (property "Datasheet" "~" (at 0 0 0)
        (effects (font (size 1.27 1.27)) hide)
      )
      (property "ki_keywords" "power-flag" (at 0 0 0)
        (effects (font (size 1.27 1.27)) hide)
      )
      (property "ki_description" "Special symbol for telling ERC where power comes from" (at 0 0 0)
        (effects (font (size 1.27 1.27)) hide)
      )
      (symbol "PWR_FLAG_0_0"
        (pin power_out line (at 0 0 90) (length 0)
          (name "pwr" (effects (font (size 1.27 1.27))))
          (number "1" (effects (font (size 1.27 1.27))))
        )
      )
      (symbol "PWR_FLAG_0_1"
        (polyline
          (pts
            (xy 0 0)
            (xy 0 1.27)
            (xy -1.016 1.905)
            (xy 0 2.54)
            (xy 1.016 1.905)
            (xy 0 1.27)
          )
          (stroke (width 0) (type default))
          (fill (type none))
        )
      )
    )
    (symbol "power:VBUS" (power) (pin_names (offset 0)) (in_bom yes) (on_board yes)
      (property "Reference" "#PWR" (at 0 -3.81 0)
        (effects (font (size 1.27 1.27)) hide)
      )
      (property "Value" "VBUS" (at 0 3.81 0)
        (effects (font (size 1.27 1.27)))
      )
      (property "Footprint" "" (at 0 0 0)
        (effects (font (size 1.27 1.27)) hide)
      )
      (property "Datasheet" "" (at 0 0 0)
        (effects (font (size 1.27 1.27)) hide)
      )
      (property "ki_keywords" "power-flag" (at 0 0 0)
        (effects (font (size 1.27 1.27)) hide)
      )
      (property "ki_description" "Power symbol creates a global label with name \"VBUS\"" (at 0 0 0)
        (effects (font (size 1.27 1.27)) hide)
      )
      (symbol "VBUS_0_1"
        (polyline
          (pts
            (xy -0.762 1.27)
            (xy 0 2.54)
          )
          (stroke (width 0) (type default))
          (fill (type none))
        )
        (polyline
          (pts
            (xy 0 0)
            (xy 0 2.54)
          )
          (stroke (width 0) (type default))
          (fill (type none))
        )
        (polyline
          (pts
            (xy 0 2.54)
            (xy 0.762 1.27)
          )
          (stroke (width 0) (type default))
          (fill (type none))
        )
      )
      (symbol "VBUS_1_1"
        (pin power_in line (at 0 0 90) (length 0) hide
          (name "VBUS" (effects (font (size 1.27 1.27))))
          (number "1" (effects (font (size 1.27 1.27))))
        )
      )
    )
    (symbol "power:VCC" (power) (pin_names (offset 0)) (in_bom yes) (on_board yes)
      (property "Reference" "#PWR" (at 0 -3.81 0)
        (effects (font (size 1.27 1.27)) hide)
      )
      (property "Value" "VCC" (at 0 3.81 0)
        (effects (font (size 1.27 1.27)))
      )
      (property "Footprint" "" (at 0 0 0)
        (effects (font (size 1.27 1.27)) hide)
      )
      (property "Datasheet" "" (at 0 0 0)
        (effects (font (size 1.27 1.27)) hide)
      )
      (property "ki_keywords" "power-flag" (at 0 0 0)
        (effects (font (size 1.27 1.27)) hide)
      )
      (property "ki_description" "Power symbol creates a global label with name \"VCC\"" (at 0 0 0)
        (effects (font (size 1.27 1.27)) hide)
      )
      (symbol "VCC_0_1"
        (polyline
          (pts
            (xy -0.762 1.27)
            (xy 0 2.54)
          )
          (stroke (width 0) (type default))
          (fill (type none))
        )
        (polyline
          (pts
            (xy 0 0)
            (xy 0 2.54)
          )
          (stroke (width 0) (type default))
          (fill (type none))
        )
        (polyline
          (pts
            (xy 0 2.54)
            (xy 0.762 1.27)
          )
          (stroke (width 0) (type default))
          (fill (type none))
        )
      )
      (symbol "VCC_1_1"
        (pin power_in line (at 0 0 90) (length 0) hide
          (name "VCC" (effects (font (size 1.27 1.27))))
          (number "1" (effects (font (size 1.27 1.27))))
        )
      )
    )
  )

  (junction (at 303.2506 75.184) (diameter 0) (color 0 0 0 0)
    (uuid 259b98a1-76bb-4733-ba26-51daabb0074c)
  )
  (junction (at 147.6502 88.9) (diameter 0) (color 0 0 0 0)
    (uuid 26a03022-758a-40c9-9a1e-e219cba99092)
  )
  (junction (at 303.2506 63.5) (diameter 0) (color 0 0 0 0)
    (uuid 39e57aa4-87b1-4a90-a0a0-4909e61701ac)
  )
  (junction (at 169.6212 73.66) (diameter 0) (color 0 0 0 0)
    (uuid 3ea1698a-5fde-40a7-9475-23be4d0687f8)
  )
  (junction (at 373.634 66.04) (diameter 0) (color 0 0 0 0)
    (uuid 421f8347-0690-45a1-bc20-b5542f9bebf0)
  )
  (junction (at 169.6212 88.9) (diameter 0) (color 0 0 0 0)
    (uuid 645640dd-c900-4598-be0e-1e7414518cbc)
  )
  (junction (at 303.2506 76.3016) (diameter 0) (color 0 0 0 0)
    (uuid 6a620df5-23ea-4717-a5fa-167a0ee903cd)
  )
  (junction (at 295.656 63.5) (diameter 0) (color 0 0 0 0)
    (uuid 77393388-18f1-4ad5-93ec-75643323e437)
  )
  (junction (at 203.2 94.6912) (diameter 0) (color 0 0 0 0)
    (uuid 9e7effd8-0420-4af8-8d8e-5d0d315def16)
  )

  (no_connect (at 144.78 55.88) (uuid 000ee37c-d793-49ce-8d44-f8d7424409b0))
  (no_connect (at 73.66 73.66) (uuid 0ddfdcd7-9cde-4978-8d6d-ba240f0619f6))
  (no_connect (at 73.66 83.82) (uuid 16de5e5b-7345-4ded-8df1-07ba184c760d))
  (no_connect (at 73.66 60.96) (uuid 262dca6c-8346-4c56-86f1-4dd8eb5da68e))
  (no_connect (at 73.66 81.28) (uuid 2d61e9c3-30db-467a-89d7-75079d090aa1))
  (no_connect (at 144.78 50.8) (uuid 3028eab5-ca29-4f56-b2ca-2d9ecd2f334a))
  (no_connect (at 144.78 83.82) (uuid 3f034e07-f8ff-4334-a923-2cfc800cc910))
  (no_connect (at 81.28 154.94) (uuid 5e1da704-3758-40f3-9c3c-95386656b1e4))
  (no_connect (at 73.66 88.9) (uuid 6132dec3-cde9-4a5e-a904-8cdcf9baefdd))
  (no_connect (at 144.78 81.28) (uuid 64728ea2-e6da-4f31-89e8-5855c8495cc7))
  (no_connect (at 144.78 58.42) (uuid 76105852-f90e-4ba6-bcb9-cdd27a3a2700))
  (no_connect (at 73.66 78.74) (uuid 7c59759f-3c2c-421b-b1f6-0a8844115a19))
  (no_connect (at 73.66 86.36) (uuid 84d5fa8f-9187-4b9d-a06d-3523a01c37e6))
  (no_connect (at 144.78 53.34) (uuid 86dd3621-3edd-4711-815c-20ba4882d1d6))
  (no_connect (at 144.78 63.5) (uuid 8b7cba54-9e26-4929-9576-f1e42b0d28d3))
  (no_connect (at 339.217 215.392) (uuid a4daee3f-dbb7-46ff-826e-845be1ae9815))
  (no_connect (at 73.66 71.12) (uuid b3c1e392-8012-42f4-bc00-e6bedd21a216))
  (no_connect (at 73.66 58.42) (uuid b3c76198-2f25-4ccf-8061-000f7e0a228d))
  (no_connect (at 339.217 236.347) (uuid baa145e2-4e9f-4751-aefe-3714b000be5f))
  (no_connect (at 144.78 68.58) (uuid c75a48d2-8963-48ed-84d1-d2301778601b))
  (no_connect (at 144.78 66.04) (uuid d16395cb-f25f-4c29-b804-662b2e2609de))
  (no_connect (at 339.217 229.362) (uuid d214834c-7d42-4f91-bd65-4c62f06edd88))
  (no_connect (at 73.66 63.5) (uuid d999c885-0b29-4f59-8649-25faac12d890))
  (no_connect (at 339.217 222.377) (uuid dfca557f-c1c1-4bf6-a054-f29f8dd114c6))
  (no_connect (at 73.66 55.88) (uuid ff495d2a-8f6b-48aa-b7b7-27f3256a1cbb))

  (wire (pts (xy 265.0998 56.1848) (xy 269.0368 56.1848))
    (stroke (width 0) (type default))
    (uuid 04e3e35f-32c9-4704-9bd5-ae4d12a97290)
  )
  (wire (pts (xy 81.28 167.64) (xy 83.693 167.64))
    (stroke (width 0) (type default))
    (uuid 1a1c34ae-483c-40d6-8e7a-bca4b0eaadaa)
  )
  (wire (pts (xy 269.0368 56.1848) (xy 269.0368 63.881))
    (stroke (width 0) (type default))
    (uuid 1f56e97b-3d09-4876-8338-6dc6ed6f728f)
  )
  (wire (pts (xy 46.5582 76.2) (xy 46.5582 103.1494))
    (stroke (width 0) (type default))
    (uuid 1f57e818-c850-4a7b-a296-51d6b4f765be)
  )
  (wire (pts (xy 81.28 154.94) (xy 83.693 154.94))
    (stroke (width 0) (type default))
    (uuid 248b2cb2-7b8d-4743-a5be-36e3eca395ed)
  )
  (wire (pts (xy 195.2498 45.72) (xy 195.2498 42.8498))
    (stroke (width 0) (type default))
    (uuid 2b821a19-fa48-424e-b402-08b050eef311)
  )
  (wire (pts (xy 192.3796 58.42) (xy 198.12 58.42))
    (stroke (width 0) (type default))
    (uuid 405be5b9-2630-4a84-8002-3e09f2551796)
  )
  (wire (pts (xy 144.78 88.9) (xy 147.6502 88.9))
    (stroke (width 0) (type default))
    (uuid 45990a09-4271-4a0c-ab04-89a166618858)
  )
  (wire (pts (xy 70.0278 68.58) (xy 73.66 68.58))
    (stroke (width 0) (type default))
    (uuid 49bd3590-a6aa-46b0-87dc-476465134917)
  )
  (wire (pts (xy 203.2 94.6912) (xy 203.2 96.52))
    (stroke (width 0) (type default))
    (uuid 4ae9a88e-304c-404a-8daa-3e91c9282400)
  )
  (wire (pts (xy 198.12 45.72) (xy 195.2498 45.72))
    (stroke (width 0) (type default))
    (uuid 4b20ad14-2976-4089-b108-8967828de101)
  )
  (wire (pts (xy 73.66 76.2) (xy 46.5582 76.2))
    (stroke (width 0) (type default))
    (uuid 5165b72d-8298-4e58-a910-21fb19e592f3)
  )
  (wire (pts (xy 79.121 152.4) (xy 83.693 152.4))
    (stroke (width 0) (type default))
    (uuid 518ae3d6-70dd-4fe7-a620-845c686040c4)
  )
  (wire (pts (xy 169.6212 73.66) (xy 169.6212 88.9))
    (stroke (width 0) (type default))
    (uuid 5572c389-4e85-4a07-a5f7-73156f69b5e4)
  )
  (wire (pts (xy 303.2506 76.3016) (xy 303.2506 77.9018))
    (stroke (width 0) (type default))
    (uuid 5746af3c-c74c-4696-a283-eb93e2d0da05)
  )
  (wire (pts (xy 70.9168 50.8) (xy 73.66 50.8))
    (stroke (width 0) (type default))
    (uuid 5c4f2ea6-ba9b-4c9a-ab7d-b8f4023f480d)
  )
  (wire (pts (xy 192.3796 48.26) (xy 198.12 48.26))
    (stroke (width 0) (type default))
    (uuid 601a173a-84ff-4ded-aa07-e0dd692b8acd)
  )
  (wire (pts (xy 166.243 71.12) (xy 166.243 67.8942))
    (stroke (width 0) (type default))
    (uuid 6b70f499-27fa-40f3-bb50-dd83bcaac0b4)
  )
  (wire (pts (xy 303.2506 75.184) (xy 303.2506 76.3016))
    (stroke (width 0) (type default))
    (uuid 6ec5fc47-5377-4159-96d1-2900a3daa50e)
  )
  (wire (pts (xy 192.3796 60.96) (xy 198.12 60.96))
    (stroke (width 0) (type default))
    (uuid 7416ef13-28b4-40a2-b543-c6be0652c2dc)
  )
  (wire (pts (xy 147.6502 88.9) (xy 169.6212 88.9))
    (stroke (width 0) (type default))
    (uuid 7600f571-1eb4-41c2-8574-fd6711eca54c)
  )
  (wire (pts (xy 295.656 67.3862) (xy 295.656 63.5))
    (stroke (width 0) (type default))
    (uuid 7963f89a-15b9-4255-91dc-531dbb1f1891)
  )
  (wire (pts (xy 79.121 151.003) (xy 79.121 152.4))
    (stroke (width 0) (type default))
    (uuid 838b7c43-1fa7-44d1-80c0-7c1dbb83d77a)
  )
  (wire (pts (xy 295.656 72.4662) (xy 295.656 75.184))
    (stroke (width 0) (type default))
    (uuid 8755c28c-85d1-40ca-a793-3b138f41d40a)
  )
  (wire (pts (xy 373.634 66.04) (xy 373.634 68.0466))
    (stroke (width 0) (type default))
    (uuid 8cf761fa-80c6-48ba-9b0d-9a0a31955924)
  )
  (wire (pts (xy 203.2 94.6912) (xy 209.6516 94.6912))
    (stroke (width 0) (type default))
    (uuid 90b711f9-faa2-44da-a3da-f1c84604b49a)
  )
  (wire (pts (xy 381.762 231.267) (xy 381.762 238.887))
    (stroke (width 0) (type default))
    (uuid 918fd3ad-4d9b-4e09-b719-3a1669eff1be)
  )
  (wire (pts (xy 144.78 71.12) (xy 166.243 71.12))
    (stroke (width 0) (type default))
    (uuid 987a609a-e2b5-4d83-88a4-eecc5542bf90)
  )
  (wire (pts (xy 269.0368 71.501) (xy 269.0368 78.3082))
    (stroke (width 0) (type default))
    (uuid 9fcc6b32-e019-4c26-bbbc-700c8bf24514)
  )
  (wire (pts (xy 306.324 66.04) (xy 325.12 66.04))
    (stroke (width 0) (type default))
    (uuid a53af123-ff41-46e2-b72e-37007424293e)
  )
  (wire (pts (xy 194.691 66.5226) (xy 194.691 63.5))
    (stroke (width 0) (type default))
    (uuid a744b627-64c0-467a-a5b5-fa420574943d)
  )
  (wire (pts (xy 83.693 157.48) (xy 81.28 157.48))
    (stroke (width 0) (type default))
    (uuid a76fe77f-88a5-4d6f-a3f2-223323a6b6ea)
  )
  (wire (pts (xy 144.78 76.2) (xy 150.0124 76.2))
    (stroke (width 0) (type default))
    (uuid a7a8e99d-f155-4844-87a9-be9f09687620)
  )
  (wire (pts (xy 303.2506 63.5) (xy 303.2506 67.2846))
    (stroke (width 0) (type default))
    (uuid a7fe4398-f347-44b8-b0a6-caeca4d7964b)
  )
  (wire (pts (xy 373.634 60.4774) (xy 373.634 66.04))
    (stroke (width 0) (type default))
    (uuid aa713c28-97fb-4fd4-b2ea-5e6047161c34)
  )
  (wire (pts (xy 370.967 231.267) (xy 370.967 238.887))
    (stroke (width 0) (type default))
    (uuid ac4e3169-9674-4133-bdec-c328e0d36a84)
  )
  (wire (pts (xy 70.9168 53.34) (xy 73.66 53.34))
    (stroke (width 0) (type default))
    (uuid b0eeccc1-1562-482f-8d36-f7ece0b3821f)
  )
  (wire (pts (xy 303.2506 72.3646) (xy 303.2506 75.184))
    (stroke (width 0) (type default))
    (uuid b5b83f4b-96b3-403a-87a0-4adda6506004)
  )
  (wire (pts (xy 144.78 86.36) (xy 147.6502 86.36))
    (stroke (width 0) (type default))
    (uuid b7b629bb-c5e4-48ec-b99f-c475b14818e7)
  )
  (wire (pts (xy 144.78 78.74) (xy 149.7076 78.74))
    (stroke (width 0) (type default))
    (uuid b9c5bd8c-23a3-4b94-a49b-386fc0606dde)
  )
  (wire (pts (xy 295.656 75.184) (xy 303.2506 75.184))
    (stroke (width 0) (type default))
    (uuid ba8dad77-fb70-46bc-b097-7fdac168632a)
  )
  (wire (pts (xy 373.634 66.04) (xy 365.76 66.04))
    (stroke (width 0) (type default))
    (uuid ba8e340d-7e2d-4abc-8b5b-107b3773f2bf)
  )
  (wire (pts (xy 303.2506 63.5) (xy 325.12 63.5))
    (stroke (width 0) (type default))
    (uuid bcda6c0c-45a8-474a-9d07-ce2db2f9d652)
  )
  (wire (pts (xy 194.691 63.5) (xy 198.12 63.5))
    (stroke (width 0) (type default))
    (uuid bf6b776b-0afc-48a9-8b9d-7fe802df6b3c)
  )
  (wire (pts (xy 373.634 73.1266) (xy 373.634 76.9366))
    (stroke (width 0) (type default))
    (uuid c2eb9435-a7af-42d7-bbf4-d52164a3f320)
  )
  (wire (pts (xy 169.6212 60.96) (xy 169.6212 73.66))
    (stroke (width 0) (type default))
    (uuid c7865fd3-6e06-49b2-b129-f65594ac09a4)
  )
  (wire (pts (xy 81.28 162.56) (xy 83.693 162.56))
    (stroke (width 0) (type default))
    (uuid c81aa3a5-fdc0-47e0-8d50-a622a5c9b0ad)
  )
  (wire (pts (xy 69.8754 66.04) (xy 73.66 66.04))
    (stroke (width 0) (type default))
    (uuid c87db0af-803c-463d-945d-ec7e97fe7e72)
  )
  (wire (pts (xy 293.8526 63.5) (xy 295.656 63.5))
    (stroke (width 0) (type default))
    (uuid c9642568-10d1-4ecb-8dd8-63ab084da36a)
  )
  (wire (pts (xy 81.28 160.02) (xy 83.693 160.02))
    (stroke (width 0) (type default))
    (uuid cbf30a94-ab5a-4005-bee6-abef3b77a3a1)
  )
  (wire (pts (xy 192.3796 55.88) (xy 198.12 55.88))
    (stroke (width 0) (type default))
    (uuid d5b2eb6d-c184-48b3-922f-d1c63560c6fb)
  )
  (wire (pts (xy 306.324 76.3016) (xy 303.2506 76.3016))
    (stroke (width 0) (type default))
    (uuid dbec2c1b-fc0e-4187-b52b-e1fb7031ecad)
  )
  (wire (pts (xy 169.6212 88.9) (xy 169.6212 102.3366))
    (stroke (width 0) (type default))
    (uuid de6e335a-5ecb-442a-b651-5a7b4824a32e)
  )
  (wire (pts (xy 323.8754 68.58) (xy 325.12 68.58))
    (stroke (width 0) (type default))
    (uuid e204a1f9-162a-4bc6-8d5c-e1ac9256476b)
  )
  (wire (pts (xy 78.232 175.26) (xy 83.693 175.26))
    (stroke (width 0) (type default))
    (uuid e437ad56-4773-402b-a3ab-6cea41788cc1)
  )
  (wire (pts (xy 81.28 170.18) (xy 83.693 170.18))
    (stroke (width 0) (type default))
    (uuid e47eb475-a7aa-4f16-8061-28d491006090)
  )
  (wire (pts (xy 192.3796 53.34) (xy 198.12 53.34))
    (stroke (width 0) (type default))
    (uuid e4ef5000-e5ae-4aa5-b6e2-701d641b1b61)
  )
  (wire (pts (xy 306.324 66.04) (xy 306.324 76.3016))
    (stroke (width 0) (type default))
    (uuid e504c93c-3d5a-4e76-bf62-7718ca43b8c6)
  )
  (wire (pts (xy 203.2 93.4466) (xy 203.2 94.6912))
    (stroke (width 0) (type default))
    (uuid e5eac690-da15-4651-9cc9-725a1d57c6fb)
  )
  (wire (pts (xy 192.3796 50.8) (xy 198.12 50.8))
    (stroke (width 0) (type default))
    (uuid e63d10fa-e8b8-418c-ace6-2521e9f2b5dc)
  )
  (wire (pts (xy 144.78 60.96) (xy 169.6212 60.96))
    (stroke (width 0) (type default))
    (uuid e7e4f63a-0731-4f11-8545-3da50c433a30)
  )
  (wire (pts (xy 203.2 85.09) (xy 203.2 88.3666))
    (stroke (width 0) (type default))
    (uuid e8a030b3-a318-43da-a191-f11e3f7bcf12)
  )
  (wire (pts (xy 83.693 172.72) (xy 81.28 172.72))
    (stroke (width 0) (type default))
    (uuid ed4bb9e6-a008-4cd8-9c1e-472b427b8f52)
  )
  (wire (pts (xy 203.2 101.6) (xy 203.2 105.6386))
    (stroke (width 0) (type default))
    (uuid f1ed6aa1-2064-4e00-b64b-92335abd5894)
  )
  (wire (pts (xy 81.28 165.1) (xy 83.693 165.1))
    (stroke (width 0) (type default))
    (uuid f244e7a8-14d4-4af3-912e-b04802919e95)
  )
  (wire (pts (xy 295.656 63.5) (xy 303.2506 63.5))
    (stroke (width 0) (type default))
    (uuid f2e32cdd-27a3-46df-b4d5-5233a2ffb313)
  )
  (wire (pts (xy 144.78 73.66) (xy 169.6212 73.66))
    (stroke (width 0) (type default))
    (uuid f5ed466f-ee78-41bb-bd40-b40f2132961d)
  )
  (wire (pts (xy 147.6502 86.36) (xy 147.6502 88.9))
    (stroke (width 0) (type default))
    (uuid f9f97975-c67d-4791-a1e2-9f01d379cb86)
  )
  (wire (pts (xy 78.232 178.689) (xy 78.232 175.26))
    (stroke (width 0) (type default))
    (uuid fb4c99b6-ecb1-42c2-aae4-84ee6a9d6759)
  )

  (rectangle (start 33.02 25.4) (end 223.52 116.84)
    (stroke (width 0) (type default))
    (fill (type none))
    (uuid 87450fa9-0e09-40db-8cd6-51c8f0189ebc)
  )
  (rectangle (start 33.02 124.46) (end 119.38 203.2)
    (stroke (width 0) (type default))
    (fill (type none))
    (uuid b592a884-572d-4cc6-84be-0aecfa79db12)
  )
  (rectangle (start 233.68 25.4) (end 386.08 116.84)
    (stroke (width 0) (type default))
    (fill (type none))
    (uuid f1c1a0f0-5a93-49d5-96be-55afb091a87b)
  )

  (text "Connector" (at 40.64 132.08 0)
    (effects (font (size 1.27 1.27)) (justify left bottom))
    (uuid 217ec4cc-e1b0-446c-af4b-5080e203115b)
  )
  (text "LoRa Module" (at 38.1 33.02 0)
    (effects (font (size 1.27 1.27)) (justify left bottom))
    (uuid 60834477-f9b2-47f7-a4a2-d4a77117f1a8)
  )
  (text "Power" (at 241.3 33.02 0)
    (effects (font (size 1.27 1.27)) (justify left bottom))
    (uuid 7dfc081b-488d-46ce-a38d-17fccc24ce73)
  )

  (global_label "ESP_TX" (shape input) (at 70.9168 50.8 180) (fields_autoplaced)
    (effects (font (size 1.27 1.27)) (justify right))
    (uuid 16085d87-a995-42e8-a867-7d90d867da61)
    (property "Intersheetrefs" "${INTERSHEET_REFS}" (at 61.8126 50.8 0)
      (effects (font (size 1.27 1.27)) (justify right) hide)
    )
  )
  (global_label "ESP_TX" (shape input) (at 81.28 160.02 180) (fields_autoplaced)
    (effects (font (size 1.27 1.27)) (justify right))
    (uuid 1fcf4402-3abf-43fc-93d9-78721d05a741)
    (property "Intersheetrefs" "${INTERSHEET_REFS}" (at 72.1758 160.02 0)
      (effects (font (size 1.27 1.27)) (justify right) hide)
    )
  )
  (global_label "RESET" (shape input) (at 192.3796 53.34 180) (fields_autoplaced)
    (effects (font (size 1.27 1.27)) (justify right))
    (uuid 3256f1b7-c7f6-4468-964c-e0aecc983c9e)
    (property "Intersheetrefs" "${INTERSHEET_REFS}" (at 184.3035 53.34 0)
      (effects (font (size 1.27 1.27)) (justify right) hide)
    )
  )
  (global_label "SWDIO" (shape input) (at 192.3796 48.26 180) (fields_autoplaced)
    (effects (font (size 1.27 1.27)) (justify right))
    (uuid 439b61cc-9d1c-42db-8bc4-5fbab29d62d6)
    (property "Intersheetrefs" "${INTERSHEET_REFS}" (at 184.1824 48.26 0)
      (effects (font (size 1.27 1.27)) (justify right) hide)
    )
  )
  (global_label "ESP_RX" (shape input) (at 70.9168 53.34 180) (fields_autoplaced)
    (effects (font (size 1.27 1.27)) (justify right))
    (uuid 4d1e6aff-3447-4910-b4b5-9de8ddbdfba2)
    (property "Intersheetrefs" "${INTERSHEET_REFS}" (at 61.5102 53.34 0)
      (effects (font (size 1.27 1.27)) (justify right) hide)
    )
  )
  (global_label "V_Batt" (shape input) (at 265.0998 56.1848 180) (fields_autoplaced)
    (effects (font (size 1.27 1.27)) (justify right))
    (uuid 518a78fe-57cc-4211-80fb-996667d63863)
    (property "Intersheetrefs" "${INTERSHEET_REFS}" (at 256.188 56.1848 0)
      (effects (font (size 1.27 1.27)) (justify right) hide)
    )
  )
  (global_label "SWDIO" (shape input) (at 69.8754 66.04 180) (fields_autoplaced)
    (effects (font (size 1.27 1.27)) (justify right))
    (uuid 658ce1af-083e-48bb-a0b7-20e30184f6bd)
    (property "Intersheetrefs" "${INTERSHEET_REFS}" (at 61.6782 66.04 0)
      (effects (font (size 1.27 1.27)) (justify right) hide)
    )
  )
  (global_label "BOOT" (shape input) (at 149.7076 78.74 0) (fields_autoplaced)
    (effects (font (size 1.27 1.27)) (justify left))
    (uuid 826cec17-273c-41d4-b23a-7ce9e1a9e0e8)
    (property "Intersheetrefs" "${INTERSHEET_REFS}" (at 156.9372 78.74 0)
      (effects (font (size 1.27 1.27)) (justify left) hide)
    )
  )
  (global_label "BOOT" (shape input) (at 192.3796 55.88 180) (fields_autoplaced)
    (effects (font (size 1.27 1.27)) (justify right))
    (uuid 8562148f-270a-407d-bac6-d12602be5245)
    (property "Intersheetrefs" "${INTERSHEET_REFS}" (at 185.15 55.88 0)
      (effects (font (size 1.27 1.27)) (justify right) hide)
    )
  )
  (global_label "V_Batt" (shape input) (at 81.28 170.18 180) (fields_autoplaced)
    (effects (font (size 1.27 1.27)) (justify right))
    (uuid 8d45ac3e-fb80-4f9a-b5e3-38a86e25e8b5)
    (property "Intersheetrefs" "${INTERSHEET_REFS}" (at 72.3682 170.18 0)
      (effects (font (size 1.27 1.27)) (justify right) hide)
    )
  )
  (global_label "SWCLK" (shape input) (at 192.3796 50.8 180) (fields_autoplaced)
    (effects (font (size 1.27 1.27)) (justify right))
    (uuid 8d7d75e3-9f04-4ef8-8623-cbc61d608a7b)
    (property "Intersheetrefs" "${INTERSHEET_REFS}" (at 183.8196 50.8 0)
      (effects (font (size 1.27 1.27)) (justify right) hide)
    )
  )
  (global_label "ESP_RX" (shape input) (at 81.28 162.56 180) (fields_autoplaced)
    (effects (font (size 1.27 1.27)) (justify right))
    (uuid 9d7b3337-72b8-4bfb-9054-324eb6e265fd)
    (property "Intersheetrefs" "${INTERSHEET_REFS}" (at 71.8734 162.56 0)
      (effects (font (size 1.27 1.27)) (justify right) hide)
    )
  )
  (global_label "ESP_TX" (shape input) (at 192.3796 58.42 180) (fields_autoplaced)
    (effects (font (size 1.27 1.27)) (justify right))
    (uuid a047ab7a-688c-4ac3-9c5b-95422aef149d)
    (property "Intersheetrefs" "${INTERSHEET_REFS}" (at 183.2754 58.42 0)
      (effects (font (size 1.27 1.27)) (justify right) hide)
    )
  )
  (global_label "SWCLK" (shape input) (at 70.0278 68.58 180) (fields_autoplaced)
    (effects (font (size 1.27 1.27)) (justify right))
    (uuid a0aa4f28-cf3c-4908-9a71-5f82def713a2)
    (property "Intersheetrefs" "${INTERSHEET_REFS}" (at 61.4678 68.58 0)
      (effects (font (size 1.27 1.27)) (justify right) hide)
    )
  )
  (global_label "QEC_PWRKEY" (shape input) (at 81.28 157.48 180) (fields_autoplaced)
    (effects (font (size 1.27 1.27)) (justify right))
    (uuid a84c870c-2857-497c-9c5f-e7f563f5b6bf)
    (property "Intersheetrefs" "${INTERSHEET_REFS}" (at 66.7329 157.48 0)
      (effects (font (size 1.27 1.27)) (justify right) hide)
    )
  )
  (global_label "RESET" (shape input) (at 209.6516 94.6912 0) (fields_autoplaced)
    (effects (font (size 1.27 1.27)) (justify left))
    (uuid b6733764-16c4-427b-a9df-aaff2274ac51)
    (property "Intersheetrefs" "${INTERSHEET_REFS}" (at 217.7277 94.6912 0)
      (effects (font (size 1.27 1.27)) (justify left) hide)
    )
  )
  (global_label "QEC_USBEN" (shape input) (at 81.28 167.64 180) (fields_autoplaced)
    (effects (font (size 1.27 1.27)) (justify right))
    (uuid b7579393-e0e0-4373-b0d5-651dc0dde2c9)
    (property "Intersheetrefs" "${INTERSHEET_REFS}" (at 67.9424 167.64 0)
      (effects (font (size 1.27 1.27)) (justify right) hide)
    )
  )
  (global_label "RESET" (shape input) (at 150.0124 76.2 0) (fields_autoplaced)
    (effects (font (size 1.27 1.27)) (justify left))
    (uuid bc03b194-3303-4904-8a69-5b159b22ef1c)
    (property "Intersheetrefs" "${INTERSHEET_REFS}" (at 158.0885 76.2 0)
      (effects (font (size 1.27 1.27)) (justify left) hide)
    )
  )
  (global_label "QEC_PON_TRIG" (shape input) (at 81.28 165.1 180) (fields_autoplaced)
    (effects (font (size 1.27 1.27)) (justify right))
    (uuid bcb26081-af7e-466a-ac41-8b2057ef5228)
    (property "Intersheetrefs" "${INTERSHEET_REFS}" (at 65.2209 165.1 0)
      (effects (font (size 1.27 1.27)) (justify right) hide)
    )
  )
  (global_label "V_MODEM_EN" (shape input) (at 323.8754 68.58 180) (fields_autoplaced)
    (effects (font (size 1.27 1.27)) (justify right))
    (uuid cc80a44a-b195-4d9e-8c05-6dcc859d166b)
    (property "Intersheetrefs" "${INTERSHEET_REFS}" (at 309.3888 68.58 0)
      (effects (font (size 1.27 1.27)) (justify right) hide)
    )
  )
  (global_label "V_Batt" (shape input) (at 293.8526 63.5 180) (fields_autoplaced)
    (effects (font (size 1.27 1.27)) (justify right))
    (uuid ef5cde04-6750-4fb2-afaa-1efe2d1400d0)
    (property "Intersheetrefs" "${INTERSHEET_REFS}" (at 284.9408 63.5 0)
      (effects (font (size 1.27 1.27)) (justify right) hide)
    )
  )
  (global_label "V_MODEM_EN" (shape input) (at 81.28 172.72 180) (fields_autoplaced)
    (effects (font (size 1.27 1.27)) (justify right))
    (uuid f24da779-9650-4216-82b5-7b2ba8921b5f)
    (property "Intersheetrefs" "${INTERSHEET_REFS}" (at 66.7934 172.72 0)
      (effects (font (size 1.27 1.27)) (justify right) hide)
    )
  )
  (global_label "ESP_RX" (shape input) (at 192.3796 60.96 180) (fields_autoplaced)
    (effects (font (size 1.27 1.27)) (justify right))
    (uuid fc7e6094-15c3-47f3-abf5-a16fd0995b29)
    (property "Intersheetrefs" "${INTERSHEET_REFS}" (at 182.973 60.96 0)
      (effects (font (size 1.27 1.27)) (justify right) hide)
    )
  )

  (symbol (lib_id "power:+3V3") (at 381.762 231.267 0) (unit 1)
    (in_bom yes) (on_board yes) (dnp no)
    (uuid 00000000-0000-0000-0000-00005f5c22f3)
    (property "Reference" "#PWR026" (at 381.762 235.077 0)
      (effects (font (size 1.27 1.27)) hide)
    )
    (property "Value" "+3V3" (at 382.143 226.8728 0)
      (effects (font (size 1.27 1.27)))
    )
    (property "Footprint" "" (at 381.762 231.267 0)
      (effects (font (size 1.27 1.27)) hide)
    )
    (property "Datasheet" "" (at 381.762 231.267 0)
      (effects (font (size 1.27 1.27)) hide)
    )
    (pin "1" (uuid a7f24701-78ba-4478-8a80-9fadc289f81a))
    (instances
      (project "LoRa Dark Sky v0r0"
        (path "/3c811405-f5e1-448d-b8b8-eef19b0ae5a8"
          (reference "#PWR026") (unit 1)
        )
      )
    )
  )

  (symbol (lib_id "power:PWR_FLAG") (at 381.762 238.887 180) (unit 1)
    (in_bom yes) (on_board yes) (dnp no)
    (uuid 00000000-0000-0000-0000-00005f5c2f2e)
    (property "Reference" "#FLG02" (at 381.762 240.792 0)
      (effects (font (size 1.27 1.27)) hide)
    )
    (property "Value" "PWR_FLAG" (at 381.762 243.2812 0)
      (effects (font (size 1.27 1.27)))
    )
    (property "Footprint" "" (at 381.762 238.887 0)
      (effects (font (size 1.27 1.27)) hide)
    )
    (property "Datasheet" "~" (at 381.762 238.887 0)
      (effects (font (size 1.27 1.27)) hide)
    )
    (pin "1" (uuid 784e7c46-13a4-4ff5-8236-bf42508af6fb))
    (instances
      (project "LoRa Dark Sky v0r0"
        (path "/3c811405-f5e1-448d-b8b8-eef19b0ae5a8"
          (reference "#FLG02") (unit 1)
        )
      )
    )
  )

  (symbol (lib_id "power:VBUS") (at 370.967 231.267 0) (unit 1)
    (in_bom yes) (on_board yes) (dnp no)
    (uuid 00000000-0000-0000-0000-00005f62b3cb)
    (property "Reference" "#PWR025" (at 370.967 235.077 0)
      (effects (font (size 1.27 1.27)) hide)
    )
    (property "Value" "VBUS" (at 371.348 226.8728 0)
      (effects (font (size 1.27 1.27)))
    )
    (property "Footprint" "" (at 370.967 231.267 0)
      (effects (font (size 1.27 1.27)) hide)
    )
    (property "Datasheet" "" (at 370.967 231.267 0)
      (effects (font (size 1.27 1.27)) hide)
    )
    (pin "1" (uuid 2a2ebb54-f3cd-4be4-9aee-8c8de7181cb3))
    (instances
      (project "LoRa Dark Sky v0r0"
        (path "/3c811405-f5e1-448d-b8b8-eef19b0ae5a8"
          (reference "#PWR025") (unit 1)
        )
      )
    )
  )

  (symbol (lib_id "power:PWR_FLAG") (at 370.967 238.887 180) (unit 1)
    (in_bom yes) (on_board yes) (dnp no)
    (uuid 00000000-0000-0000-0000-00005f62c601)
    (property "Reference" "#FLG01" (at 370.967 240.792 0)
      (effects (font (size 1.27 1.27)) hide)
    )
    (property "Value" "PWR_FLAG" (at 370.967 243.2812 0)
      (effects (font (size 1.27 1.27)))
    )
    (property "Footprint" "" (at 370.967 238.887 0)
      (effects (font (size 1.27 1.27)) hide)
    )
    (property "Datasheet" "~" (at 370.967 238.887 0)
      (effects (font (size 1.27 1.27)) hide)
    )
    (pin "1" (uuid c3f0a6b3-33dd-4ca6-bf67-af50f8a7084a))
    (instances
      (project "LoRa Dark Sky v0r0"
        (path "/3c811405-f5e1-448d-b8b8-eef19b0ae5a8"
          (reference "#FLG01") (unit 1)
        )
      )
    )
  )

  (symbol (lib_id "Mechanical:MountingHole_Pad") (at 339.217 219.837 0) (unit 1)
    (in_bom yes) (on_board yes) (dnp no)
    (uuid 00000000-0000-0000-0000-00005f695770)
    (property "Reference" "H2" (at 341.757 218.5924 0)
      (effects (font (size 1.27 1.27)) (justify left))
    )
    (property "Value" "MountingHole_Pad" (at 341.757 220.9038 0)
      (effects (font (size 1.27 1.27)) (justify left))
    )
    (property "Footprint" "MountingHole:MountingHole_3.2mm_M3" (at 339.217 219.837 0)
      (effects (font (size 1.27 1.27)) hide)
    )
    (property "Datasheet" "~" (at 339.217 219.837 0)
      (effects (font (size 1.27 1.27)) hide)
    )
    (pin "1" (uuid 09e9b87e-12ff-41db-8d02-63afc46183f1))
    (instances
      (project "LoRa Dark Sky v0r0"
        (path "/3c811405-f5e1-448d-b8b8-eef19b0ae5a8"
          (reference "H2") (unit 1)
        )
      )
    )
  )

  (symbol (lib_id "Mechanical:MountingHole_Pad") (at 339.217 212.852 0) (unit 1)
    (in_bom yes) (on_board yes) (dnp no)
    (uuid 00000000-0000-0000-0000-00005f695ca0)
    (property "Reference" "H1" (at 341.757 211.6074 0)
      (effects (font (size 1.27 1.27)) (justify left))
    )
    (property "Value" "MountingHole_Pad" (at 341.757 213.9188 0)
      (effects (font (size 1.27 1.27)) (justify left))
    )
    (property "Footprint" "MountingHole:MountingHole_3.2mm_M3" (at 339.217 212.852 0)
      (effects (font (size 1.27 1.27)) hide)
    )
    (property "Datasheet" "~" (at 339.217 212.852 0)
      (effects (font (size 1.27 1.27)) hide)
    )
    (pin "1" (uuid 26ff0811-7121-4758-b566-b0a426e671c6))
    (instances
      (project "LoRa Dark Sky v0r0"
        (path "/3c811405-f5e1-448d-b8b8-eef19b0ae5a8"
          (reference "H1") (unit 1)
        )
      )
    )
  )

  (symbol (lib_id "Mechanical:MountingHole_Pad") (at 339.217 226.822 0) (unit 1)
    (in_bom yes) (on_board yes) (dnp no)
    (uuid 00000000-0000-0000-0000-00005f6963c5)
    (property "Reference" "H3" (at 341.757 225.5774 0)
      (effects (font (size 1.27 1.27)) (justify left))
    )
    (property "Value" "MountingHole_Pad" (at 341.757 227.8888 0)
      (effects (font (size 1.27 1.27)) (justify left))
    )
    (property "Footprint" "MountingHole:MountingHole_3.2mm_M3" (at 339.217 226.822 0)
      (effects (font (size 1.27 1.27)) hide)
    )
    (property "Datasheet" "~" (at 339.217 226.822 0)
      (effects (font (size 1.27 1.27)) hide)
    )
    (pin "1" (uuid 6e192f86-6a45-4a51-bcea-744f35abad0f))
    (instances
      (project "LoRa Dark Sky v0r0"
        (path "/3c811405-f5e1-448d-b8b8-eef19b0ae5a8"
          (reference "H3") (unit 1)
        )
      )
    )
  )

  (symbol (lib_id "Mechanical:MountingHole_Pad") (at 339.217 233.807 0) (unit 1)
    (in_bom yes) (on_board yes) (dnp no)
    (uuid 00000000-0000-0000-0000-00005f6966f0)
    (property "Reference" "H4" (at 341.757 232.5624 0)
      (effects (font (size 1.27 1.27)) (justify left))
    )
    (property "Value" "MountingHole_Pad" (at 341.757 234.8738 0)
      (effects (font (size 1.27 1.27)) (justify left))
    )
    (property "Footprint" "MountingHole:MountingHole_3.2mm_M3" (at 339.217 233.807 0)
      (effects (font (size 1.27 1.27)) hide)
    )
    (property "Datasheet" "~" (at 339.217 233.807 0)
      (effects (font (size 1.27 1.27)) hide)
    )
    (pin "1" (uuid afe2b300-a2e7-4560-943f-8a7760da2a75))
    (instances
      (project "LoRa Dark Sky v0r0"
        (path "/3c811405-f5e1-448d-b8b8-eef19b0ae5a8"
          (reference "H4") (unit 1)
        )
      )
    )
  )

  (symbol (lib_id "power:VCC") (at 79.121 151.003 0) (unit 1)
    (in_bom yes) (on_board yes) (dnp no)
    (uuid 00000000-0000-0000-0000-000060dbd1a7)
    (property "Reference" "#PWR051" (at 79.121 154.813 0)
      (effects (font (size 1.27 1.27)) hide)
    )
    (property "Value" "VCC" (at 79.5528 146.6088 0)
      (effects (font (size 1.27 1.27)))
    )
    (property "Footprint" "" (at 79.121 151.003 0)
      (effects (font (size 1.27 1.27)) hide)
    )
    (property "Datasheet" "" (at 79.121 151.003 0)
      (effects (font (size 1.27 1.27)) hide)
    )
    (pin "1" (uuid fdb936df-00d5-4a8e-8a32-fd805f3d3598))
    (instances
      (project "LoRa Dark Sky v0r0"
        (path "/3c811405-f5e1-448d-b8b8-eef19b0ae5a8"
          (reference "#PWR051") (unit 1)
        )
      )
    )
  )

  (symbol (lib_id "power:GND") (at 78.232 178.689 0) (unit 1)
    (in_bom yes) (on_board yes) (dnp no)
    (uuid 00000000-0000-0000-0000-000060dccd19)
    (property "Reference" "#PWR05" (at 78.232 185.039 0)
      (effects (font (size 1.27 1.27)) hide)
    )
    (property "Value" "GND" (at 78.359 183.0832 0)
      (effects (font (size 1.27 1.27)))
    )
    (property "Footprint" "" (at 78.232 178.689 0)
      (effects (font (size 1.27 1.27)) hide)
    )
    (property "Datasheet" "" (at 78.232 178.689 0)
      (effects (font (size 1.27 1.27)) hide)
    )
    (pin "1" (uuid aa749872-46a6-4e4a-972c-30d49cc9c214))
    (instances
      (project "LoRa Dark Sky v0r0"
        (path "/3c811405-f5e1-448d-b8b8-eef19b0ae5a8"
          (reference "#PWR05") (unit 1)
        )
      )
    )
  )

  (symbol (lib_id "power:+3.3V") (at 203.2 85.09 0) (unit 1)
    (in_bom yes) (on_board yes) (dnp no)
    (uuid 34ee6c03-9a6d-45cf-9f1d-891cf1229ddb)
    (property "Reference" "#PWR022" (at 203.2 88.9 0)
      (effects (font (size 1.27 1.27)) hide)
    )
    (property "Value" "+3.3V" (at 203.581 80.6958 0)
      (effects (font (size 1.27 1.27)))
    )
    (property "Footprint" "" (at 203.2 85.09 0)
      (effects (font (size 1.27 1.27)) hide)
    )
    (property "Datasheet" "" (at 203.2 85.09 0)
      (effects (font (size 1.27 1.27)) hide)
    )
    (pin "1" (uuid bc0eb46e-1503-4c7f-85f6-3f99f18e30a1))
    (instances
      (project "Dark Sky v4r0"
        (path "/3934cdea-42c8-4ab1-b1be-2c4978ab08ae/497a2c1d-6da4-4127-a209-e810bb8750b1"
          (reference "#PWR022") (unit 1)
        )
      )
      (project "LoRa Dark Sky v0r0"
        (path "/3c811405-f5e1-448d-b8b8-eef19b0ae5a8"
          (reference "#PWR09") (unit 1)
        )
      )
    )
  )

  (symbol (lib_id "power:GND") (at 203.2 105.6386 0) (unit 1)
    (in_bom yes) (on_board yes) (dnp no) (fields_autoplaced)
    (uuid 38d37efb-4907-443b-92c9-693fc27e5680)
    (property "Reference" "#PWR023" (at 203.2 111.9886 0)
      (effects (font (size 1.27 1.27)) hide)
    )
    (property "Value" "GND" (at 203.2 110.2011 0)
      (effects (font (size 1.27 1.27)))
    )
    (property "Footprint" "" (at 203.2 105.6386 0)
      (effects (font (size 1.27 1.27)) hide)
    )
    (property "Datasheet" "" (at 203.2 105.6386 0)
      (effects (font (size 1.27 1.27)) hide)
    )
    (pin "1" (uuid 656ce1e7-9f5c-4efb-85d6-3d69a39da61f))
    (instances
      (project "Dark Sky v4r0"
        (path "/3934cdea-42c8-4ab1-b1be-2c4978ab08ae/497a2c1d-6da4-4127-a209-e810bb8750b1"
          (reference "#PWR023") (unit 1)
        )
      )
      (project "LoRa Dark Sky v0r0"
        (path "/3c811405-f5e1-448d-b8b8-eef19b0ae5a8"
          (reference "#PWR010") (unit 1)
        )
      )
    )
  )

  (symbol (lib_id "power:GND") (at 303.2506 77.9018 0) (unit 1)
    (in_bom yes) (on_board yes) (dnp no) (fields_autoplaced)
    (uuid 427f5256-2151-4dce-90e3-005fc1d37ce3)
    (property "Reference" "#PWR016" (at 303.2506 84.2518 0)
      (effects (font (size 1.27 1.27)) hide)
    )
    (property "Value" "GND" (at 303.2506 82.4643 0)
      (effects (font (size 1.27 1.27)))
    )
    (property "Footprint" "" (at 303.2506 77.9018 0)
      (effects (font (size 1.27 1.27)) hide)
    )
    (property "Datasheet" "" (at 303.2506 77.9018 0)
      (effects (font (size 1.27 1.27)) hide)
    )
    (pin "1" (uuid f53c7ef1-8f66-49dc-94ee-c473b803251b))
    (instances
      (project "Dark Sky v4r0"
        (path "/3934cdea-42c8-4ab1-b1be-2c4978ab08ae/497a2c1d-6da4-4127-a209-e810bb8750b1"
          (reference "#PWR016") (unit 1)
        )
      )
      (project "LoRa Dark Sky v0r0"
        (path "/3c811405-f5e1-448d-b8b8-eef19b0ae5a8"
          (reference "#PWR04") (unit 1)
        )
      )
    )
  )

  (symbol (lib_id "power:GND") (at 46.5582 103.1494 0) (unit 1)
    (in_bom yes) (on_board yes) (dnp no)
    (uuid 4b8bbb04-578e-4391-87cb-ea6d88ab2cb2)
    (property "Reference" "#PWR03" (at 46.5582 109.4994 0)
      (effects (font (size 1.27 1.27)) hide)
    )
    (property "Value" "GND" (at 46.6852 107.5436 0)
      (effects (font (size 1.27 1.27)))
    )
    (property "Footprint" "" (at 46.5582 103.1494 0)
      (effects (font (size 1.27 1.27)) hide)
    )
    (property "Datasheet" "" (at 46.5582 103.1494 0)
      (effects (font (size 1.27 1.27)) hide)
    )
    (pin "1" (uuid 3eb3bef6-209f-4a71-95b8-f392053f3650))
    (instances
      (project "LoRa Dark Sky v0r0"
        (path "/3c811405-f5e1-448d-b8b8-eef19b0ae5a8"
          (reference "#PWR03") (unit 1)
        )
      )
    )
  )

  (symbol (lib_id "power:GND") (at 269.0368 78.3082 0) (unit 1)
    (in_bom yes) (on_board yes) (dnp no)
    (uuid 5380a302-d92e-44de-854d-242498f58997)
    (property "Reference" "#PWR01" (at 269.0368 84.6582 0)
      (effects (font (size 1.27 1.27)) hide)
    )
    (property "Value" "GND" (at 269.1638 82.7024 0)
      (effects (font (size 1.27 1.27)))
    )
    (property "Footprint" "" (at 269.0368 78.3082 0)
      (effects (font (size 1.27 1.27)) hide)
    )
    (property "Datasheet" "" (at 269.0368 78.3082 0)
      (effects (font (size 1.27 1.27)) hide)
    )
    (pin "1" (uuid 07e9d95c-a70b-44b6-8a69-5c73940ec79a))
    (instances
      (project "LoRa Dark Sky v0r0"
        (path "/3c811405-f5e1-448d-b8b8-eef19b0ae5a8"
          (reference "#PWR01") (unit 1)
        )
      )
    )
  )

  (symbol (lib_id "Connector_Generic:Conn_01x10") (at 88.773 165.1 0) (mirror x) (unit 1)
    (in_bom yes) (on_board yes) (dnp no)
    (uuid 5c04d252-65ca-46ec-bafe-58f85c0b27cb)
    (property "Reference" "J3" (at 88.773 147.1635 0)
      (effects (font (size 1.27 1.27)))
    )
    (property "Value" "Conn_01x10" (at 88.773 149.9386 0)
      (effects (font (size 1.27 1.27)))
    )
    (property "Footprint" "FFC3B07-10:GCT_FFC3B07-10-T" (at 88.773 165.1 0)
      (effects (font (size 1.27 1.27)) hide)
    )
    (property "Datasheet" "~" (at 88.773 165.1 0)
      (effects (font (size 1.27 1.27)) hide)
    )
    (property "Digi-Key_PN" "2073-FFC3B07-10-TTR-ND" (at 88.773 165.1 0)
      (effects (font (size 1.27 1.27)) hide)
    )
    (pin "1" (uuid f565f777-2d40-4938-bd65-88db78561a81))
    (pin "10" (uuid 5dccb5f8-c54c-4008-a994-f944b3550644))
    (pin "2" (uuid 302c61e7-8ef3-46fc-90cf-29e448c19c28))
    (pin "3" (uuid e2ad3aa0-afa8-4cdc-973a-7ad431b4aeaa))
    (pin "4" (uuid 8207fc45-0313-4234-aee0-ea632d9291da))
    (pin "5" (uuid e0d36344-d0cb-46a6-bbef-83806120efaa))
    (pin "6" (uuid 72dd4505-0042-4b25-bff8-e10f5e99358c))
    (pin "7" (uuid 3c5f2b7d-c3cb-46d4-aac6-08f57f4b2607))
    (pin "8" (uuid 78f014d1-7799-4637-b5e8-0c7a8c57505a))
    (pin "9" (uuid acb7f1df-2689-41ab-94a4-a00caf004542))
    (instances
      (project "Dark Sky v3r0"
        (path "/3934cdea-42c8-4ab1-b1be-2c4978ab08ae"
          (reference "J3") (unit 1)
        )
      )
      (project "LoRa Dark Sky v0r0"
        (path "/3c811405-f5e1-448d-b8b8-eef19b0ae5a8"
          (reference "J1") (unit 1)
        )
      )
    )
  )

  (symbol (lib_id "Device:C_Small") (at 295.656 69.9262 0) (unit 1)
    (in_bom yes) (on_board yes) (dnp no)
    (uuid 67e5d01c-5cac-4435-b24b-cc0a0b373be4)
    (property "Reference" "C3" (at 290.6268 68.4784 0)
      (effects (font (size 1.27 1.27)) (justify left))
    )
    (property "Value" "100nF" (at 288.417 71.7042 0)
      (effects (font (size 1.27 1.27)) (justify left))
    )
    (property "Footprint" "Capacitor_SMD:C_0603_1608Metric" (at 295.656 69.9262 0)
      (effects (font (size 1.27 1.27)) hide)
    )
    (property "Datasheet" "~" (at 295.656 69.9262 0)
      (effects (font (size 1.27 1.27)) hide)
    )
    (property "Digi-Key_PN" "1276-1935-1-ND" (at 295.656 69.9262 0)
      (effects (font (size 1.27 1.27)) hide)
    )
    (property "Desc" "CAP CER 0.1UF 50V X7R 0603" (at 295.656 69.9262 0)
      (effects (font (size 1.27 1.27)) hide)
    )
    (property "Description" "CAP CER 0.1UF 50V X7R 0603" (at 295.656 69.9262 0)
      (effects (font (size 1.27 1.27)) hide)
    )
    (pin "1" (uuid 54d6113b-eebe-4e7a-8001-b3b453650800))
    (pin "2" (uuid 466dbf04-bc35-4325-8a3d-f7ccf00cb427))
    (instances
      (project "Dark Sky v4r0"
        (path "/3934cdea-42c8-4ab1-b1be-2c4978ab08ae"
          (reference "C3") (unit 1)
        )
      )
      (project "LoRa Dark Sky v0r0"
        (path "/3c811405-f5e1-448d-b8b8-eef19b0ae5a8"
          (reference "C4") (unit 1)
        )
      )
    )
  )

  (symbol (lib_id "AP7366-33W5-7:AP7366-33W5-7") (at 325.12 63.5 0) (unit 1)
    (in_bom yes) (on_board yes) (dnp no) (fields_autoplaced)
    (uuid 6bb01287-eabb-4aa6-8054-c473a2319675)
    (property "Reference" "U5" (at 345.44 53.9526 0)
      (effects (font (size 1.524 1.524)))
    )
    (property "Value" "AP7366-33W5-7" (at 345.44 57.2316 0)
      (effects (font (size 1.524 1.524)))
    )
    (property "Footprint" "AP7366-33W5-7:SOT25-YE_DIO" (at 325.12 63.5 0)
      (effects (font (size 1.27 1.27) italic) hide)
    )
    (property "Datasheet" "AP7366-33W5-7" (at 325.12 63.5 0)
      (effects (font (size 1.27 1.27) italic) hide)
    )
    (property "Desc" "IC REG LINEAR 3.3V 600MA SOT25" (at 325.12 63.5 0)
      (effects (font (size 1.27 1.27)) hide)
    )
    (property "Description" "IC REG LINEAR 3.3V 600MA SOT25" (at 325.12 63.5 0)
      (effects (font (size 1.27 1.27)) hide)
    )
    (property "Digi-Key_PN" "AP7366-33W5-7DICT-ND" (at 325.12 63.5 0)
      (effects (font (size 1.27 1.27)) hide)
    )
    (pin "1" (uuid 229ca53a-9fe5-448c-8553-0339cc11d955))
    (pin "2" (uuid 7d8ff06f-4d16-437a-a957-a395a971e5da))
    (pin "3" (uuid 724fca9e-3fcf-43ce-94ec-8a61bb49c6a9))
    (pin "4" (uuid 7dd52f15-4bc2-41c9-80b5-a7ee34b50feb))
    (pin "5" (uuid 60ef3b6f-e4a4-4021-bade-4363da19fbdc))
    (instances
      (project "Dark Sky v4r0"
        (path "/3934cdea-42c8-4ab1-b1be-2c4978ab08ae/497a2c1d-6da4-4127-a209-e810bb8750b1"
          (reference "U5") (unit 1)
        )
      )
      (project "LoRa Dark Sky v0r0"
        (path "/3c811405-f5e1-448d-b8b8-eef19b0ae5a8"
          (reference "U2") (unit 1)
        )
      )
    )
  )

  (symbol (lib_id "Device:C_Small") (at 203.2 99.06 0) (unit 1)
    (in_bom yes) (on_board yes) (dnp no)
    (uuid 6df8e001-6238-4a5c-b453-615a589ce181)
    (property "Reference" "C3" (at 198.1708 97.6122 0)
      (effects (font (size 1.27 1.27)) (justify left))
    )
    (property "Value" "100nF" (at 195.961 100.838 0)
      (effects (font (size 1.27 1.27)) (justify left))
    )
    (property "Footprint" "Capacitor_SMD:C_0603_1608Metric" (at 203.2 99.06 0)
      (effects (font (size 1.27 1.27)) hide)
    )
    (property "Datasheet" "~" (at 203.2 99.06 0)
      (effects (font (size 1.27 1.27)) hide)
    )
    (property "Digi-Key_PN" "1276-1935-1-ND" (at 203.2 99.06 0)
      (effects (font (size 1.27 1.27)) hide)
    )
    (property "Desc" "CAP CER 0.1UF 50V X7R 0603" (at 203.2 99.06 0)
      (effects (font (size 1.27 1.27)) hide)
    )
    (property "Description" "CAP CER 0.1UF 50V X7R 0603" (at 203.2 99.06 0)
      (effects (font (size 1.27 1.27)) hide)
    )
    (pin "1" (uuid b887ff6a-1eb4-462e-bd8e-e3c0fc5ae64b))
    (pin "2" (uuid fb2f12a7-b125-4fe9-b29d-b1c416ffa5f7))
    (instances
      (project "Dark Sky v4r0"
        (path "/3934cdea-42c8-4ab1-b1be-2c4978ab08ae"
          (reference "C3") (unit 1)
        )
      )
      (project "LoRa Dark Sky v0r0"
        (path "/3c811405-f5e1-448d-b8b8-eef19b0ae5a8"
          (reference "C5") (unit 1)
        )
      )
    )
  )

  (symbol (lib_id "Device:C_Small") (at 373.634 70.5866 0) (unit 1)
    (in_bom yes) (on_board yes) (dnp no) (fields_autoplaced)
    (uuid 6e2e20b2-e174-4c85-a8ae-27f63463f273)
    (property "Reference" "C10" (at 375.9581 69.6844 0)
      (effects (font (size 1.27 1.27)) (justify left))
    )
    (property "Value" "1uF" (at 375.9581 72.4595 0)
      (effects (font (size 1.27 1.27)) (justify left))
    )
    (property "Footprint" "Capacitor_SMD:C_0603_1608Metric" (at 373.634 70.5866 0)
      (effects (font (size 1.27 1.27)) hide)
    )
    (property "Datasheet" "~" (at 373.634 70.5866 0)
      (effects (font (size 1.27 1.27)) hide)
    )
    (property "Description" "CAP CER 1UF 25V X7R 0603" (at 373.634 70.5866 0)
      (effects (font (size 1.27 1.27)) hide)
    )
    (property "Digi-Key_PN" "1276-1184-1-ND" (at 373.634 70.5866 0)
      (effects (font (size 1.27 1.27)) hide)
    )
    (property "Desc" "CAP CER 1UF 25V X7R 0603" (at 373.634 70.5866 0)
      (effects (font (size 1.27 1.27)) hide)
    )
    (pin "1" (uuid d625f54f-3486-4e53-a71f-88667d61cfbf))
    (pin "2" (uuid 12452d69-4cdc-4d14-bba7-e3da7fc939d1))
    (instances
      (project "Dark Sky v4r0"
        (path "/3934cdea-42c8-4ab1-b1be-2c4978ab08ae/497a2c1d-6da4-4127-a209-e810bb8750b1"
          (reference "C10") (unit 1)
        )
      )
      (project "LoRa Dark Sky v0r0"
        (path "/3c811405-f5e1-448d-b8b8-eef19b0ae5a8"
          (reference "C3") (unit 1)
        )
      )
    )
  )

  (symbol (lib_id "power:+3.3V") (at 195.2498 42.8498 0) (unit 1)
    (in_bom yes) (on_board yes) (dnp no)
    (uuid 6ef4f46b-77b3-4a80-ae6e-34c83e6af485)
    (property "Reference" "#PWR022" (at 195.2498 46.6598 0)
      (effects (font (size 1.27 1.27)) hide)
    )
    (property "Value" "+3.3V" (at 195.6308 38.4556 0)
      (effects (font (size 1.27 1.27)))
    )
    (property "Footprint" "" (at 195.2498 42.8498 0)
      (effects (font (size 1.27 1.27)) hide)
    )
    (property "Datasheet" "" (at 195.2498 42.8498 0)
      (effects (font (size 1.27 1.27)) hide)
    )
    (pin "1" (uuid 7b915919-e4e3-4ac0-9bc7-47c1ef99fa12))
    (instances
      (project "Dark Sky v4r0"
        (path "/3934cdea-42c8-4ab1-b1be-2c4978ab08ae/497a2c1d-6da4-4127-a209-e810bb8750b1"
          (reference "#PWR022") (unit 1)
        )
      )
      (project "LoRa Dark Sky v0r0"
        (path "/3c811405-f5e1-448d-b8b8-eef19b0ae5a8"
          (reference "#PWR011") (unit 1)
        )
      )
    )
  )

  (symbol (lib_id "power:GND") (at 194.691 66.5226 0) (unit 1)
    (in_bom yes) (on_board yes) (dnp no)
    (uuid 797a5702-d7ef-4f85-8902-ee8f83d2f5eb)
    (property "Reference" "#PWR012" (at 194.691 72.8726 0)
      (effects (font (size 1.27 1.27)) hide)
    )
    (property "Value" "GND" (at 194.818 70.9168 0)
      (effects (font (size 1.27 1.27)))
    )
    (property "Footprint" "" (at 194.691 66.5226 0)
      (effects (font (size 1.27 1.27)) hide)
    )
    (property "Datasheet" "" (at 194.691 66.5226 0)
      (effects (font (size 1.27 1.27)) hide)
    )
    (pin "1" (uuid 03a1dee8-744b-4248-9aef-a85a124b0a26))
    (instances
      (project "LoRa Dark Sky v0r0"
        (path "/3c811405-f5e1-448d-b8b8-eef19b0ae5a8"
          (reference "#PWR012") (unit 1)
        )
      )
    )
  )

  (symbol (lib_id "Device:R_Small") (at 203.2 90.9066 180) (unit 1)
    (in_bom yes) (on_board yes) (dnp no)
    (uuid 94889a7c-de9a-4c4b-9fbe-cfb82b110cd5)
    (property "Reference" "R1" (at 201.7014 92.075 0)
      (effects (font (size 1.27 1.27)) (justify left))
    )
    (property "Value" "10K" (at 201.7014 89.7636 0)
      (effects (font (size 1.27 1.27)) (justify left))
    )
    (property "Footprint" "Resistor_SMD:R_0603_1608Metric" (at 203.2 90.9066 0)
      (effects (font (size 1.27 1.27)) hide)
    )
    (property "Datasheet" "~" (at 203.2 90.9066 0)
      (effects (font (size 1.27 1.27)) hide)
    )
    (property "Digi-Key_PN" "RMCF0603FT10K0CT-ND" (at 203.2 90.9066 0)
      (effects (font (size 1.27 1.27)) hide)
    )
    (property "Desc" "RES 10K OHM 1% 1/10W 0603" (at 203.2 90.9066 0)
      (effects (font (size 1.27 1.27)) hide)
    )
    (property "Description" "RES 10K OHM 1% 1/10W 0603" (at 203.2 90.9066 0)
      (effects (font (size 1.27 1.27)) hide)
    )
    (pin "1" (uuid 483abfbd-7742-4878-9760-dbf1529f9661))
    (pin "2" (uuid 21abf384-0545-4d8d-9b78-f768caed8f91))
    (instances
      (project "Dark Sky v4r0"
        (path "/3934cdea-42c8-4ab1-b1be-2c4978ab08ae"
          (reference "R1") (unit 1)
        )
      )
      (project "LoRa Dark Sky v0r0"
        (path "/3c811405-f5e1-448d-b8b8-eef19b0ae5a8"
          (reference "R1") (unit 1)
        )
      )
    )
  )

  (symbol (lib_id "power:GND") (at 169.6212 102.3366 0) (unit 1)
    (in_bom yes) (on_board yes) (dnp no)
    (uuid 96264e02-ddc6-438c-a5fc-29704a3dfa95)
    (property "Reference" "#PWR02" (at 169.6212 108.6866 0)
      (effects (font (size 1.27 1.27)) hide)
    )
    (property "Value" "GND" (at 169.7482 106.7308 0)
      (effects (font (size 1.27 1.27)))
    )
    (property "Footprint" "" (at 169.6212 102.3366 0)
      (effects (font (size 1.27 1.27)) hide)
    )
    (property "Datasheet" "" (at 169.6212 102.3366 0)
      (effects (font (size 1.27 1.27)) hide)
    )
    (pin "1" (uuid 761fc393-81ee-4c63-9277-0244f0ff3fe4))
    (instances
      (project "LoRa Dark Sky v0r0"
        (path "/3c811405-f5e1-448d-b8b8-eef19b0ae5a8"
          (reference "#PWR02") (unit 1)
        )
      )
    )
  )

  (symbol (lib_id "power:GND") (at 373.634 76.9366 0) (unit 1)
    (in_bom yes) (on_board yes) (dnp no) (fields_autoplaced)
    (uuid d269183a-25cd-403c-bd49-7ca38dee7d27)
    (property "Reference" "#PWR023" (at 373.634 83.2866 0)
      (effects (font (size 1.27 1.27)) hide)
    )
    (property "Value" "GND" (at 373.634 81.4991 0)
      (effects (font (size 1.27 1.27)))
    )
    (property "Footprint" "" (at 373.634 76.9366 0)
      (effects (font (size 1.27 1.27)) hide)
    )
    (property "Datasheet" "" (at 373.634 76.9366 0)
      (effects (font (size 1.27 1.27)) hide)
    )
    (pin "1" (uuid 6f980222-2b34-4cdc-86e5-4e1a128dfe3c))
    (instances
      (project "Dark Sky v4r0"
        (path "/3934cdea-42c8-4ab1-b1be-2c4978ab08ae/497a2c1d-6da4-4127-a209-e810bb8750b1"
          (reference "#PWR023") (unit 1)
        )
      )
      (project "LoRa Dark Sky v0r0"
        (path "/3c811405-f5e1-448d-b8b8-eef19b0ae5a8"
          (reference "#PWR07") (unit 1)
        )
      )
    )
  )

  (symbol (lib_id "RAK3172:RAK3172") (at 73.66 50.8 0) (unit 1)
    (in_bom yes) (on_board yes) (dnp no) (fields_autoplaced)
    (uuid d4914d9a-8a40-4e5a-9014-5f4c5d016a5c)
    (property "Reference" "U1" (at 109.22 41.0263 0)
      (effects (font (size 1.524 1.524)))
    )
    (property "Value" "RAK3172-8-SM-I" (at 109.22 43.8591 0)
      (effects (font (size 1.524 1.524)))
    )
    (property "Footprint" "RAK3172:RAK3172_RAK" (at 73.66 50.8 0)
      (effects (font (size 1.27 1.27) italic) hide)
    )
    (property "Datasheet" "RAK3172" (at 73.66 50.8 0)
      (effects (font (size 1.27 1.27) italic) hide)
    )
    (property "Desc" "RAK3172-8-SM-I" (at 73.66 50.8 0)
      (effects (font (size 1.27 1.27)) hide)
    )
    (property "Description" "RAK3172-8-SM-I" (at 73.66 50.8 0)
      (effects (font (size 1.27 1.27)) hide)
    )
    (pin "1" (uuid fad9c910-722e-486f-84ce-e834580277f6))
    (pin "10" (uuid 36e9f2a4-5052-47bf-91ea-82373f6d64e7))
    (pin "11" (uuid 12774539-6f46-48ee-871e-f6df3353a089))
    (pin "12" (uuid 65167d3d-30aa-49d0-bfb1-e712fd55c199))
    (pin "13" (uuid 6e411b5d-3b99-4e4e-b14f-93b69b6ace25))
    (pin "14" (uuid 2f04ab4a-0f6e-4497-833a-af75489be4dc))
    (pin "15" (uuid 40c29a96-7ef9-4786-9a97-f152b3017233))
    (pin "16" (uuid 4b98ee18-e0a2-4f5d-bd98-73f809ac9d98))
    (pin "17" (uuid e4581adc-c993-48d7-8f51-85c6f4e42709))
    (pin "18" (uuid f8e03190-023a-412f-9c61-7b31bed1c181))
    (pin "19" (uuid ebeb69f7-7026-4ddb-b15b-9f81c431773c))
    (pin "2" (uuid 50d53f66-f130-4491-b729-3393eadb1253))
    (pin "20" (uuid 6de746de-dd35-4d78-b94d-bc91efcebbf3))
    (pin "21" (uuid 0f4e260c-47a6-4c2f-a031-31d334429ec8))
    (pin "22" (uuid 63cf1d2f-fc27-4239-8dbb-d49a74bfc131))
    (pin "23" (uuid 3d903cf7-a2a2-46b5-9b14-1b88afbf7bb5))
    (pin "24" (uuid 9af10b22-be11-4af7-9456-448c9f7e1ee7))
    (pin "25" (uuid 8bcc09e1-78d3-4e92-9032-4c542f176420))
    (pin "26" (uuid eb299242-c94f-4068-b9d6-043b7f6a3ed9))
    (pin "27" (uuid f461535b-4e6a-4774-a53e-9f6f8f744f96))
    (pin "28" (uuid 43428fe1-15a4-4cdd-a6ff-eddea69381c9))
    (pin "29" (uuid 55bfce95-3c7c-4d4a-bf25-5713e5dcf09f))
    (pin "3" (uuid a01102d0-5fac-4ee2-b8ef-176c54fe6524))
    (pin "30" (uuid ab11a5c0-9094-46b4-9864-c0693c75d3fc))
    (pin "31" (uuid 60ce315b-9abc-4510-8f7f-7e48f4c7ce9f))
    (pin "32" (uuid 97466c75-a977-44eb-a882-3a9e67898a05))
    (pin "4" (uuid 78a4ef3a-02e1-4881-94f0-6efc4f7a3848))
    (pin "5" (uuid d0ffddab-b1d0-4aa2-a752-5989b32d40cf))
    (pin "6" (uuid dd241d52-577b-4311-86db-0a9c3c131bf8))
    (pin "7" (uuid 83bd8ffa-d4be-4101-8819-49ae43ab2f1f))
    (pin "8" (uuid e88f34da-e891-4508-964f-f6c590a155ed))
    (pin "9" (uuid a13ac06b-a105-4884-bd8b-414dbc8dba57))
    (instances
      (project "LoRa Dark Sky v0r0"
        (path "/3c811405-f5e1-448d-b8b8-eef19b0ae5a8"
          (reference "U1") (unit 1)
        )
      )
    )
  )

  (symbol (lib_id "Connector_Generic:Conn_01x08") (at 203.2 53.34 0) (unit 1)
    (in_bom yes) (on_board yes) (dnp no) (fields_autoplaced)
    (uuid d4d6beb9-3437-47d4-83f2-932e2d6192b1)
    (property "Reference" "J2" (at 205.232 53.3979 0)
      (effects (font (size 1.27 1.27)) (justify left))
    )
    (property "Value" "Conn_01x08" (at 205.232 55.8221 0)
      (effects (font (size 1.27 1.27)) (justify left))
    )
    (property "Footprint" "Connector_PinHeader_2.54mm:PinHeader_1x08_P2.54mm_Vertical" (at 203.2 53.34 0)
      (effects (font (size 1.27 1.27)) hide)
    )
    (property "Datasheet" "~" (at 203.2 53.34 0)
      (effects (font (size 1.27 1.27)) hide)
    )
    (property "Digi-Key_PN" "DNP" (at 203.2 53.34 0)
      (effects (font (size 1.27 1.27)) hide)
    )
    (pin "1" (uuid 95655d55-2849-4188-8ea1-45995e1255f2))
    (pin "2" (uuid a9a5ebf4-0ca2-49e8-9a28-cf4d8ccea51d))
    (pin "3" (uuid c183e362-7712-415f-b5ec-b51409365ccc))
    (pin "4" (uuid 9238af37-50db-45c6-828d-d5856950a10d))
    (pin "5" (uuid 49e8d6fb-cb35-4d8a-8768-e24bb187101e))
    (pin "6" (uuid d47f759c-8024-4751-ad2e-e9d8795a3775))
    (pin "7" (uuid 80195ce2-0ee7-4188-b135-f35c375bfab8))
    (pin "8" (uuid 0409fcd1-b05b-467a-8e9d-fc65def9f144))
    (instances
      (project "LoRa Dark Sky v0r0"
        (path "/3c811405-f5e1-448d-b8b8-eef19b0ae5a8"
          (reference "J2") (unit 1)
        )
      )
    )
  )

  (symbol (lib_id "power:+3.3V") (at 373.634 60.4774 0) (unit 1)
    (in_bom yes) (on_board yes) (dnp no)
    (uuid dd0ee4b0-9e3a-4151-a8c5-480ae06f7000)
    (property "Reference" "#PWR022" (at 373.634 64.2874 0)
      (effects (font (size 1.27 1.27)) hide)
    )
    (property "Value" "+3.3V" (at 374.015 56.0832 0)
      (effects (font (size 1.27 1.27)))
    )
    (property "Footprint" "" (at 373.634 60.4774 0)
      (effects (font (size 1.27 1.27)) hide)
    )
    (property "Datasheet" "" (at 373.634 60.4774 0)
      (effects (font (size 1.27 1.27)) hide)
    )
    (pin "1" (uuid 812262e7-be49-4064-a1ae-6596c39e3499))
    (instances
      (project "Dark Sky v4r0"
        (path "/3934cdea-42c8-4ab1-b1be-2c4978ab08ae/497a2c1d-6da4-4127-a209-e810bb8750b1"
          (reference "#PWR022") (unit 1)
        )
      )
      (project "LoRa Dark Sky v0r0"
        (path "/3c811405-f5e1-448d-b8b8-eef19b0ae5a8"
          (reference "#PWR06") (unit 1)
        )
      )
    )
  )

  (symbol (lib_id "Device:CP") (at 269.0368 67.691 0) (unit 1)
    (in_bom yes) (on_board yes) (dnp no)
    (uuid e57ba9b0-7ff8-4235-b082-590d290d1170)
    (property "Reference" "C1" (at 272.034 66.5226 0)
      (effects (font (size 1.27 1.27)) (justify left))
    )
    (property "Value" "100uF 6V3" (at 272.034 68.834 0)
      (effects (font (size 1.27 1.27)) (justify left))
    )
    (property "Footprint" "Capacitor_Tantalum_SMD:CP_EIA-6032-28_Kemet-C" (at 270.002 71.501 0)
      (effects (font (size 1.27 1.27)) hide)
    )
    (property "Datasheet" "~" (at 269.0368 67.691 0)
      (effects (font (size 1.27 1.27)) hide)
    )
    (property "Digi-Key_PN" "399-8339-1-ND" (at 269.0368 67.691 0)
      (effects (font (size 1.27 1.27)) hide)
    )
    (property "Desc" "CAP TANT 100UF 20% 6.3V 2312" (at 269.0368 67.691 0)
      (effects (font (size 1.27 1.27)) hide)
    )
    (pin "1" (uuid 4c7d938d-9afb-4acc-a0c0-5d524deadc4e))
    (pin "2" (uuid 4d2628ba-c4b5-4107-8a90-13ba4eb717d2))
    (instances
      (project "LoRa Dark Sky v0r0"
        (path "/3c811405-f5e1-448d-b8b8-eef19b0ae5a8"
          (reference "C1") (unit 1)
        )
      )
    )
  )

  (symbol (lib_id "Device:C_Small") (at 303.2506 69.8246 0) (unit 1)
    (in_bom yes) (on_board yes) (dnp no)
    (uuid f5e44937-168f-40bb-9b78-60f1ecdd01f0)
    (property "Reference" "C7" (at 298.9072 68.3514 0)
      (effects (font (size 1.27 1.27)) (justify left))
    )
    (property "Value" "10uF" (at 298.0944 71.755 0)
      (effects (font (size 1.27 1.27)) (justify left))
    )
    (property "Footprint" "Capacitor_SMD:C_0603_1608Metric" (at 303.2506 69.8246 0)
      (effects (font (size 1.27 1.27)) hide)
    )
    (property "Datasheet" "~" (at 303.2506 69.8246 0)
      (effects (font (size 1.27 1.27)) hide)
    )
    (property "Description" "CAP CER 10UF 16V X5R 0603" (at 303.2506 69.8246 0)
      (effects (font (size 1.27 1.27)) hide)
    )
    (property "Digi-Key_PN" "490-12318-1-ND" (at 303.2506 69.8246 0)
      (effects (font (size 1.27 1.27)) hide)
    )
    (property "Desc" "CAP CER 10UF 16V X5R 0603" (at 303.2506 69.8246 0)
      (effects (font (size 1.27 1.27)) hide)
    )
    (pin "1" (uuid db38b55f-79b6-40d9-b8a3-080f26e95188))
    (pin "2" (uuid c4a573cd-64ae-485d-aeca-b575f42101f7))
    (instances
      (project "Dark Sky v4r0"
        (path "/3934cdea-42c8-4ab1-b1be-2c4978ab08ae/497a2c1d-6da4-4127-a209-e810bb8750b1"
          (reference "C7") (unit 1)
        )
      )
      (project "LoRa Dark Sky v0r0"
        (path "/3c811405-f5e1-448d-b8b8-eef19b0ae5a8"
          (reference "C2") (unit 1)
        )
      )
    )
  )

  (symbol (lib_id "power:+3.3V") (at 166.243 67.8942 0) (unit 1)
    (in_bom yes) (on_board yes) (dnp no)
    (uuid f6dc6005-6d4c-40ae-bf6e-067a3713e21c)
    (property "Reference" "#PWR022" (at 166.243 71.7042 0)
      (effects (font (size 1.27 1.27)) hide)
    )
    (property "Value" "+3.3V" (at 166.624 63.5 0)
      (effects (font (size 1.27 1.27)))
    )
    (property "Footprint" "" (at 166.243 67.8942 0)
      (effects (font (size 1.27 1.27)) hide)
    )
    (property "Datasheet" "" (at 166.243 67.8942 0)
      (effects (font (size 1.27 1.27)) hide)
    )
    (pin "1" (uuid 13b0ba32-9df6-4233-a531-0554c23798b3))
    (instances
      (project "Dark Sky v4r0"
        (path "/3934cdea-42c8-4ab1-b1be-2c4978ab08ae/497a2c1d-6da4-4127-a209-e810bb8750b1"
          (reference "#PWR022") (unit 1)
        )
      )
      (project "LoRa Dark Sky v0r0"
        (path "/3c811405-f5e1-448d-b8b8-eef19b0ae5a8"
          (reference "#PWR08") (unit 1)
        )
      )
    )
  )

  (sheet_instances
    (path "/" (page "1"))
  )
)
