%TF.GenerationSoftware,KiCad,Pcbnew,7.0.7*%
%TF.CreationDate,2024-08-12T11:48:07+02:00*%
%TF.ProjectId,Dark Sky v5r0,4461726b-2053-46b7-9920-763572302e6b,rev?*%
%TF.SameCoordinates,Original*%
%TF.FileFunction,Legend,Bot*%
%TF.FilePolarity,Positive*%
%FSLAX46Y46*%
G04 Gerber Fmt 4.6, Leading zero omitted, Abs format (unit mm)*
G04 Created by KiCad (PCBNEW 7.0.7) date 2024-08-12 11:48:07*
%MOMM*%
%LPD*%
G01*
G04 APERTURE LIST*
%ADD10C,0.150000*%
%ADD11C,0.250000*%
%ADD12C,0.100000*%
%ADD13C,0.120000*%
%ADD14C,0.127000*%
%ADD15C,0.010000*%
%ADD16C,0.200000*%
G04 APERTURE END LIST*
D10*
X74294047Y-78581009D02*
X74151190Y-78628628D01*
X74151190Y-78628628D02*
X74103571Y-78676247D01*
X74103571Y-78676247D02*
X74055952Y-78771485D01*
X74055952Y-78771485D02*
X74055952Y-78914342D01*
X74055952Y-78914342D02*
X74103571Y-79009580D01*
X74103571Y-79009580D02*
X74151190Y-79057200D01*
X74151190Y-79057200D02*
X74246428Y-79104819D01*
X74246428Y-79104819D02*
X74627380Y-79104819D01*
X74627380Y-79104819D02*
X74627380Y-78104819D01*
X74627380Y-78104819D02*
X74294047Y-78104819D01*
X74294047Y-78104819D02*
X74198809Y-78152438D01*
X74198809Y-78152438D02*
X74151190Y-78200057D01*
X74151190Y-78200057D02*
X74103571Y-78295295D01*
X74103571Y-78295295D02*
X74103571Y-78390533D01*
X74103571Y-78390533D02*
X74151190Y-78485771D01*
X74151190Y-78485771D02*
X74198809Y-78533390D01*
X74198809Y-78533390D02*
X74294047Y-78581009D01*
X74294047Y-78581009D02*
X74627380Y-78581009D01*
X73674999Y-78819104D02*
X73198809Y-78819104D01*
X73770237Y-79104819D02*
X73436904Y-78104819D01*
X73436904Y-78104819D02*
X73103571Y-79104819D01*
X72913094Y-78104819D02*
X72341666Y-78104819D01*
X72627380Y-79104819D02*
X72627380Y-78104819D01*
X72151189Y-78104819D02*
X71579761Y-78104819D01*
X71865475Y-79104819D02*
X71865475Y-78104819D01*
X67730951Y-56123866D02*
X66969047Y-56123866D01*
X67349999Y-56504819D02*
X67349999Y-55742914D01*
X87495238Y-88054819D02*
X87495238Y-87054819D01*
X87495238Y-87054819D02*
X87257143Y-87054819D01*
X87257143Y-87054819D02*
X87114286Y-87102438D01*
X87114286Y-87102438D02*
X87019048Y-87197676D01*
X87019048Y-87197676D02*
X86971429Y-87292914D01*
X86971429Y-87292914D02*
X86923810Y-87483390D01*
X86923810Y-87483390D02*
X86923810Y-87626247D01*
X86923810Y-87626247D02*
X86971429Y-87816723D01*
X86971429Y-87816723D02*
X87019048Y-87911961D01*
X87019048Y-87911961D02*
X87114286Y-88007200D01*
X87114286Y-88007200D02*
X87257143Y-88054819D01*
X87257143Y-88054819D02*
X87495238Y-88054819D01*
X86066667Y-88054819D02*
X86066667Y-87531009D01*
X86066667Y-87531009D02*
X86114286Y-87435771D01*
X86114286Y-87435771D02*
X86209524Y-87388152D01*
X86209524Y-87388152D02*
X86400000Y-87388152D01*
X86400000Y-87388152D02*
X86495238Y-87435771D01*
X86066667Y-88007200D02*
X86161905Y-88054819D01*
X86161905Y-88054819D02*
X86400000Y-88054819D01*
X86400000Y-88054819D02*
X86495238Y-88007200D01*
X86495238Y-88007200D02*
X86542857Y-87911961D01*
X86542857Y-87911961D02*
X86542857Y-87816723D01*
X86542857Y-87816723D02*
X86495238Y-87721485D01*
X86495238Y-87721485D02*
X86400000Y-87673866D01*
X86400000Y-87673866D02*
X86161905Y-87673866D01*
X86161905Y-87673866D02*
X86066667Y-87626247D01*
X85590476Y-88054819D02*
X85590476Y-87388152D01*
X85590476Y-87578628D02*
X85542857Y-87483390D01*
X85542857Y-87483390D02*
X85495238Y-87435771D01*
X85495238Y-87435771D02*
X85400000Y-87388152D01*
X85400000Y-87388152D02*
X85304762Y-87388152D01*
X84971428Y-88054819D02*
X84971428Y-87054819D01*
X84876190Y-87673866D02*
X84590476Y-88054819D01*
X84590476Y-87388152D02*
X84971428Y-87769104D01*
X83447618Y-88007200D02*
X83304761Y-88054819D01*
X83304761Y-88054819D02*
X83066666Y-88054819D01*
X83066666Y-88054819D02*
X82971428Y-88007200D01*
X82971428Y-88007200D02*
X82923809Y-87959580D01*
X82923809Y-87959580D02*
X82876190Y-87864342D01*
X82876190Y-87864342D02*
X82876190Y-87769104D01*
X82876190Y-87769104D02*
X82923809Y-87673866D01*
X82923809Y-87673866D02*
X82971428Y-87626247D01*
X82971428Y-87626247D02*
X83066666Y-87578628D01*
X83066666Y-87578628D02*
X83257142Y-87531009D01*
X83257142Y-87531009D02*
X83352380Y-87483390D01*
X83352380Y-87483390D02*
X83399999Y-87435771D01*
X83399999Y-87435771D02*
X83447618Y-87340533D01*
X83447618Y-87340533D02*
X83447618Y-87245295D01*
X83447618Y-87245295D02*
X83399999Y-87150057D01*
X83399999Y-87150057D02*
X83352380Y-87102438D01*
X83352380Y-87102438D02*
X83257142Y-87054819D01*
X83257142Y-87054819D02*
X83019047Y-87054819D01*
X83019047Y-87054819D02*
X82876190Y-87102438D01*
X82447618Y-88054819D02*
X82447618Y-87054819D01*
X82352380Y-87673866D02*
X82066666Y-88054819D01*
X82066666Y-87388152D02*
X82447618Y-87769104D01*
X81733332Y-87388152D02*
X81495237Y-88054819D01*
X81257142Y-87388152D02*
X81495237Y-88054819D01*
X81495237Y-88054819D02*
X81590475Y-88292914D01*
X81590475Y-88292914D02*
X81638094Y-88340533D01*
X81638094Y-88340533D02*
X81733332Y-88388152D01*
X80209522Y-87388152D02*
X79971427Y-88054819D01*
X79971427Y-88054819D02*
X79733332Y-87388152D01*
X78876189Y-87054819D02*
X79352379Y-87054819D01*
X79352379Y-87054819D02*
X79399998Y-87531009D01*
X79399998Y-87531009D02*
X79352379Y-87483390D01*
X79352379Y-87483390D02*
X79257141Y-87435771D01*
X79257141Y-87435771D02*
X79019046Y-87435771D01*
X79019046Y-87435771D02*
X78923808Y-87483390D01*
X78923808Y-87483390D02*
X78876189Y-87531009D01*
X78876189Y-87531009D02*
X78828570Y-87626247D01*
X78828570Y-87626247D02*
X78828570Y-87864342D01*
X78828570Y-87864342D02*
X78876189Y-87959580D01*
X78876189Y-87959580D02*
X78923808Y-88007200D01*
X78923808Y-88007200D02*
X79019046Y-88054819D01*
X79019046Y-88054819D02*
X79257141Y-88054819D01*
X79257141Y-88054819D02*
X79352379Y-88007200D01*
X79352379Y-88007200D02*
X79399998Y-87959580D01*
X78399998Y-88054819D02*
X78399998Y-87388152D01*
X78399998Y-87578628D02*
X78352379Y-87483390D01*
X78352379Y-87483390D02*
X78304760Y-87435771D01*
X78304760Y-87435771D02*
X78209522Y-87388152D01*
X78209522Y-87388152D02*
X78114284Y-87388152D01*
X77590474Y-87054819D02*
X77495236Y-87054819D01*
X77495236Y-87054819D02*
X77399998Y-87102438D01*
X77399998Y-87102438D02*
X77352379Y-87150057D01*
X77352379Y-87150057D02*
X77304760Y-87245295D01*
X77304760Y-87245295D02*
X77257141Y-87435771D01*
X77257141Y-87435771D02*
X77257141Y-87673866D01*
X77257141Y-87673866D02*
X77304760Y-87864342D01*
X77304760Y-87864342D02*
X77352379Y-87959580D01*
X77352379Y-87959580D02*
X77399998Y-88007200D01*
X77399998Y-88007200D02*
X77495236Y-88054819D01*
X77495236Y-88054819D02*
X77590474Y-88054819D01*
X77590474Y-88054819D02*
X77685712Y-88007200D01*
X77685712Y-88007200D02*
X77733331Y-87959580D01*
X77733331Y-87959580D02*
X77780950Y-87864342D01*
X77780950Y-87864342D02*
X77828569Y-87673866D01*
X77828569Y-87673866D02*
X77828569Y-87435771D01*
X77828569Y-87435771D02*
X77780950Y-87245295D01*
X77780950Y-87245295D02*
X77733331Y-87150057D01*
X77733331Y-87150057D02*
X77685712Y-87102438D01*
X77685712Y-87102438D02*
X77590474Y-87054819D01*
X75202381Y-56504819D02*
X75535714Y-56028628D01*
X75773809Y-56504819D02*
X75773809Y-55504819D01*
X75773809Y-55504819D02*
X75392857Y-55504819D01*
X75392857Y-55504819D02*
X75297619Y-55552438D01*
X75297619Y-55552438D02*
X75250000Y-55600057D01*
X75250000Y-55600057D02*
X75202381Y-55695295D01*
X75202381Y-55695295D02*
X75202381Y-55838152D01*
X75202381Y-55838152D02*
X75250000Y-55933390D01*
X75250000Y-55933390D02*
X75297619Y-55981009D01*
X75297619Y-55981009D02*
X75392857Y-56028628D01*
X75392857Y-56028628D02*
X75773809Y-56028628D01*
X74773809Y-55981009D02*
X74440476Y-55981009D01*
X74297619Y-56504819D02*
X74773809Y-56504819D01*
X74773809Y-56504819D02*
X74773809Y-55504819D01*
X74773809Y-55504819D02*
X74297619Y-55504819D01*
X73916666Y-56457200D02*
X73773809Y-56504819D01*
X73773809Y-56504819D02*
X73535714Y-56504819D01*
X73535714Y-56504819D02*
X73440476Y-56457200D01*
X73440476Y-56457200D02*
X73392857Y-56409580D01*
X73392857Y-56409580D02*
X73345238Y-56314342D01*
X73345238Y-56314342D02*
X73345238Y-56219104D01*
X73345238Y-56219104D02*
X73392857Y-56123866D01*
X73392857Y-56123866D02*
X73440476Y-56076247D01*
X73440476Y-56076247D02*
X73535714Y-56028628D01*
X73535714Y-56028628D02*
X73726190Y-55981009D01*
X73726190Y-55981009D02*
X73821428Y-55933390D01*
X73821428Y-55933390D02*
X73869047Y-55885771D01*
X73869047Y-55885771D02*
X73916666Y-55790533D01*
X73916666Y-55790533D02*
X73916666Y-55695295D01*
X73916666Y-55695295D02*
X73869047Y-55600057D01*
X73869047Y-55600057D02*
X73821428Y-55552438D01*
X73821428Y-55552438D02*
X73726190Y-55504819D01*
X73726190Y-55504819D02*
X73488095Y-55504819D01*
X73488095Y-55504819D02*
X73345238Y-55552438D01*
X72916666Y-55981009D02*
X72583333Y-55981009D01*
X72440476Y-56504819D02*
X72916666Y-56504819D01*
X72916666Y-56504819D02*
X72916666Y-55504819D01*
X72916666Y-55504819D02*
X72440476Y-55504819D01*
X72154761Y-55504819D02*
X71583333Y-55504819D01*
X71869047Y-56504819D02*
X71869047Y-55504819D01*
D11*
X98290476Y-63178904D02*
X97909524Y-64512238D01*
X97909524Y-64512238D02*
X97528571Y-63559857D01*
X97528571Y-63559857D02*
X97147619Y-64512238D01*
X97147619Y-64512238D02*
X96766667Y-63178904D01*
X96195238Y-63178904D02*
X95814286Y-64512238D01*
X95814286Y-64512238D02*
X95433333Y-63559857D01*
X95433333Y-63559857D02*
X95052381Y-64512238D01*
X95052381Y-64512238D02*
X94671429Y-63178904D01*
X94100000Y-63178904D02*
X93719048Y-64512238D01*
X93719048Y-64512238D02*
X93338095Y-63559857D01*
X93338095Y-63559857D02*
X92957143Y-64512238D01*
X92957143Y-64512238D02*
X92576191Y-63178904D01*
X91814286Y-64321761D02*
X91719048Y-64417000D01*
X91719048Y-64417000D02*
X91814286Y-64512238D01*
X91814286Y-64512238D02*
X91909524Y-64417000D01*
X91909524Y-64417000D02*
X91814286Y-64321761D01*
X91814286Y-64321761D02*
X91814286Y-64512238D01*
X90957143Y-64417000D02*
X90766667Y-64512238D01*
X90766667Y-64512238D02*
X90385715Y-64512238D01*
X90385715Y-64512238D02*
X90195238Y-64417000D01*
X90195238Y-64417000D02*
X90100000Y-64226523D01*
X90100000Y-64226523D02*
X90100000Y-64131285D01*
X90100000Y-64131285D02*
X90195238Y-63940809D01*
X90195238Y-63940809D02*
X90385715Y-63845571D01*
X90385715Y-63845571D02*
X90671429Y-63845571D01*
X90671429Y-63845571D02*
X90861905Y-63750333D01*
X90861905Y-63750333D02*
X90957143Y-63559857D01*
X90957143Y-63559857D02*
X90957143Y-63464619D01*
X90957143Y-63464619D02*
X90861905Y-63274142D01*
X90861905Y-63274142D02*
X90671429Y-63178904D01*
X90671429Y-63178904D02*
X90385715Y-63178904D01*
X90385715Y-63178904D02*
X90195238Y-63274142D01*
X88385714Y-64417000D02*
X88576190Y-64512238D01*
X88576190Y-64512238D02*
X88957143Y-64512238D01*
X88957143Y-64512238D02*
X89147619Y-64417000D01*
X89147619Y-64417000D02*
X89242857Y-64321761D01*
X89242857Y-64321761D02*
X89338095Y-64131285D01*
X89338095Y-64131285D02*
X89338095Y-63559857D01*
X89338095Y-63559857D02*
X89242857Y-63369380D01*
X89242857Y-63369380D02*
X89147619Y-63274142D01*
X89147619Y-63274142D02*
X88957143Y-63178904D01*
X88957143Y-63178904D02*
X88576190Y-63178904D01*
X88576190Y-63178904D02*
X88385714Y-63274142D01*
X87528571Y-64512238D02*
X87528571Y-63178904D01*
X87528571Y-63559857D02*
X87433333Y-63369380D01*
X87433333Y-63369380D02*
X87338095Y-63274142D01*
X87338095Y-63274142D02*
X87147619Y-63178904D01*
X87147619Y-63178904D02*
X86957142Y-63178904D01*
X86004762Y-64512238D02*
X86195238Y-64417000D01*
X86195238Y-64417000D02*
X86290476Y-64321761D01*
X86290476Y-64321761D02*
X86385714Y-64131285D01*
X86385714Y-64131285D02*
X86385714Y-63559857D01*
X86385714Y-63559857D02*
X86290476Y-63369380D01*
X86290476Y-63369380D02*
X86195238Y-63274142D01*
X86195238Y-63274142D02*
X86004762Y-63178904D01*
X86004762Y-63178904D02*
X85719047Y-63178904D01*
X85719047Y-63178904D02*
X85528571Y-63274142D01*
X85528571Y-63274142D02*
X85433333Y-63369380D01*
X85433333Y-63369380D02*
X85338095Y-63559857D01*
X85338095Y-63559857D02*
X85338095Y-64131285D01*
X85338095Y-64131285D02*
X85433333Y-64321761D01*
X85433333Y-64321761D02*
X85528571Y-64417000D01*
X85528571Y-64417000D02*
X85719047Y-64512238D01*
X85719047Y-64512238D02*
X86004762Y-64512238D01*
X84480952Y-64512238D02*
X84480952Y-62512238D01*
X84480952Y-63274142D02*
X84290476Y-63178904D01*
X84290476Y-63178904D02*
X83909523Y-63178904D01*
X83909523Y-63178904D02*
X83719047Y-63274142D01*
X83719047Y-63274142D02*
X83623809Y-63369380D01*
X83623809Y-63369380D02*
X83528571Y-63559857D01*
X83528571Y-63559857D02*
X83528571Y-64131285D01*
X83528571Y-64131285D02*
X83623809Y-64321761D01*
X83623809Y-64321761D02*
X83719047Y-64417000D01*
X83719047Y-64417000D02*
X83909523Y-64512238D01*
X83909523Y-64512238D02*
X84290476Y-64512238D01*
X84290476Y-64512238D02*
X84480952Y-64417000D01*
X82385714Y-64512238D02*
X82576190Y-64417000D01*
X82576190Y-64417000D02*
X82671428Y-64321761D01*
X82671428Y-64321761D02*
X82766666Y-64131285D01*
X82766666Y-64131285D02*
X82766666Y-63559857D01*
X82766666Y-63559857D02*
X82671428Y-63369380D01*
X82671428Y-63369380D02*
X82576190Y-63274142D01*
X82576190Y-63274142D02*
X82385714Y-63178904D01*
X82385714Y-63178904D02*
X82099999Y-63178904D01*
X82099999Y-63178904D02*
X81909523Y-63274142D01*
X81909523Y-63274142D02*
X81814285Y-63369380D01*
X81814285Y-63369380D02*
X81719047Y-63559857D01*
X81719047Y-63559857D02*
X81719047Y-64131285D01*
X81719047Y-64131285D02*
X81814285Y-64321761D01*
X81814285Y-64321761D02*
X81909523Y-64417000D01*
X81909523Y-64417000D02*
X82099999Y-64512238D01*
X82099999Y-64512238D02*
X82385714Y-64512238D01*
X81147618Y-63178904D02*
X80385714Y-63178904D01*
X80861904Y-62512238D02*
X80861904Y-64226523D01*
X80861904Y-64226523D02*
X80766666Y-64417000D01*
X80766666Y-64417000D02*
X80576190Y-64512238D01*
X80576190Y-64512238D02*
X80385714Y-64512238D01*
X79719047Y-64512238D02*
X79719047Y-63178904D01*
X79719047Y-62512238D02*
X79814285Y-62607476D01*
X79814285Y-62607476D02*
X79719047Y-62702714D01*
X79719047Y-62702714D02*
X79623809Y-62607476D01*
X79623809Y-62607476D02*
X79719047Y-62512238D01*
X79719047Y-62512238D02*
X79719047Y-62702714D01*
X77909523Y-64417000D02*
X78099999Y-64512238D01*
X78099999Y-64512238D02*
X78480952Y-64512238D01*
X78480952Y-64512238D02*
X78671428Y-64417000D01*
X78671428Y-64417000D02*
X78766666Y-64321761D01*
X78766666Y-64321761D02*
X78861904Y-64131285D01*
X78861904Y-64131285D02*
X78861904Y-63559857D01*
X78861904Y-63559857D02*
X78766666Y-63369380D01*
X78766666Y-63369380D02*
X78671428Y-63274142D01*
X78671428Y-63274142D02*
X78480952Y-63178904D01*
X78480952Y-63178904D02*
X78099999Y-63178904D01*
X78099999Y-63178904D02*
X77909523Y-63274142D01*
X77147618Y-64417000D02*
X76957142Y-64512238D01*
X76957142Y-64512238D02*
X76576190Y-64512238D01*
X76576190Y-64512238D02*
X76385713Y-64417000D01*
X76385713Y-64417000D02*
X76290475Y-64226523D01*
X76290475Y-64226523D02*
X76290475Y-64131285D01*
X76290475Y-64131285D02*
X76385713Y-63940809D01*
X76385713Y-63940809D02*
X76576190Y-63845571D01*
X76576190Y-63845571D02*
X76861904Y-63845571D01*
X76861904Y-63845571D02*
X77052380Y-63750333D01*
X77052380Y-63750333D02*
X77147618Y-63559857D01*
X77147618Y-63559857D02*
X77147618Y-63464619D01*
X77147618Y-63464619D02*
X77052380Y-63274142D01*
X77052380Y-63274142D02*
X76861904Y-63178904D01*
X76861904Y-63178904D02*
X76576190Y-63178904D01*
X76576190Y-63178904D02*
X76385713Y-63274142D01*
X75433332Y-64321761D02*
X75338094Y-64417000D01*
X75338094Y-64417000D02*
X75433332Y-64512238D01*
X75433332Y-64512238D02*
X75528570Y-64417000D01*
X75528570Y-64417000D02*
X75433332Y-64321761D01*
X75433332Y-64321761D02*
X75433332Y-64512238D01*
X73719046Y-64417000D02*
X73909522Y-64512238D01*
X73909522Y-64512238D02*
X74290475Y-64512238D01*
X74290475Y-64512238D02*
X74480951Y-64417000D01*
X74480951Y-64417000D02*
X74576189Y-64226523D01*
X74576189Y-64226523D02*
X74576189Y-63464619D01*
X74576189Y-63464619D02*
X74480951Y-63274142D01*
X74480951Y-63274142D02*
X74290475Y-63178904D01*
X74290475Y-63178904D02*
X73909522Y-63178904D01*
X73909522Y-63178904D02*
X73719046Y-63274142D01*
X73719046Y-63274142D02*
X73623808Y-63464619D01*
X73623808Y-63464619D02*
X73623808Y-63655095D01*
X73623808Y-63655095D02*
X74576189Y-63845571D01*
X72861903Y-64417000D02*
X72671427Y-64512238D01*
X72671427Y-64512238D02*
X72290475Y-64512238D01*
X72290475Y-64512238D02*
X72099998Y-64417000D01*
X72099998Y-64417000D02*
X72004760Y-64226523D01*
X72004760Y-64226523D02*
X72004760Y-64131285D01*
X72004760Y-64131285D02*
X72099998Y-63940809D01*
X72099998Y-63940809D02*
X72290475Y-63845571D01*
X72290475Y-63845571D02*
X72576189Y-63845571D01*
X72576189Y-63845571D02*
X72766665Y-63750333D01*
X72766665Y-63750333D02*
X72861903Y-63559857D01*
X72861903Y-63559857D02*
X72861903Y-63464619D01*
X72861903Y-63464619D02*
X72766665Y-63274142D01*
X72766665Y-63274142D02*
X72576189Y-63178904D01*
X72576189Y-63178904D02*
X72290475Y-63178904D01*
X72290475Y-63178904D02*
X72099998Y-63274142D01*
D10*
X69530951Y-82223866D02*
X68769047Y-82223866D01*
X69149999Y-82604819D02*
X69149999Y-81842914D01*
X69530951Y-84748866D02*
X68769047Y-84748866D01*
D12*
X65983332Y-83889895D02*
X66249999Y-83508942D01*
X66440475Y-83889895D02*
X66440475Y-83089895D01*
X66440475Y-83089895D02*
X66135713Y-83089895D01*
X66135713Y-83089895D02*
X66059523Y-83127990D01*
X66059523Y-83127990D02*
X66021428Y-83166085D01*
X66021428Y-83166085D02*
X65983332Y-83242276D01*
X65983332Y-83242276D02*
X65983332Y-83356561D01*
X65983332Y-83356561D02*
X66021428Y-83432752D01*
X66021428Y-83432752D02*
X66059523Y-83470847D01*
X66059523Y-83470847D02*
X66135713Y-83508942D01*
X66135713Y-83508942D02*
X66440475Y-83508942D01*
X65716666Y-83089895D02*
X65183332Y-83889895D01*
X65183332Y-83089895D02*
X65716666Y-83889895D01*
X66764285Y-88839895D02*
X66764285Y-88039895D01*
X66764285Y-88039895D02*
X66573809Y-88039895D01*
X66573809Y-88039895D02*
X66459523Y-88077990D01*
X66459523Y-88077990D02*
X66383333Y-88154180D01*
X66383333Y-88154180D02*
X66345238Y-88230371D01*
X66345238Y-88230371D02*
X66307142Y-88382752D01*
X66307142Y-88382752D02*
X66307142Y-88497038D01*
X66307142Y-88497038D02*
X66345238Y-88649419D01*
X66345238Y-88649419D02*
X66383333Y-88725609D01*
X66383333Y-88725609D02*
X66459523Y-88801800D01*
X66459523Y-88801800D02*
X66573809Y-88839895D01*
X66573809Y-88839895D02*
X66764285Y-88839895D01*
X66078571Y-88039895D02*
X65621428Y-88039895D01*
X65850000Y-88839895D02*
X65850000Y-88039895D01*
X64897618Y-88839895D02*
X65164285Y-88458942D01*
X65354761Y-88839895D02*
X65354761Y-88039895D01*
X65354761Y-88039895D02*
X65049999Y-88039895D01*
X65049999Y-88039895D02*
X64973809Y-88077990D01*
X64973809Y-88077990D02*
X64935714Y-88116085D01*
X64935714Y-88116085D02*
X64897618Y-88192276D01*
X64897618Y-88192276D02*
X64897618Y-88306561D01*
X64897618Y-88306561D02*
X64935714Y-88382752D01*
X64935714Y-88382752D02*
X64973809Y-88420847D01*
X64973809Y-88420847D02*
X65049999Y-88458942D01*
X65049999Y-88458942D02*
X65354761Y-88458942D01*
D10*
X65467856Y-62482200D02*
X65324999Y-62529819D01*
X65324999Y-62529819D02*
X65086904Y-62529819D01*
X65086904Y-62529819D02*
X64991666Y-62482200D01*
X64991666Y-62482200D02*
X64944047Y-62434580D01*
X64944047Y-62434580D02*
X64896428Y-62339342D01*
X64896428Y-62339342D02*
X64896428Y-62244104D01*
X64896428Y-62244104D02*
X64944047Y-62148866D01*
X64944047Y-62148866D02*
X64991666Y-62101247D01*
X64991666Y-62101247D02*
X65086904Y-62053628D01*
X65086904Y-62053628D02*
X65277380Y-62006009D01*
X65277380Y-62006009D02*
X65372618Y-61958390D01*
X65372618Y-61958390D02*
X65420237Y-61910771D01*
X65420237Y-61910771D02*
X65467856Y-61815533D01*
X65467856Y-61815533D02*
X65467856Y-61720295D01*
X65467856Y-61720295D02*
X65420237Y-61625057D01*
X65420237Y-61625057D02*
X65372618Y-61577438D01*
X65372618Y-61577438D02*
X65277380Y-61529819D01*
X65277380Y-61529819D02*
X65039285Y-61529819D01*
X65039285Y-61529819D02*
X64896428Y-61577438D01*
X64277380Y-61529819D02*
X64086904Y-61529819D01*
X64086904Y-61529819D02*
X63991666Y-61577438D01*
X63991666Y-61577438D02*
X63896428Y-61672676D01*
X63896428Y-61672676D02*
X63848809Y-61863152D01*
X63848809Y-61863152D02*
X63848809Y-62196485D01*
X63848809Y-62196485D02*
X63896428Y-62386961D01*
X63896428Y-62386961D02*
X63991666Y-62482200D01*
X63991666Y-62482200D02*
X64086904Y-62529819D01*
X64086904Y-62529819D02*
X64277380Y-62529819D01*
X64277380Y-62529819D02*
X64372618Y-62482200D01*
X64372618Y-62482200D02*
X64467856Y-62386961D01*
X64467856Y-62386961D02*
X64515475Y-62196485D01*
X64515475Y-62196485D02*
X64515475Y-61863152D01*
X64515475Y-61863152D02*
X64467856Y-61672676D01*
X64467856Y-61672676D02*
X64372618Y-61577438D01*
X64372618Y-61577438D02*
X64277380Y-61529819D01*
X62944047Y-62529819D02*
X63420237Y-62529819D01*
X63420237Y-62529819D02*
X63420237Y-61529819D01*
X62658332Y-62244104D02*
X62182142Y-62244104D01*
X62753570Y-62529819D02*
X62420237Y-61529819D01*
X62420237Y-61529819D02*
X62086904Y-62529819D01*
X61182142Y-62529819D02*
X61515475Y-62053628D01*
X61753570Y-62529819D02*
X61753570Y-61529819D01*
X61753570Y-61529819D02*
X61372618Y-61529819D01*
X61372618Y-61529819D02*
X61277380Y-61577438D01*
X61277380Y-61577438D02*
X61229761Y-61625057D01*
X61229761Y-61625057D02*
X61182142Y-61720295D01*
X61182142Y-61720295D02*
X61182142Y-61863152D01*
X61182142Y-61863152D02*
X61229761Y-61958390D01*
X61229761Y-61958390D02*
X61277380Y-62006009D01*
X61277380Y-62006009D02*
X61372618Y-62053628D01*
X61372618Y-62053628D02*
X61753570Y-62053628D01*
X75314285Y-45504819D02*
X75314285Y-46314342D01*
X75314285Y-46314342D02*
X75266666Y-46409580D01*
X75266666Y-46409580D02*
X75219047Y-46457200D01*
X75219047Y-46457200D02*
X75123809Y-46504819D01*
X75123809Y-46504819D02*
X74933333Y-46504819D01*
X74933333Y-46504819D02*
X74838095Y-46457200D01*
X74838095Y-46457200D02*
X74790476Y-46409580D01*
X74790476Y-46409580D02*
X74742857Y-46314342D01*
X74742857Y-46314342D02*
X74742857Y-45504819D01*
X74314285Y-46457200D02*
X74171428Y-46504819D01*
X74171428Y-46504819D02*
X73933333Y-46504819D01*
X73933333Y-46504819D02*
X73838095Y-46457200D01*
X73838095Y-46457200D02*
X73790476Y-46409580D01*
X73790476Y-46409580D02*
X73742857Y-46314342D01*
X73742857Y-46314342D02*
X73742857Y-46219104D01*
X73742857Y-46219104D02*
X73790476Y-46123866D01*
X73790476Y-46123866D02*
X73838095Y-46076247D01*
X73838095Y-46076247D02*
X73933333Y-46028628D01*
X73933333Y-46028628D02*
X74123809Y-45981009D01*
X74123809Y-45981009D02*
X74219047Y-45933390D01*
X74219047Y-45933390D02*
X74266666Y-45885771D01*
X74266666Y-45885771D02*
X74314285Y-45790533D01*
X74314285Y-45790533D02*
X74314285Y-45695295D01*
X74314285Y-45695295D02*
X74266666Y-45600057D01*
X74266666Y-45600057D02*
X74219047Y-45552438D01*
X74219047Y-45552438D02*
X74123809Y-45504819D01*
X74123809Y-45504819D02*
X73885714Y-45504819D01*
X73885714Y-45504819D02*
X73742857Y-45552438D01*
X73314285Y-45981009D02*
X72980952Y-45981009D01*
X72838095Y-46504819D02*
X73314285Y-46504819D01*
X73314285Y-46504819D02*
X73314285Y-45504819D01*
X73314285Y-45504819D02*
X72838095Y-45504819D01*
X71838095Y-46504819D02*
X72171428Y-46028628D01*
X72409523Y-46504819D02*
X72409523Y-45504819D01*
X72409523Y-45504819D02*
X72028571Y-45504819D01*
X72028571Y-45504819D02*
X71933333Y-45552438D01*
X71933333Y-45552438D02*
X71885714Y-45600057D01*
X71885714Y-45600057D02*
X71838095Y-45695295D01*
X71838095Y-45695295D02*
X71838095Y-45838152D01*
X71838095Y-45838152D02*
X71885714Y-45933390D01*
X71885714Y-45933390D02*
X71933333Y-45981009D01*
X71933333Y-45981009D02*
X72028571Y-46028628D01*
X72028571Y-46028628D02*
X72409523Y-46028628D01*
D12*
X66459523Y-85389895D02*
X66002380Y-85389895D01*
X66230952Y-86189895D02*
X66230952Y-85389895D01*
X65811904Y-85389895D02*
X65278570Y-86189895D01*
X65278570Y-85389895D02*
X65811904Y-86189895D01*
X66288094Y-78714895D02*
X66554761Y-78333942D01*
X66745237Y-78714895D02*
X66745237Y-77914895D01*
X66745237Y-77914895D02*
X66440475Y-77914895D01*
X66440475Y-77914895D02*
X66364285Y-77952990D01*
X66364285Y-77952990D02*
X66326190Y-77991085D01*
X66326190Y-77991085D02*
X66288094Y-78067276D01*
X66288094Y-78067276D02*
X66288094Y-78181561D01*
X66288094Y-78181561D02*
X66326190Y-78257752D01*
X66326190Y-78257752D02*
X66364285Y-78295847D01*
X66364285Y-78295847D02*
X66440475Y-78333942D01*
X66440475Y-78333942D02*
X66745237Y-78333942D01*
X66059523Y-77914895D02*
X65602380Y-77914895D01*
X65830952Y-78714895D02*
X65830952Y-77914895D01*
X65373809Y-78676800D02*
X65259523Y-78714895D01*
X65259523Y-78714895D02*
X65069047Y-78714895D01*
X65069047Y-78714895D02*
X64992856Y-78676800D01*
X64992856Y-78676800D02*
X64954761Y-78638704D01*
X64954761Y-78638704D02*
X64916666Y-78562514D01*
X64916666Y-78562514D02*
X64916666Y-78486323D01*
X64916666Y-78486323D02*
X64954761Y-78410133D01*
X64954761Y-78410133D02*
X64992856Y-78372038D01*
X64992856Y-78372038D02*
X65069047Y-78333942D01*
X65069047Y-78333942D02*
X65221428Y-78295847D01*
X65221428Y-78295847D02*
X65297618Y-78257752D01*
X65297618Y-78257752D02*
X65335713Y-78219657D01*
X65335713Y-78219657D02*
X65373809Y-78143466D01*
X65373809Y-78143466D02*
X65373809Y-78067276D01*
X65373809Y-78067276D02*
X65335713Y-77991085D01*
X65335713Y-77991085D02*
X65297618Y-77952990D01*
X65297618Y-77952990D02*
X65221428Y-77914895D01*
X65221428Y-77914895D02*
X65030951Y-77914895D01*
X65030951Y-77914895D02*
X64916666Y-77952990D01*
X66459523Y-75227990D02*
X66535713Y-75189895D01*
X66535713Y-75189895D02*
X66649999Y-75189895D01*
X66649999Y-75189895D02*
X66764285Y-75227990D01*
X66764285Y-75227990D02*
X66840475Y-75304180D01*
X66840475Y-75304180D02*
X66878570Y-75380371D01*
X66878570Y-75380371D02*
X66916666Y-75532752D01*
X66916666Y-75532752D02*
X66916666Y-75647038D01*
X66916666Y-75647038D02*
X66878570Y-75799419D01*
X66878570Y-75799419D02*
X66840475Y-75875609D01*
X66840475Y-75875609D02*
X66764285Y-75951800D01*
X66764285Y-75951800D02*
X66649999Y-75989895D01*
X66649999Y-75989895D02*
X66573808Y-75989895D01*
X66573808Y-75989895D02*
X66459523Y-75951800D01*
X66459523Y-75951800D02*
X66421427Y-75913704D01*
X66421427Y-75913704D02*
X66421427Y-75647038D01*
X66421427Y-75647038D02*
X66573808Y-75647038D01*
X66078570Y-75989895D02*
X66078570Y-75189895D01*
X66078570Y-75189895D02*
X65621427Y-75989895D01*
X65621427Y-75989895D02*
X65621427Y-75189895D01*
X65240475Y-75989895D02*
X65240475Y-75189895D01*
X65240475Y-75189895D02*
X65049999Y-75189895D01*
X65049999Y-75189895D02*
X64935713Y-75227990D01*
X64935713Y-75227990D02*
X64859523Y-75304180D01*
X64859523Y-75304180D02*
X64821428Y-75380371D01*
X64821428Y-75380371D02*
X64783332Y-75532752D01*
X64783332Y-75532752D02*
X64783332Y-75647038D01*
X64783332Y-75647038D02*
X64821428Y-75799419D01*
X64821428Y-75799419D02*
X64859523Y-75875609D01*
X64859523Y-75875609D02*
X64935713Y-75951800D01*
X64935713Y-75951800D02*
X65049999Y-75989895D01*
X65049999Y-75989895D02*
X65240475Y-75989895D01*
D10*
X67730951Y-58673866D02*
X66969047Y-58673866D01*
X105342800Y-79083332D02*
X105295180Y-78940475D01*
X105295180Y-78940475D02*
X105295180Y-78702380D01*
X105295180Y-78702380D02*
X105342800Y-78607142D01*
X105342800Y-78607142D02*
X105390419Y-78559523D01*
X105390419Y-78559523D02*
X105485657Y-78511904D01*
X105485657Y-78511904D02*
X105580895Y-78511904D01*
X105580895Y-78511904D02*
X105676133Y-78559523D01*
X105676133Y-78559523D02*
X105723752Y-78607142D01*
X105723752Y-78607142D02*
X105771371Y-78702380D01*
X105771371Y-78702380D02*
X105818990Y-78892856D01*
X105818990Y-78892856D02*
X105866609Y-78988094D01*
X105866609Y-78988094D02*
X105914228Y-79035713D01*
X105914228Y-79035713D02*
X106009466Y-79083332D01*
X106009466Y-79083332D02*
X106104704Y-79083332D01*
X106104704Y-79083332D02*
X106199942Y-79035713D01*
X106199942Y-79035713D02*
X106247561Y-78988094D01*
X106247561Y-78988094D02*
X106295180Y-78892856D01*
X106295180Y-78892856D02*
X106295180Y-78654761D01*
X106295180Y-78654761D02*
X106247561Y-78511904D01*
X106295180Y-78178570D02*
X105295180Y-77940475D01*
X105295180Y-77940475D02*
X106009466Y-77749999D01*
X106009466Y-77749999D02*
X105295180Y-77559523D01*
X105295180Y-77559523D02*
X106295180Y-77321428D01*
X106199942Y-76988094D02*
X106247561Y-76940475D01*
X106247561Y-76940475D02*
X106295180Y-76845237D01*
X106295180Y-76845237D02*
X106295180Y-76607142D01*
X106295180Y-76607142D02*
X106247561Y-76511904D01*
X106247561Y-76511904D02*
X106199942Y-76464285D01*
X106199942Y-76464285D02*
X106104704Y-76416666D01*
X106104704Y-76416666D02*
X106009466Y-76416666D01*
X106009466Y-76416666D02*
X105866609Y-76464285D01*
X105866609Y-76464285D02*
X105295180Y-77035713D01*
X105295180Y-77035713D02*
X105295180Y-76416666D01*
X63133333Y-72824819D02*
X63133333Y-73539104D01*
X63133333Y-73539104D02*
X63180952Y-73681961D01*
X63180952Y-73681961D02*
X63276190Y-73777200D01*
X63276190Y-73777200D02*
X63419047Y-73824819D01*
X63419047Y-73824819D02*
X63514285Y-73824819D01*
X62133333Y-73824819D02*
X62704761Y-73824819D01*
X62419047Y-73824819D02*
X62419047Y-72824819D01*
X62419047Y-72824819D02*
X62514285Y-72967676D01*
X62514285Y-72967676D02*
X62609523Y-73062914D01*
X62609523Y-73062914D02*
X62704761Y-73110533D01*
X73979819Y-83216666D02*
X74694104Y-83216666D01*
X74694104Y-83216666D02*
X74836961Y-83169047D01*
X74836961Y-83169047D02*
X74932200Y-83073809D01*
X74932200Y-83073809D02*
X74979819Y-82930952D01*
X74979819Y-82930952D02*
X74979819Y-82835714D01*
X73979819Y-84169047D02*
X73979819Y-83692857D01*
X73979819Y-83692857D02*
X74456009Y-83645238D01*
X74456009Y-83645238D02*
X74408390Y-83692857D01*
X74408390Y-83692857D02*
X74360771Y-83788095D01*
X74360771Y-83788095D02*
X74360771Y-84026190D01*
X74360771Y-84026190D02*
X74408390Y-84121428D01*
X74408390Y-84121428D02*
X74456009Y-84169047D01*
X74456009Y-84169047D02*
X74551247Y-84216666D01*
X74551247Y-84216666D02*
X74789342Y-84216666D01*
X74789342Y-84216666D02*
X74884580Y-84169047D01*
X74884580Y-84169047D02*
X74932200Y-84121428D01*
X74932200Y-84121428D02*
X74979819Y-84026190D01*
X74979819Y-84026190D02*
X74979819Y-83788095D01*
X74979819Y-83788095D02*
X74932200Y-83692857D01*
X74932200Y-83692857D02*
X74884580Y-83645238D01*
X71233332Y-53807200D02*
X71090475Y-53854819D01*
X71090475Y-53854819D02*
X70852380Y-53854819D01*
X70852380Y-53854819D02*
X70757142Y-53807200D01*
X70757142Y-53807200D02*
X70709523Y-53759580D01*
X70709523Y-53759580D02*
X70661904Y-53664342D01*
X70661904Y-53664342D02*
X70661904Y-53569104D01*
X70661904Y-53569104D02*
X70709523Y-53473866D01*
X70709523Y-53473866D02*
X70757142Y-53426247D01*
X70757142Y-53426247D02*
X70852380Y-53378628D01*
X70852380Y-53378628D02*
X71042856Y-53331009D01*
X71042856Y-53331009D02*
X71138094Y-53283390D01*
X71138094Y-53283390D02*
X71185713Y-53235771D01*
X71185713Y-53235771D02*
X71233332Y-53140533D01*
X71233332Y-53140533D02*
X71233332Y-53045295D01*
X71233332Y-53045295D02*
X71185713Y-52950057D01*
X71185713Y-52950057D02*
X71138094Y-52902438D01*
X71138094Y-52902438D02*
X71042856Y-52854819D01*
X71042856Y-52854819D02*
X70804761Y-52854819D01*
X70804761Y-52854819D02*
X70661904Y-52902438D01*
X70328570Y-52854819D02*
X70090475Y-53854819D01*
X70090475Y-53854819D02*
X69899999Y-53140533D01*
X69899999Y-53140533D02*
X69709523Y-53854819D01*
X69709523Y-53854819D02*
X69471428Y-52854819D01*
X68566666Y-53854819D02*
X69138094Y-53854819D01*
X68852380Y-53854819D02*
X68852380Y-52854819D01*
X68852380Y-52854819D02*
X68947618Y-52997676D01*
X68947618Y-52997676D02*
X69042856Y-53092914D01*
X69042856Y-53092914D02*
X69138094Y-53140533D01*
X87046009Y-51944047D02*
X87093628Y-52086904D01*
X87093628Y-52086904D02*
X87141247Y-52134523D01*
X87141247Y-52134523D02*
X87236485Y-52182142D01*
X87236485Y-52182142D02*
X87379342Y-52182142D01*
X87379342Y-52182142D02*
X87474580Y-52134523D01*
X87474580Y-52134523D02*
X87522200Y-52086904D01*
X87522200Y-52086904D02*
X87569819Y-51991666D01*
X87569819Y-51991666D02*
X87569819Y-51610714D01*
X87569819Y-51610714D02*
X86569819Y-51610714D01*
X86569819Y-51610714D02*
X86569819Y-51944047D01*
X86569819Y-51944047D02*
X86617438Y-52039285D01*
X86617438Y-52039285D02*
X86665057Y-52086904D01*
X86665057Y-52086904D02*
X86760295Y-52134523D01*
X86760295Y-52134523D02*
X86855533Y-52134523D01*
X86855533Y-52134523D02*
X86950771Y-52086904D01*
X86950771Y-52086904D02*
X86998390Y-52039285D01*
X86998390Y-52039285D02*
X87046009Y-51944047D01*
X87046009Y-51944047D02*
X87046009Y-51610714D01*
X86569819Y-52515476D02*
X86569819Y-53182142D01*
X86569819Y-53182142D02*
X87569819Y-52515476D01*
X87569819Y-52515476D02*
X87569819Y-53182142D01*
X87569819Y-54086904D02*
X87569819Y-53515476D01*
X87569819Y-53801190D02*
X86569819Y-53801190D01*
X86569819Y-53801190D02*
X86712676Y-53705952D01*
X86712676Y-53705952D02*
X86807914Y-53610714D01*
X86807914Y-53610714D02*
X86855533Y-53515476D01*
X100423866Y-56369048D02*
X100423866Y-57130953D01*
X88323866Y-56169048D02*
X88323866Y-56930953D01*
X88704819Y-56550000D02*
X87942914Y-56550000D01*
X64304819Y-57316666D02*
X65019104Y-57316666D01*
X65019104Y-57316666D02*
X65161961Y-57269047D01*
X65161961Y-57269047D02*
X65257200Y-57173809D01*
X65257200Y-57173809D02*
X65304819Y-57030952D01*
X65304819Y-57030952D02*
X65304819Y-56935714D01*
X64638152Y-58221428D02*
X65304819Y-58221428D01*
X64257200Y-57983333D02*
X64971485Y-57745238D01*
X64971485Y-57745238D02*
X64971485Y-58364285D01*
X71233332Y-49007200D02*
X71090475Y-49054819D01*
X71090475Y-49054819D02*
X70852380Y-49054819D01*
X70852380Y-49054819D02*
X70757142Y-49007200D01*
X70757142Y-49007200D02*
X70709523Y-48959580D01*
X70709523Y-48959580D02*
X70661904Y-48864342D01*
X70661904Y-48864342D02*
X70661904Y-48769104D01*
X70661904Y-48769104D02*
X70709523Y-48673866D01*
X70709523Y-48673866D02*
X70757142Y-48626247D01*
X70757142Y-48626247D02*
X70852380Y-48578628D01*
X70852380Y-48578628D02*
X71042856Y-48531009D01*
X71042856Y-48531009D02*
X71138094Y-48483390D01*
X71138094Y-48483390D02*
X71185713Y-48435771D01*
X71185713Y-48435771D02*
X71233332Y-48340533D01*
X71233332Y-48340533D02*
X71233332Y-48245295D01*
X71233332Y-48245295D02*
X71185713Y-48150057D01*
X71185713Y-48150057D02*
X71138094Y-48102438D01*
X71138094Y-48102438D02*
X71042856Y-48054819D01*
X71042856Y-48054819D02*
X70804761Y-48054819D01*
X70804761Y-48054819D02*
X70661904Y-48102438D01*
X70328570Y-48054819D02*
X70090475Y-49054819D01*
X70090475Y-49054819D02*
X69899999Y-48340533D01*
X69899999Y-48340533D02*
X69709523Y-49054819D01*
X69709523Y-49054819D02*
X69471428Y-48054819D01*
X68661904Y-48388152D02*
X68661904Y-49054819D01*
X68899999Y-48007200D02*
X69138094Y-48721485D01*
X69138094Y-48721485D02*
X68519047Y-48721485D01*
X73633333Y-95854819D02*
X73633333Y-96569104D01*
X73633333Y-96569104D02*
X73680952Y-96711961D01*
X73680952Y-96711961D02*
X73776190Y-96807200D01*
X73776190Y-96807200D02*
X73919047Y-96854819D01*
X73919047Y-96854819D02*
X74014285Y-96854819D01*
X73252380Y-95854819D02*
X72633333Y-95854819D01*
X72633333Y-95854819D02*
X72966666Y-96235771D01*
X72966666Y-96235771D02*
X72823809Y-96235771D01*
X72823809Y-96235771D02*
X72728571Y-96283390D01*
X72728571Y-96283390D02*
X72680952Y-96331009D01*
X72680952Y-96331009D02*
X72633333Y-96426247D01*
X72633333Y-96426247D02*
X72633333Y-96664342D01*
X72633333Y-96664342D02*
X72680952Y-96759580D01*
X72680952Y-96759580D02*
X72728571Y-96807200D01*
X72728571Y-96807200D02*
X72823809Y-96854819D01*
X72823809Y-96854819D02*
X73109523Y-96854819D01*
X73109523Y-96854819D02*
X73204761Y-96807200D01*
X73204761Y-96807200D02*
X73252380Y-96759580D01*
D13*
%TO.C,SW2*%
X109150000Y-76450000D02*
X106850000Y-76450000D01*
X106850000Y-76450000D02*
X106850000Y-64950000D01*
X106850000Y-64950000D02*
X109150000Y-64950000D01*
X109150000Y-64950000D02*
X109150000Y-76450000D01*
%TO.C,J1*%
X64130000Y-89730000D02*
X61470000Y-89730000D01*
X64130000Y-76970000D02*
X64130000Y-89730000D01*
X64130000Y-76970000D02*
X61470000Y-76970000D01*
X64130000Y-75700000D02*
X64130000Y-74370000D01*
X64130000Y-74370000D02*
X62800000Y-74370000D01*
X61470000Y-76970000D02*
X61470000Y-89730000D01*
%TO.C,J5*%
X69825000Y-79400000D02*
X71075000Y-79400000D01*
X76085000Y-79690000D02*
X76085000Y-87310000D01*
X70115000Y-79690000D02*
X76085000Y-79690000D01*
X72375000Y-79700000D02*
X72375000Y-80450000D01*
X70875000Y-79700000D02*
X70875000Y-81500000D01*
X70125000Y-79700000D02*
X70875000Y-79700000D01*
X75325000Y-80450000D02*
X75325000Y-83500000D01*
X72375000Y-80450000D02*
X75325000Y-80450000D01*
X69825000Y-80650000D02*
X69825000Y-79400000D01*
X70875000Y-81500000D02*
X70125000Y-81500000D01*
X70125000Y-81500000D02*
X70125000Y-79700000D01*
X70875000Y-83000000D02*
X70875000Y-84000000D01*
X70125000Y-83000000D02*
X70875000Y-83000000D01*
X70875000Y-84000000D02*
X70125000Y-84000000D01*
X70125000Y-84000000D02*
X70125000Y-83000000D01*
X70875000Y-85500000D02*
X70875000Y-87300000D01*
X70125000Y-85500000D02*
X70875000Y-85500000D01*
X75325000Y-86550000D02*
X75325000Y-83500000D01*
X72375000Y-86550000D02*
X75325000Y-86550000D01*
X72375000Y-87300000D02*
X72375000Y-86550000D01*
X70875000Y-87300000D02*
X70125000Y-87300000D01*
X70125000Y-87300000D02*
X70125000Y-85500000D01*
X76085000Y-87310000D02*
X70115000Y-87310000D01*
X70115000Y-87310000D02*
X70115000Y-79690000D01*
%TO.C,SW1*%
X75250000Y-54800000D02*
X71950000Y-54800000D01*
X75250000Y-54500000D02*
X75250000Y-54800000D01*
X75250000Y-52300000D02*
X75250000Y-52000000D01*
X75250000Y-52000000D02*
X71950000Y-52000000D01*
X71950000Y-54800000D02*
X71950000Y-54500000D01*
X71950000Y-52000000D02*
X71950000Y-52300000D01*
D14*
%TO.C,BZ1*%
X96700000Y-49900000D02*
X98900000Y-52100000D01*
X89200000Y-49900000D02*
X96700000Y-49900000D01*
X98900000Y-52100000D02*
X98900000Y-53400000D01*
X89200000Y-53400000D02*
X89200000Y-49900000D01*
X98900000Y-56100000D02*
X98900000Y-59600000D01*
X98900000Y-59600000D02*
X89200000Y-59600000D01*
X89200000Y-59600000D02*
X89200000Y-56090000D01*
D13*
%TO.C,J4*%
X60100000Y-53300000D02*
X61350000Y-53300000D01*
X66360000Y-53590000D02*
X66360000Y-61210000D01*
X60390000Y-53590000D02*
X66360000Y-53590000D01*
X62650000Y-53600000D02*
X62650000Y-54350000D01*
X61150000Y-53600000D02*
X61150000Y-55400000D01*
X60400000Y-53600000D02*
X61150000Y-53600000D01*
X65600000Y-54350000D02*
X65600000Y-57400000D01*
X62650000Y-54350000D02*
X65600000Y-54350000D01*
X60100000Y-54550000D02*
X60100000Y-53300000D01*
X61150000Y-55400000D02*
X60400000Y-55400000D01*
X60400000Y-55400000D02*
X60400000Y-53600000D01*
X61150000Y-56900000D02*
X61150000Y-57900000D01*
X60400000Y-56900000D02*
X61150000Y-56900000D01*
X61150000Y-57900000D02*
X60400000Y-57900000D01*
X60400000Y-57900000D02*
X60400000Y-56900000D01*
X61150000Y-59400000D02*
X61150000Y-61200000D01*
X60400000Y-59400000D02*
X61150000Y-59400000D01*
X65600000Y-60450000D02*
X65600000Y-57400000D01*
X62650000Y-60450000D02*
X65600000Y-60450000D01*
X62650000Y-61200000D02*
X62650000Y-60450000D01*
X61150000Y-61200000D02*
X60400000Y-61200000D01*
X60400000Y-61200000D02*
X60400000Y-59400000D01*
X66360000Y-61210000D02*
X60390000Y-61210000D01*
X60390000Y-61210000D02*
X60390000Y-53590000D01*
%TO.C,SW4*%
X75250000Y-49950000D02*
X71950000Y-49950000D01*
X75250000Y-49650000D02*
X75250000Y-49950000D01*
X75250000Y-47450000D02*
X75250000Y-47150000D01*
X75250000Y-47150000D02*
X71950000Y-47150000D01*
X71950000Y-49950000D02*
X71950000Y-49650000D01*
X71950000Y-47150000D02*
X71950000Y-47450000D01*
%TO.C,LOGO1*%
D15*
X103232829Y-89951097D02*
X103292753Y-89973355D01*
X103317673Y-89990080D01*
X103342910Y-90014043D01*
X103360912Y-90044526D01*
X103372858Y-90086023D01*
X103379930Y-90143032D01*
X103383308Y-90220047D01*
X103384171Y-90321565D01*
X103384002Y-90374027D01*
X103383153Y-90445715D01*
X103381711Y-90502925D01*
X103379814Y-90540809D01*
X103377597Y-90554514D01*
X103363172Y-90549981D01*
X103334054Y-90537670D01*
X103333181Y-90537272D01*
X103318060Y-90529356D01*
X103307891Y-90518495D01*
X103301691Y-90499471D01*
X103298478Y-90467069D01*
X103297270Y-90416071D01*
X103297086Y-90341261D01*
X103296714Y-90293804D01*
X103292750Y-90204615D01*
X103283673Y-90139287D01*
X103268524Y-90094393D01*
X103246345Y-90066507D01*
X103216175Y-90052203D01*
X103211990Y-90051206D01*
X103155480Y-90050427D01*
X103111410Y-90075744D01*
X103080972Y-90126502D01*
X103075544Y-90141175D01*
X103063171Y-90173649D01*
X103056905Y-90188572D01*
X103044036Y-90186516D01*
X103015933Y-90175357D01*
X102989721Y-90156927D01*
X102977771Y-90122098D01*
X102981336Y-90097151D01*
X103003235Y-90046547D01*
X103038644Y-89999128D01*
X103080052Y-89966334D01*
X103097400Y-89958752D01*
X103163089Y-89946076D01*
X103232829Y-89951097D01*
G36*
X103232829Y-89951097D02*
G01*
X103292753Y-89973355D01*
X103317673Y-89990080D01*
X103342910Y-90014043D01*
X103360912Y-90044526D01*
X103372858Y-90086023D01*
X103379930Y-90143032D01*
X103383308Y-90220047D01*
X103384171Y-90321565D01*
X103384002Y-90374027D01*
X103383153Y-90445715D01*
X103381711Y-90502925D01*
X103379814Y-90540809D01*
X103377597Y-90554514D01*
X103363172Y-90549981D01*
X103334054Y-90537670D01*
X103333181Y-90537272D01*
X103318060Y-90529356D01*
X103307891Y-90518495D01*
X103301691Y-90499471D01*
X103298478Y-90467069D01*
X103297270Y-90416071D01*
X103297086Y-90341261D01*
X103296714Y-90293804D01*
X103292750Y-90204615D01*
X103283673Y-90139287D01*
X103268524Y-90094393D01*
X103246345Y-90066507D01*
X103216175Y-90052203D01*
X103211990Y-90051206D01*
X103155480Y-90050427D01*
X103111410Y-90075744D01*
X103080972Y-90126502D01*
X103075544Y-90141175D01*
X103063171Y-90173649D01*
X103056905Y-90188572D01*
X103044036Y-90186516D01*
X103015933Y-90175357D01*
X102989721Y-90156927D01*
X102977771Y-90122098D01*
X102981336Y-90097151D01*
X103003235Y-90046547D01*
X103038644Y-89999128D01*
X103080052Y-89966334D01*
X103097400Y-89958752D01*
X103163089Y-89946076D01*
X103232829Y-89951097D01*
G37*
X107181020Y-89917822D02*
X107248810Y-89949680D01*
X107304366Y-90004770D01*
X107315881Y-90022016D01*
X107325432Y-90041562D01*
X107332206Y-90066198D01*
X107336819Y-90100711D01*
X107339888Y-90149889D01*
X107342029Y-90218519D01*
X107343859Y-90311389D01*
X107348404Y-90569007D01*
X107310225Y-90554491D01*
X107275268Y-90541156D01*
X107249097Y-90528323D01*
X107232013Y-90511780D01*
X107222086Y-90486465D01*
X107217386Y-90447316D01*
X107215982Y-90389268D01*
X107215943Y-90307261D01*
X107215744Y-90241895D01*
X107214559Y-90179173D01*
X107211729Y-90136334D01*
X107206609Y-90108220D01*
X107198553Y-90089675D01*
X107186914Y-90075543D01*
X107158303Y-90055600D01*
X107110239Y-90048083D01*
X107062688Y-90067079D01*
X107059550Y-90069511D01*
X107049769Y-90080748D01*
X107042553Y-90098770D01*
X107037299Y-90128026D01*
X107033402Y-90172962D01*
X107030256Y-90238028D01*
X107027257Y-90327670D01*
X107020000Y-90567697D01*
X106958314Y-90540044D01*
X106896629Y-90512391D01*
X106896629Y-90293246D01*
X106896884Y-90233711D01*
X106899086Y-90150892D01*
X106904661Y-90089227D01*
X106914941Y-90043748D01*
X106931258Y-90009484D01*
X106954943Y-89981466D01*
X106987328Y-89954723D01*
X107033907Y-89927780D01*
X107107287Y-89910191D01*
X107181020Y-89917822D01*
G36*
X107181020Y-89917822D02*
G01*
X107248810Y-89949680D01*
X107304366Y-90004770D01*
X107315881Y-90022016D01*
X107325432Y-90041562D01*
X107332206Y-90066198D01*
X107336819Y-90100711D01*
X107339888Y-90149889D01*
X107342029Y-90218519D01*
X107343859Y-90311389D01*
X107348404Y-90569007D01*
X107310225Y-90554491D01*
X107275268Y-90541156D01*
X107249097Y-90528323D01*
X107232013Y-90511780D01*
X107222086Y-90486465D01*
X107217386Y-90447316D01*
X107215982Y-90389268D01*
X107215943Y-90307261D01*
X107215744Y-90241895D01*
X107214559Y-90179173D01*
X107211729Y-90136334D01*
X107206609Y-90108220D01*
X107198553Y-90089675D01*
X107186914Y-90075543D01*
X107158303Y-90055600D01*
X107110239Y-90048083D01*
X107062688Y-90067079D01*
X107059550Y-90069511D01*
X107049769Y-90080748D01*
X107042553Y-90098770D01*
X107037299Y-90128026D01*
X107033402Y-90172962D01*
X107030256Y-90238028D01*
X107027257Y-90327670D01*
X107020000Y-90567697D01*
X106958314Y-90540044D01*
X106896629Y-90512391D01*
X106896629Y-90293246D01*
X106896884Y-90233711D01*
X106899086Y-90150892D01*
X106904661Y-90089227D01*
X106914941Y-90043748D01*
X106931258Y-90009484D01*
X106954943Y-89981466D01*
X106987328Y-89954723D01*
X107033907Y-89927780D01*
X107107287Y-89910191D01*
X107181020Y-89917822D01*
G37*
X105357691Y-89966467D02*
X105362273Y-89969003D01*
X105399704Y-89998057D01*
X105433170Y-90035410D01*
X105439007Y-90043852D01*
X105450165Y-90063553D01*
X105458136Y-90086935D01*
X105463618Y-90119067D01*
X105467307Y-90165019D01*
X105469899Y-90229859D01*
X105472092Y-90318657D01*
X105472402Y-90333669D01*
X105473400Y-90430999D01*
X105471994Y-90499934D01*
X105468164Y-90540948D01*
X105461889Y-90554514D01*
X105442898Y-90550452D01*
X105410638Y-90538144D01*
X105403041Y-90534545D01*
X105391176Y-90526398D01*
X105382994Y-90513004D01*
X105377643Y-90489608D01*
X105374269Y-90451455D01*
X105372019Y-90393790D01*
X105370040Y-90311857D01*
X105369498Y-90287907D01*
X105367403Y-90212266D01*
X105364683Y-90159328D01*
X105360515Y-90124075D01*
X105354079Y-90101487D01*
X105344550Y-90086544D01*
X105331106Y-90074227D01*
X105291305Y-90052634D01*
X105242341Y-90048476D01*
X105198529Y-90064999D01*
X105167008Y-90099210D01*
X105154914Y-90148114D01*
X105154578Y-90161407D01*
X105147972Y-90185472D01*
X105128470Y-90189144D01*
X105090283Y-90174813D01*
X105081438Y-90170217D01*
X105057534Y-90143186D01*
X105057061Y-90102994D01*
X105079836Y-90047409D01*
X105100727Y-90017117D01*
X105154142Y-89974084D01*
X105220074Y-89949755D01*
X105290574Y-89946443D01*
X105357691Y-89966467D01*
G36*
X105357691Y-89966467D02*
G01*
X105362273Y-89969003D01*
X105399704Y-89998057D01*
X105433170Y-90035410D01*
X105439007Y-90043852D01*
X105450165Y-90063553D01*
X105458136Y-90086935D01*
X105463618Y-90119067D01*
X105467307Y-90165019D01*
X105469899Y-90229859D01*
X105472092Y-90318657D01*
X105472402Y-90333669D01*
X105473400Y-90430999D01*
X105471994Y-90499934D01*
X105468164Y-90540948D01*
X105461889Y-90554514D01*
X105442898Y-90550452D01*
X105410638Y-90538144D01*
X105403041Y-90534545D01*
X105391176Y-90526398D01*
X105382994Y-90513004D01*
X105377643Y-90489608D01*
X105374269Y-90451455D01*
X105372019Y-90393790D01*
X105370040Y-90311857D01*
X105369498Y-90287907D01*
X105367403Y-90212266D01*
X105364683Y-90159328D01*
X105360515Y-90124075D01*
X105354079Y-90101487D01*
X105344550Y-90086544D01*
X105331106Y-90074227D01*
X105291305Y-90052634D01*
X105242341Y-90048476D01*
X105198529Y-90064999D01*
X105167008Y-90099210D01*
X105154914Y-90148114D01*
X105154578Y-90161407D01*
X105147972Y-90185472D01*
X105128470Y-90189144D01*
X105090283Y-90174813D01*
X105081438Y-90170217D01*
X105057534Y-90143186D01*
X105057061Y-90102994D01*
X105079836Y-90047409D01*
X105100727Y-90017117D01*
X105154142Y-89974084D01*
X105220074Y-89949755D01*
X105290574Y-89946443D01*
X105357691Y-89966467D01*
G37*
X106428543Y-89749444D02*
X106475714Y-89769342D01*
X106475714Y-90166509D01*
X106475519Y-90269498D01*
X106474998Y-90362141D01*
X106474199Y-90440700D01*
X106473172Y-90501439D01*
X106471963Y-90540623D01*
X106470623Y-90554514D01*
X106470099Y-90554468D01*
X106452287Y-90549420D01*
X106419823Y-90538580D01*
X106374114Y-90522646D01*
X106374114Y-90318173D01*
X106373824Y-90237832D01*
X106372474Y-90179562D01*
X106369369Y-90139909D01*
X106363812Y-90113618D01*
X106355107Y-90095436D01*
X106342556Y-90080107D01*
X106333999Y-90071955D01*
X106287728Y-90049375D01*
X106236728Y-90051375D01*
X106189993Y-90078073D01*
X106183189Y-90084698D01*
X106172293Y-90098456D01*
X106164836Y-90116642D01*
X106160169Y-90144177D01*
X106157642Y-90185981D01*
X106156602Y-90246973D01*
X106156400Y-90332073D01*
X106156303Y-90375234D01*
X106155674Y-90446224D01*
X106154556Y-90503076D01*
X106153063Y-90540828D01*
X106151309Y-90554514D01*
X106150785Y-90554468D01*
X106132973Y-90549420D01*
X106100509Y-90538580D01*
X106054800Y-90522646D01*
X106054823Y-90317237D01*
X106054857Y-90298951D01*
X106056778Y-90203626D01*
X106062678Y-90131543D01*
X106074001Y-90077813D01*
X106092187Y-90037549D01*
X106118679Y-90005861D01*
X106154918Y-89977861D01*
X106190263Y-89960333D01*
X106246773Y-89946785D01*
X106302356Y-89946015D01*
X106345086Y-89959195D01*
X106348298Y-89961015D01*
X106358205Y-89960820D01*
X106364975Y-89945572D01*
X106369861Y-89910613D01*
X106374114Y-89851289D01*
X106381371Y-89729547D01*
X106428543Y-89749444D01*
G36*
X106428543Y-89749444D02*
G01*
X106475714Y-89769342D01*
X106475714Y-90166509D01*
X106475519Y-90269498D01*
X106474998Y-90362141D01*
X106474199Y-90440700D01*
X106473172Y-90501439D01*
X106471963Y-90540623D01*
X106470623Y-90554514D01*
X106470099Y-90554468D01*
X106452287Y-90549420D01*
X106419823Y-90538580D01*
X106374114Y-90522646D01*
X106374114Y-90318173D01*
X106373824Y-90237832D01*
X106372474Y-90179562D01*
X106369369Y-90139909D01*
X106363812Y-90113618D01*
X106355107Y-90095436D01*
X106342556Y-90080107D01*
X106333999Y-90071955D01*
X106287728Y-90049375D01*
X106236728Y-90051375D01*
X106189993Y-90078073D01*
X106183189Y-90084698D01*
X106172293Y-90098456D01*
X106164836Y-90116642D01*
X106160169Y-90144177D01*
X106157642Y-90185981D01*
X106156602Y-90246973D01*
X106156400Y-90332073D01*
X106156303Y-90375234D01*
X106155674Y-90446224D01*
X106154556Y-90503076D01*
X106153063Y-90540828D01*
X106151309Y-90554514D01*
X106150785Y-90554468D01*
X106132973Y-90549420D01*
X106100509Y-90538580D01*
X106054800Y-90522646D01*
X106054823Y-90317237D01*
X106054857Y-90298951D01*
X106056778Y-90203626D01*
X106062678Y-90131543D01*
X106074001Y-90077813D01*
X106092187Y-90037549D01*
X106118679Y-90005861D01*
X106154918Y-89977861D01*
X106190263Y-89960333D01*
X106246773Y-89946785D01*
X106302356Y-89946015D01*
X106345086Y-89959195D01*
X106348298Y-89961015D01*
X106358205Y-89960820D01*
X106364975Y-89945572D01*
X106369861Y-89910613D01*
X106374114Y-89851289D01*
X106381371Y-89729547D01*
X106428543Y-89749444D01*
G37*
X104403941Y-89949282D02*
X104435774Y-89961758D01*
X104472743Y-89978602D01*
X104472743Y-90465196D01*
X104426812Y-90511127D01*
X104416320Y-90521427D01*
X104387255Y-90544320D01*
X104357943Y-90551735D01*
X104314326Y-90548321D01*
X104296568Y-90546114D01*
X104250767Y-90541445D01*
X104218743Y-90539585D01*
X104209244Y-90539869D01*
X104170274Y-90542948D01*
X104123160Y-90548321D01*
X104108085Y-90550168D01*
X104070110Y-90550893D01*
X104042325Y-90539429D01*
X104010674Y-90511127D01*
X103964743Y-90465196D01*
X103964743Y-90205055D01*
X103965101Y-90128180D01*
X103966216Y-90054886D01*
X103967952Y-89996850D01*
X103970167Y-89958663D01*
X103972721Y-89944914D01*
X103973256Y-89944951D01*
X103991808Y-89951793D01*
X104023153Y-89966868D01*
X104065608Y-89988822D01*
X104069604Y-90217240D01*
X104073600Y-90445657D01*
X104160686Y-90445657D01*
X104164657Y-90195286D01*
X104165916Y-90127227D01*
X104167718Y-90054482D01*
X104169671Y-89996730D01*
X104171612Y-89958648D01*
X104173377Y-89944914D01*
X104173885Y-89944962D01*
X104191482Y-89950015D01*
X104223834Y-89960849D01*
X104269543Y-89976783D01*
X104269765Y-90196706D01*
X104269988Y-90234909D01*
X104271531Y-90309146D01*
X104274292Y-90371145D01*
X104277977Y-90415308D01*
X104282292Y-90436041D01*
X104297732Y-90447131D01*
X104329241Y-90450556D01*
X104363886Y-90445657D01*
X104367857Y-90195286D01*
X104369278Y-90131663D01*
X104372225Y-90056356D01*
X104376079Y-89997286D01*
X104380542Y-89958718D01*
X104385317Y-89944914D01*
X104403941Y-89949282D01*
G36*
X104403941Y-89949282D02*
G01*
X104435774Y-89961758D01*
X104472743Y-89978602D01*
X104472743Y-90465196D01*
X104426812Y-90511127D01*
X104416320Y-90521427D01*
X104387255Y-90544320D01*
X104357943Y-90551735D01*
X104314326Y-90548321D01*
X104296568Y-90546114D01*
X104250767Y-90541445D01*
X104218743Y-90539585D01*
X104209244Y-90539869D01*
X104170274Y-90542948D01*
X104123160Y-90548321D01*
X104108085Y-90550168D01*
X104070110Y-90550893D01*
X104042325Y-90539429D01*
X104010674Y-90511127D01*
X103964743Y-90465196D01*
X103964743Y-90205055D01*
X103965101Y-90128180D01*
X103966216Y-90054886D01*
X103967952Y-89996850D01*
X103970167Y-89958663D01*
X103972721Y-89944914D01*
X103973256Y-89944951D01*
X103991808Y-89951793D01*
X104023153Y-89966868D01*
X104065608Y-89988822D01*
X104069604Y-90217240D01*
X104073600Y-90445657D01*
X104160686Y-90445657D01*
X104164657Y-90195286D01*
X104165916Y-90127227D01*
X104167718Y-90054482D01*
X104169671Y-89996730D01*
X104171612Y-89958648D01*
X104173377Y-89944914D01*
X104173885Y-89944962D01*
X104191482Y-89950015D01*
X104223834Y-89960849D01*
X104269543Y-89976783D01*
X104269765Y-90196706D01*
X104269988Y-90234909D01*
X104271531Y-90309146D01*
X104274292Y-90371145D01*
X104277977Y-90415308D01*
X104282292Y-90436041D01*
X104297732Y-90447131D01*
X104329241Y-90450556D01*
X104363886Y-90445657D01*
X104367857Y-90195286D01*
X104369278Y-90131663D01*
X104372225Y-90056356D01*
X104376079Y-89997286D01*
X104380542Y-89958718D01*
X104385317Y-89944914D01*
X104403941Y-89949282D01*
G37*
X109015714Y-90235200D02*
X109015701Y-90250935D01*
X109014914Y-90321119D01*
X109012210Y-90370022D01*
X109006606Y-90404178D01*
X108997119Y-90430124D01*
X108982768Y-90454397D01*
X108979237Y-90459433D01*
X108941878Y-90499143D01*
X108899311Y-90529092D01*
X108877452Y-90538810D01*
X108798908Y-90555020D01*
X108721231Y-90544535D01*
X108649645Y-90508707D01*
X108589374Y-90448887D01*
X108584286Y-90440873D01*
X108567730Y-90394342D01*
X108556573Y-90329552D01*
X108551160Y-90254727D01*
X108551768Y-90185513D01*
X108698248Y-90185513D01*
X108699402Y-90281399D01*
X108699866Y-90287569D01*
X108706629Y-90340478D01*
X108718671Y-90374029D01*
X108739005Y-90397016D01*
X108773097Y-90418548D01*
X108806814Y-90419680D01*
X108841543Y-90394857D01*
X108847584Y-90388325D01*
X108859417Y-90368779D01*
X108866404Y-90340386D01*
X108869727Y-90296430D01*
X108870571Y-90230192D01*
X108869125Y-90168150D01*
X108861907Y-90109042D01*
X108847006Y-90071686D01*
X108822636Y-90052152D01*
X108787008Y-90046514D01*
X108773440Y-90047635D01*
X108735430Y-90068194D01*
X108710312Y-90114299D01*
X108698248Y-90185513D01*
X108551768Y-90185513D01*
X108551833Y-90178096D01*
X108558937Y-90107882D01*
X108572815Y-90052312D01*
X108590649Y-90015301D01*
X108640855Y-89957733D01*
X108708885Y-89921962D01*
X108792158Y-89909665D01*
X108814398Y-89910331D01*
X108879891Y-89923947D01*
X108933687Y-89958249D01*
X108983057Y-90017338D01*
X108985995Y-90021722D01*
X108999287Y-90045299D01*
X109007932Y-90071949D01*
X109012904Y-90108159D01*
X109015174Y-90160413D01*
X109015678Y-90230192D01*
X109015714Y-90235200D01*
G36*
X109015714Y-90235200D02*
G01*
X109015701Y-90250935D01*
X109014914Y-90321119D01*
X109012210Y-90370022D01*
X109006606Y-90404178D01*
X108997119Y-90430124D01*
X108982768Y-90454397D01*
X108979237Y-90459433D01*
X108941878Y-90499143D01*
X108899311Y-90529092D01*
X108877452Y-90538810D01*
X108798908Y-90555020D01*
X108721231Y-90544535D01*
X108649645Y-90508707D01*
X108589374Y-90448887D01*
X108584286Y-90440873D01*
X108567730Y-90394342D01*
X108556573Y-90329552D01*
X108551160Y-90254727D01*
X108551768Y-90185513D01*
X108698248Y-90185513D01*
X108699402Y-90281399D01*
X108699866Y-90287569D01*
X108706629Y-90340478D01*
X108718671Y-90374029D01*
X108739005Y-90397016D01*
X108773097Y-90418548D01*
X108806814Y-90419680D01*
X108841543Y-90394857D01*
X108847584Y-90388325D01*
X108859417Y-90368779D01*
X108866404Y-90340386D01*
X108869727Y-90296430D01*
X108870571Y-90230192D01*
X108869125Y-90168150D01*
X108861907Y-90109042D01*
X108847006Y-90071686D01*
X108822636Y-90052152D01*
X108787008Y-90046514D01*
X108773440Y-90047635D01*
X108735430Y-90068194D01*
X108710312Y-90114299D01*
X108698248Y-90185513D01*
X108551768Y-90185513D01*
X108551833Y-90178096D01*
X108558937Y-90107882D01*
X108572815Y-90052312D01*
X108590649Y-90015301D01*
X108640855Y-89957733D01*
X108708885Y-89921962D01*
X108792158Y-89909665D01*
X108814398Y-89910331D01*
X108879891Y-89923947D01*
X108933687Y-89958249D01*
X108983057Y-90017338D01*
X108985995Y-90021722D01*
X108999287Y-90045299D01*
X109007932Y-90071949D01*
X109012904Y-90108159D01*
X109015174Y-90160413D01*
X109015678Y-90230192D01*
X109015714Y-90235200D01*
G37*
X102890590Y-90252622D02*
X102890307Y-90291305D01*
X102886762Y-90367521D01*
X102877483Y-90423294D01*
X102860375Y-90464613D01*
X102833344Y-90497467D01*
X102794292Y-90527846D01*
X102769445Y-90541660D01*
X102729615Y-90550965D01*
X102673665Y-90550230D01*
X102642385Y-90547283D01*
X102604653Y-90538283D01*
X102574494Y-90518720D01*
X102539408Y-90482267D01*
X102534720Y-90476943D01*
X102503177Y-90435969D01*
X102488128Y-90400283D01*
X102484286Y-90357966D01*
X102484286Y-90295779D01*
X102527742Y-90312182D01*
X102559424Y-90331356D01*
X102586962Y-90376347D01*
X102592711Y-90390752D01*
X102624855Y-90431546D01*
X102668611Y-90452081D01*
X102716254Y-90450235D01*
X102760057Y-90423886D01*
X102775111Y-90407455D01*
X102788763Y-90382667D01*
X102784493Y-90360144D01*
X102759916Y-90336964D01*
X102712651Y-90310202D01*
X102640314Y-90276934D01*
X102491543Y-90211816D01*
X102487595Y-90147308D01*
X102489079Y-90106220D01*
X102586010Y-90106220D01*
X102593368Y-90131657D01*
X102626848Y-90158814D01*
X102687614Y-90189714D01*
X102697669Y-90194190D01*
X102745751Y-90215017D01*
X102781726Y-90229665D01*
X102798444Y-90235200D01*
X102800977Y-90231126D01*
X102801993Y-90206247D01*
X102798369Y-90166257D01*
X102789242Y-90127152D01*
X102760773Y-90077884D01*
X102719678Y-90050122D01*
X102670590Y-90046364D01*
X102618144Y-90069109D01*
X102603609Y-90080481D01*
X102586010Y-90106220D01*
X102489079Y-90106220D01*
X102489338Y-90099064D01*
X102511281Y-90038096D01*
X102538979Y-90004497D01*
X102596405Y-89966966D01*
X102664527Y-89948006D01*
X102734947Y-89949507D01*
X102799267Y-89973355D01*
X102813426Y-89982513D01*
X102845904Y-90010849D01*
X102868116Y-90046695D01*
X102881804Y-90095384D01*
X102888715Y-90162249D01*
X102889628Y-90206247D01*
X102890590Y-90252622D01*
G36*
X102890590Y-90252622D02*
G01*
X102890307Y-90291305D01*
X102886762Y-90367521D01*
X102877483Y-90423294D01*
X102860375Y-90464613D01*
X102833344Y-90497467D01*
X102794292Y-90527846D01*
X102769445Y-90541660D01*
X102729615Y-90550965D01*
X102673665Y-90550230D01*
X102642385Y-90547283D01*
X102604653Y-90538283D01*
X102574494Y-90518720D01*
X102539408Y-90482267D01*
X102534720Y-90476943D01*
X102503177Y-90435969D01*
X102488128Y-90400283D01*
X102484286Y-90357966D01*
X102484286Y-90295779D01*
X102527742Y-90312182D01*
X102559424Y-90331356D01*
X102586962Y-90376347D01*
X102592711Y-90390752D01*
X102624855Y-90431546D01*
X102668611Y-90452081D01*
X102716254Y-90450235D01*
X102760057Y-90423886D01*
X102775111Y-90407455D01*
X102788763Y-90382667D01*
X102784493Y-90360144D01*
X102759916Y-90336964D01*
X102712651Y-90310202D01*
X102640314Y-90276934D01*
X102491543Y-90211816D01*
X102487595Y-90147308D01*
X102489079Y-90106220D01*
X102586010Y-90106220D01*
X102593368Y-90131657D01*
X102626848Y-90158814D01*
X102687614Y-90189714D01*
X102697669Y-90194190D01*
X102745751Y-90215017D01*
X102781726Y-90229665D01*
X102798444Y-90235200D01*
X102800977Y-90231126D01*
X102801993Y-90206247D01*
X102798369Y-90166257D01*
X102789242Y-90127152D01*
X102760773Y-90077884D01*
X102719678Y-90050122D01*
X102670590Y-90046364D01*
X102618144Y-90069109D01*
X102603609Y-90080481D01*
X102586010Y-90106220D01*
X102489079Y-90106220D01*
X102489338Y-90099064D01*
X102511281Y-90038096D01*
X102538979Y-90004497D01*
X102596405Y-89966966D01*
X102664527Y-89948006D01*
X102734947Y-89949507D01*
X102799267Y-89973355D01*
X102813426Y-89982513D01*
X102845904Y-90010849D01*
X102868116Y-90046695D01*
X102881804Y-90095384D01*
X102888715Y-90162249D01*
X102889628Y-90206247D01*
X102890590Y-90252622D01*
G37*
X104980698Y-90249714D02*
X104979537Y-90306313D01*
X104971345Y-90383462D01*
X104953519Y-90441276D01*
X104923975Y-90485422D01*
X104880625Y-90521568D01*
X104839332Y-90542463D01*
X104769987Y-90554090D01*
X104700736Y-90541377D01*
X104638145Y-90505945D01*
X104588779Y-90449418D01*
X104582818Y-90438995D01*
X104574945Y-90420733D01*
X104569106Y-90397429D01*
X104564999Y-90365085D01*
X104562325Y-90319704D01*
X104560781Y-90257287D01*
X104560734Y-90251748D01*
X104661429Y-90251748D01*
X104661772Y-90304577D01*
X104663942Y-90352362D01*
X104669307Y-90383209D01*
X104679217Y-90403935D01*
X104695021Y-90421356D01*
X104698724Y-90424705D01*
X104746299Y-90449419D01*
X104796635Y-90446890D01*
X104843517Y-90417288D01*
X104857477Y-90401953D01*
X104869160Y-90381622D01*
X104875686Y-90353514D01*
X104878524Y-90310550D01*
X104879143Y-90245647D01*
X104878837Y-90196122D01*
X104876722Y-90147782D01*
X104871390Y-90116587D01*
X104861460Y-90095647D01*
X104845550Y-90078073D01*
X104836204Y-90070159D01*
X104787776Y-90048843D01*
X104737040Y-90052198D01*
X104692987Y-90080107D01*
X104683504Y-90091173D01*
X104671939Y-90112009D01*
X104665252Y-90141106D01*
X104662173Y-90185381D01*
X104661429Y-90251748D01*
X104560734Y-90251748D01*
X104560067Y-90173837D01*
X104559883Y-90065358D01*
X104559829Y-89728601D01*
X104607000Y-89748362D01*
X104619472Y-89753770D01*
X104639324Y-89765985D01*
X104650687Y-89784482D01*
X104656933Y-89816829D01*
X104661429Y-89870593D01*
X104665535Y-89918866D01*
X104670963Y-89950557D01*
X104678739Y-89962383D01*
X104690457Y-89959212D01*
X104720318Y-89948067D01*
X104773684Y-89945304D01*
X104831093Y-89955625D01*
X104880625Y-89977861D01*
X104907876Y-89998443D01*
X104942865Y-90038600D01*
X104965274Y-90090086D01*
X104977190Y-90158568D01*
X104980542Y-90245647D01*
X104980698Y-90249714D01*
G36*
X104980698Y-90249714D02*
G01*
X104979537Y-90306313D01*
X104971345Y-90383462D01*
X104953519Y-90441276D01*
X104923975Y-90485422D01*
X104880625Y-90521568D01*
X104839332Y-90542463D01*
X104769987Y-90554090D01*
X104700736Y-90541377D01*
X104638145Y-90505945D01*
X104588779Y-90449418D01*
X104582818Y-90438995D01*
X104574945Y-90420733D01*
X104569106Y-90397429D01*
X104564999Y-90365085D01*
X104562325Y-90319704D01*
X104560781Y-90257287D01*
X104560734Y-90251748D01*
X104661429Y-90251748D01*
X104661772Y-90304577D01*
X104663942Y-90352362D01*
X104669307Y-90383209D01*
X104679217Y-90403935D01*
X104695021Y-90421356D01*
X104698724Y-90424705D01*
X104746299Y-90449419D01*
X104796635Y-90446890D01*
X104843517Y-90417288D01*
X104857477Y-90401953D01*
X104869160Y-90381622D01*
X104875686Y-90353514D01*
X104878524Y-90310550D01*
X104879143Y-90245647D01*
X104878837Y-90196122D01*
X104876722Y-90147782D01*
X104871390Y-90116587D01*
X104861460Y-90095647D01*
X104845550Y-90078073D01*
X104836204Y-90070159D01*
X104787776Y-90048843D01*
X104737040Y-90052198D01*
X104692987Y-90080107D01*
X104683504Y-90091173D01*
X104671939Y-90112009D01*
X104665252Y-90141106D01*
X104662173Y-90185381D01*
X104661429Y-90251748D01*
X104560734Y-90251748D01*
X104560067Y-90173837D01*
X104559883Y-90065358D01*
X104559829Y-89728601D01*
X104607000Y-89748362D01*
X104619472Y-89753770D01*
X104639324Y-89765985D01*
X104650687Y-89784482D01*
X104656933Y-89816829D01*
X104661429Y-89870593D01*
X104665535Y-89918866D01*
X104670963Y-89950557D01*
X104678739Y-89962383D01*
X104690457Y-89959212D01*
X104720318Y-89948067D01*
X104773684Y-89945304D01*
X104831093Y-89955625D01*
X104880625Y-89977861D01*
X104907876Y-89998443D01*
X104942865Y-90038600D01*
X104965274Y-90090086D01*
X104977190Y-90158568D01*
X104980542Y-90245647D01*
X104980698Y-90249714D01*
G37*
X107912299Y-90194055D02*
X107907684Y-90304078D01*
X107905078Y-90327387D01*
X107885660Y-90410352D01*
X107850573Y-90473448D01*
X107797212Y-90521808D01*
X107794196Y-90523804D01*
X107726362Y-90552185D01*
X107655535Y-90554711D01*
X107587289Y-90533097D01*
X107527196Y-90489062D01*
X107480829Y-90424322D01*
X107480050Y-90422761D01*
X107464643Y-90382558D01*
X107453357Y-90336866D01*
X107447370Y-90293972D01*
X107447861Y-90262160D01*
X107456007Y-90249714D01*
X107463244Y-90250471D01*
X107497851Y-90264235D01*
X107537078Y-90289546D01*
X107570448Y-90318845D01*
X107587483Y-90344572D01*
X107605192Y-90379471D01*
X107641485Y-90411212D01*
X107683630Y-90423886D01*
X107699077Y-90420221D01*
X107729569Y-90401774D01*
X107756128Y-90376166D01*
X107767486Y-90352934D01*
X107767482Y-90352848D01*
X107754596Y-90342179D01*
X107720241Y-90322933D01*
X107669593Y-90297813D01*
X107607829Y-90269524D01*
X107607489Y-90269374D01*
X107540388Y-90239498D01*
X107495411Y-90217973D01*
X107468145Y-90201437D01*
X107454178Y-90186531D01*
X107449097Y-90169893D01*
X107448490Y-90148162D01*
X107452712Y-90107013D01*
X107596000Y-90107013D01*
X107610791Y-90119949D01*
X107647644Y-90139333D01*
X107648725Y-90139881D01*
X107692205Y-90160587D01*
X107731102Y-90177105D01*
X107755778Y-90184093D01*
X107765676Y-90174753D01*
X107767486Y-90142748D01*
X107759966Y-90102915D01*
X107733897Y-90066717D01*
X107696154Y-90047950D01*
X107654077Y-90049845D01*
X107615005Y-90075632D01*
X107599647Y-90093451D01*
X107596000Y-90107013D01*
X107452712Y-90107013D01*
X107453833Y-90096086D01*
X107480251Y-90025335D01*
X107524473Y-89969735D01*
X107581697Y-89931239D01*
X107647120Y-89911797D01*
X107715937Y-89913359D01*
X107783347Y-89937878D01*
X107844544Y-89987302D01*
X107878450Y-90036212D01*
X107902806Y-90106027D01*
X107906767Y-90142748D01*
X107912299Y-90194055D01*
G36*
X107912299Y-90194055D02*
G01*
X107907684Y-90304078D01*
X107905078Y-90327387D01*
X107885660Y-90410352D01*
X107850573Y-90473448D01*
X107797212Y-90521808D01*
X107794196Y-90523804D01*
X107726362Y-90552185D01*
X107655535Y-90554711D01*
X107587289Y-90533097D01*
X107527196Y-90489062D01*
X107480829Y-90424322D01*
X107480050Y-90422761D01*
X107464643Y-90382558D01*
X107453357Y-90336866D01*
X107447370Y-90293972D01*
X107447861Y-90262160D01*
X107456007Y-90249714D01*
X107463244Y-90250471D01*
X107497851Y-90264235D01*
X107537078Y-90289546D01*
X107570448Y-90318845D01*
X107587483Y-90344572D01*
X107605192Y-90379471D01*
X107641485Y-90411212D01*
X107683630Y-90423886D01*
X107699077Y-90420221D01*
X107729569Y-90401774D01*
X107756128Y-90376166D01*
X107767486Y-90352934D01*
X107767482Y-90352848D01*
X107754596Y-90342179D01*
X107720241Y-90322933D01*
X107669593Y-90297813D01*
X107607829Y-90269524D01*
X107607489Y-90269374D01*
X107540388Y-90239498D01*
X107495411Y-90217973D01*
X107468145Y-90201437D01*
X107454178Y-90186531D01*
X107449097Y-90169893D01*
X107448490Y-90148162D01*
X107452712Y-90107013D01*
X107596000Y-90107013D01*
X107610791Y-90119949D01*
X107647644Y-90139333D01*
X107648725Y-90139881D01*
X107692205Y-90160587D01*
X107731102Y-90177105D01*
X107755778Y-90184093D01*
X107765676Y-90174753D01*
X107767486Y-90142748D01*
X107759966Y-90102915D01*
X107733897Y-90066717D01*
X107696154Y-90047950D01*
X107654077Y-90049845D01*
X107615005Y-90075632D01*
X107599647Y-90093451D01*
X107596000Y-90107013D01*
X107452712Y-90107013D01*
X107453833Y-90096086D01*
X107480251Y-90025335D01*
X107524473Y-89969735D01*
X107581697Y-89931239D01*
X107647120Y-89911797D01*
X107715937Y-89913359D01*
X107783347Y-89937878D01*
X107844544Y-89987302D01*
X107878450Y-90036212D01*
X107902806Y-90106027D01*
X107906767Y-90142748D01*
X107912299Y-90194055D01*
G37*
X105839483Y-89960569D02*
X105889376Y-89989661D01*
X105911325Y-90012327D01*
X105953504Y-90080082D01*
X105967714Y-90153950D01*
X105967714Y-90204770D01*
X105920999Y-90185128D01*
X105888692Y-90165308D01*
X105863231Y-90124160D01*
X105860616Y-90115675D01*
X105832478Y-90072451D01*
X105790067Y-90049103D01*
X105741370Y-90048100D01*
X105694373Y-90071914D01*
X105687357Y-90078056D01*
X105663893Y-90104745D01*
X105660019Y-90128014D01*
X105677768Y-90150862D01*
X105719179Y-90176287D01*
X105786286Y-90207288D01*
X105790824Y-90209252D01*
X105865322Y-90243990D01*
X105916203Y-90274763D01*
X105947525Y-90305488D01*
X105963343Y-90340082D01*
X105967714Y-90382462D01*
X105961986Y-90429446D01*
X105933062Y-90489585D01*
X105882178Y-90532788D01*
X105845374Y-90545759D01*
X105793434Y-90552856D01*
X105742999Y-90551340D01*
X105706983Y-90540632D01*
X105703158Y-90537966D01*
X105692998Y-90519337D01*
X105700048Y-90486505D01*
X105712297Y-90460735D01*
X105731939Y-90450006D01*
X105769191Y-90450539D01*
X105820908Y-90447462D01*
X105854701Y-90426212D01*
X105866114Y-90386877D01*
X105866104Y-90385747D01*
X105859187Y-90362913D01*
X105835659Y-90341963D01*
X105789914Y-90317815D01*
X105727704Y-90288741D01*
X105686499Y-90272925D01*
X105662712Y-90273944D01*
X105651597Y-90294837D01*
X105648408Y-90338641D01*
X105648400Y-90408393D01*
X105648044Y-90451452D01*
X105646413Y-90504626D01*
X105643761Y-90541022D01*
X105640422Y-90554514D01*
X105639530Y-90554423D01*
X105620237Y-90547110D01*
X105588284Y-90531678D01*
X105544124Y-90508842D01*
X105549371Y-90303078D01*
X105549736Y-90289432D01*
X105553904Y-90193651D01*
X105561268Y-90121462D01*
X105573330Y-90068058D01*
X105591593Y-90028633D01*
X105617560Y-89998380D01*
X105652733Y-89972493D01*
X105653384Y-89972087D01*
X105710256Y-89950968D01*
X105776033Y-89947400D01*
X105839483Y-89960569D01*
G36*
X105839483Y-89960569D02*
G01*
X105889376Y-89989661D01*
X105911325Y-90012327D01*
X105953504Y-90080082D01*
X105967714Y-90153950D01*
X105967714Y-90204770D01*
X105920999Y-90185128D01*
X105888692Y-90165308D01*
X105863231Y-90124160D01*
X105860616Y-90115675D01*
X105832478Y-90072451D01*
X105790067Y-90049103D01*
X105741370Y-90048100D01*
X105694373Y-90071914D01*
X105687357Y-90078056D01*
X105663893Y-90104745D01*
X105660019Y-90128014D01*
X105677768Y-90150862D01*
X105719179Y-90176287D01*
X105786286Y-90207288D01*
X105790824Y-90209252D01*
X105865322Y-90243990D01*
X105916203Y-90274763D01*
X105947525Y-90305488D01*
X105963343Y-90340082D01*
X105967714Y-90382462D01*
X105961986Y-90429446D01*
X105933062Y-90489585D01*
X105882178Y-90532788D01*
X105845374Y-90545759D01*
X105793434Y-90552856D01*
X105742999Y-90551340D01*
X105706983Y-90540632D01*
X105703158Y-90537966D01*
X105692998Y-90519337D01*
X105700048Y-90486505D01*
X105712297Y-90460735D01*
X105731939Y-90450006D01*
X105769191Y-90450539D01*
X105820908Y-90447462D01*
X105854701Y-90426212D01*
X105866114Y-90386877D01*
X105866104Y-90385747D01*
X105859187Y-90362913D01*
X105835659Y-90341963D01*
X105789914Y-90317815D01*
X105727704Y-90288741D01*
X105686499Y-90272925D01*
X105662712Y-90273944D01*
X105651597Y-90294837D01*
X105648408Y-90338641D01*
X105648400Y-90408393D01*
X105648044Y-90451452D01*
X105646413Y-90504626D01*
X105643761Y-90541022D01*
X105640422Y-90554514D01*
X105639530Y-90554423D01*
X105620237Y-90547110D01*
X105588284Y-90531678D01*
X105544124Y-90508842D01*
X105549371Y-90303078D01*
X105549736Y-90289432D01*
X105553904Y-90193651D01*
X105561268Y-90121462D01*
X105573330Y-90068058D01*
X105591593Y-90028633D01*
X105617560Y-89998380D01*
X105652733Y-89972493D01*
X105653384Y-89972087D01*
X105710256Y-89950968D01*
X105776033Y-89947400D01*
X105839483Y-89960569D01*
G37*
X108459815Y-90301524D02*
X108461252Y-90413000D01*
X108461651Y-90445339D01*
X108462929Y-90553455D01*
X108463185Y-90636186D01*
X108461634Y-90696426D01*
X108457490Y-90737073D01*
X108449964Y-90761023D01*
X108438271Y-90771171D01*
X108421624Y-90770414D01*
X108399236Y-90761648D01*
X108370321Y-90747769D01*
X108364142Y-90744808D01*
X108338413Y-90730311D01*
X108324976Y-90713065D01*
X108319834Y-90684308D01*
X108318990Y-90635283D01*
X108318952Y-90547257D01*
X108228276Y-90547257D01*
X108172498Y-90544815D01*
X108128640Y-90534908D01*
X108092218Y-90514886D01*
X108089503Y-90512929D01*
X108052546Y-90479869D01*
X108026826Y-90439931D01*
X108010606Y-90387657D01*
X108002148Y-90317588D01*
X108000083Y-90238430D01*
X108144857Y-90238430D01*
X108144882Y-90251697D01*
X108146261Y-90311584D01*
X108150687Y-90350732D01*
X108159461Y-90376153D01*
X108173886Y-90394857D01*
X108174784Y-90395750D01*
X108210237Y-90419952D01*
X108244596Y-90417567D01*
X108283403Y-90388260D01*
X108292895Y-90378244D01*
X108306876Y-90357708D01*
X108314760Y-90330997D01*
X108318245Y-90290499D01*
X108319029Y-90228603D01*
X108318350Y-90191130D01*
X108310983Y-90122980D01*
X108294168Y-90078330D01*
X108266234Y-90053926D01*
X108225509Y-90046514D01*
X108208350Y-90048094D01*
X108178660Y-90063766D01*
X108159031Y-90098691D01*
X108148188Y-90155901D01*
X108144857Y-90238430D01*
X108000083Y-90238430D01*
X107999714Y-90224267D01*
X108000253Y-90156169D01*
X108002707Y-90104587D01*
X108008158Y-90068816D01*
X108017686Y-90042015D01*
X108032371Y-90017338D01*
X108045852Y-89998480D01*
X108094799Y-89947568D01*
X108150256Y-89919918D01*
X108219928Y-89911165D01*
X108299664Y-89919890D01*
X108368595Y-89951185D01*
X108423113Y-90006381D01*
X108427223Y-90012224D01*
X108436808Y-90027753D01*
X108444151Y-90045498D01*
X108449612Y-90069290D01*
X108453550Y-90102958D01*
X108456323Y-90150333D01*
X108458292Y-90215245D01*
X108458528Y-90228603D01*
X108459815Y-90301524D01*
G36*
X108459815Y-90301524D02*
G01*
X108461252Y-90413000D01*
X108461651Y-90445339D01*
X108462929Y-90553455D01*
X108463185Y-90636186D01*
X108461634Y-90696426D01*
X108457490Y-90737073D01*
X108449964Y-90761023D01*
X108438271Y-90771171D01*
X108421624Y-90770414D01*
X108399236Y-90761648D01*
X108370321Y-90747769D01*
X108364142Y-90744808D01*
X108338413Y-90730311D01*
X108324976Y-90713065D01*
X108319834Y-90684308D01*
X108318990Y-90635283D01*
X108318952Y-90547257D01*
X108228276Y-90547257D01*
X108172498Y-90544815D01*
X108128640Y-90534908D01*
X108092218Y-90514886D01*
X108089503Y-90512929D01*
X108052546Y-90479869D01*
X108026826Y-90439931D01*
X108010606Y-90387657D01*
X108002148Y-90317588D01*
X108000083Y-90238430D01*
X108144857Y-90238430D01*
X108144882Y-90251697D01*
X108146261Y-90311584D01*
X108150687Y-90350732D01*
X108159461Y-90376153D01*
X108173886Y-90394857D01*
X108174784Y-90395750D01*
X108210237Y-90419952D01*
X108244596Y-90417567D01*
X108283403Y-90388260D01*
X108292895Y-90378244D01*
X108306876Y-90357708D01*
X108314760Y-90330997D01*
X108318245Y-90290499D01*
X108319029Y-90228603D01*
X108318350Y-90191130D01*
X108310983Y-90122980D01*
X108294168Y-90078330D01*
X108266234Y-90053926D01*
X108225509Y-90046514D01*
X108208350Y-90048094D01*
X108178660Y-90063766D01*
X108159031Y-90098691D01*
X108148188Y-90155901D01*
X108144857Y-90238430D01*
X108000083Y-90238430D01*
X107999714Y-90224267D01*
X108000253Y-90156169D01*
X108002707Y-90104587D01*
X108008158Y-90068816D01*
X108017686Y-90042015D01*
X108032371Y-90017338D01*
X108045852Y-89998480D01*
X108094799Y-89947568D01*
X108150256Y-89919918D01*
X108219928Y-89911165D01*
X108299664Y-89919890D01*
X108368595Y-89951185D01*
X108423113Y-90006381D01*
X108427223Y-90012224D01*
X108436808Y-90027753D01*
X108444151Y-90045498D01*
X108449612Y-90069290D01*
X108453550Y-90102958D01*
X108456323Y-90150333D01*
X108458292Y-90215245D01*
X108458528Y-90228603D01*
X108459815Y-90301524D01*
G37*
X103717495Y-89946220D02*
X103748599Y-89954121D01*
X103777559Y-89973817D01*
X103814831Y-90010484D01*
X103838801Y-90036378D01*
X103863770Y-90069997D01*
X103875031Y-90101506D01*
X103877657Y-90141485D01*
X103877657Y-90206917D01*
X103833035Y-90183842D01*
X103797673Y-90155724D01*
X103773451Y-90117848D01*
X103769291Y-90107551D01*
X103737594Y-90067637D01*
X103693554Y-90047624D01*
X103645531Y-90049572D01*
X103601886Y-90075543D01*
X103583420Y-90096635D01*
X103572663Y-90123619D01*
X103584178Y-90147634D01*
X103619981Y-90171791D01*
X103682090Y-90199199D01*
X103691515Y-90202985D01*
X103748058Y-90227759D01*
X103796580Y-90252189D01*
X103827451Y-90271486D01*
X103858371Y-90305953D01*
X103878927Y-90360957D01*
X103876744Y-90419983D01*
X103852424Y-90475845D01*
X103806568Y-90521355D01*
X103769438Y-90540727D01*
X103697711Y-90554292D01*
X103657852Y-90552462D01*
X103620953Y-90542568D01*
X103606797Y-90521806D01*
X103612091Y-90487613D01*
X103613631Y-90483092D01*
X103625842Y-90459116D01*
X103646174Y-90450042D01*
X103684908Y-90450649D01*
X103712257Y-90451474D01*
X103744257Y-90444392D01*
X103766182Y-90423219D01*
X103778670Y-90397152D01*
X103780062Y-90369845D01*
X103779998Y-90369685D01*
X103763807Y-90354930D01*
X103729155Y-90333457D01*
X103684321Y-90309458D01*
X103637582Y-90287125D01*
X103597217Y-90270652D01*
X103571504Y-90264229D01*
X103567679Y-90270518D01*
X103562864Y-90300115D01*
X103559566Y-90348447D01*
X103558343Y-90409372D01*
X103558058Y-90451542D01*
X103556718Y-90504653D01*
X103554528Y-90541025D01*
X103551769Y-90554514D01*
X103537344Y-90549981D01*
X103508226Y-90537670D01*
X103471257Y-90520826D01*
X103471257Y-90304721D01*
X103471493Y-90249327D01*
X103473729Y-90165207D01*
X103479423Y-90102800D01*
X103489903Y-90057358D01*
X103506497Y-90024133D01*
X103530531Y-89998378D01*
X103563333Y-89975344D01*
X103605124Y-89956335D01*
X103682287Y-89944914D01*
X103717495Y-89946220D01*
G36*
X103717495Y-89946220D02*
G01*
X103748599Y-89954121D01*
X103777559Y-89973817D01*
X103814831Y-90010484D01*
X103838801Y-90036378D01*
X103863770Y-90069997D01*
X103875031Y-90101506D01*
X103877657Y-90141485D01*
X103877657Y-90206917D01*
X103833035Y-90183842D01*
X103797673Y-90155724D01*
X103773451Y-90117848D01*
X103769291Y-90107551D01*
X103737594Y-90067637D01*
X103693554Y-90047624D01*
X103645531Y-90049572D01*
X103601886Y-90075543D01*
X103583420Y-90096635D01*
X103572663Y-90123619D01*
X103584178Y-90147634D01*
X103619981Y-90171791D01*
X103682090Y-90199199D01*
X103691515Y-90202985D01*
X103748058Y-90227759D01*
X103796580Y-90252189D01*
X103827451Y-90271486D01*
X103858371Y-90305953D01*
X103878927Y-90360957D01*
X103876744Y-90419983D01*
X103852424Y-90475845D01*
X103806568Y-90521355D01*
X103769438Y-90540727D01*
X103697711Y-90554292D01*
X103657852Y-90552462D01*
X103620953Y-90542568D01*
X103606797Y-90521806D01*
X103612091Y-90487613D01*
X103613631Y-90483092D01*
X103625842Y-90459116D01*
X103646174Y-90450042D01*
X103684908Y-90450649D01*
X103712257Y-90451474D01*
X103744257Y-90444392D01*
X103766182Y-90423219D01*
X103778670Y-90397152D01*
X103780062Y-90369845D01*
X103779998Y-90369685D01*
X103763807Y-90354930D01*
X103729155Y-90333457D01*
X103684321Y-90309458D01*
X103637582Y-90287125D01*
X103597217Y-90270652D01*
X103571504Y-90264229D01*
X103567679Y-90270518D01*
X103562864Y-90300115D01*
X103559566Y-90348447D01*
X103558343Y-90409372D01*
X103558058Y-90451542D01*
X103556718Y-90504653D01*
X103554528Y-90541025D01*
X103551769Y-90554514D01*
X103537344Y-90549981D01*
X103508226Y-90537670D01*
X103471257Y-90520826D01*
X103471257Y-90304721D01*
X103471493Y-90249327D01*
X103473729Y-90165207D01*
X103479423Y-90102800D01*
X103489903Y-90057358D01*
X103506497Y-90024133D01*
X103530531Y-89998378D01*
X103563333Y-89975344D01*
X103605124Y-89956335D01*
X103682287Y-89944914D01*
X103717495Y-89946220D01*
G37*
X105863933Y-85242371D02*
X105939856Y-85242865D01*
X105994491Y-85244135D01*
X106031500Y-85246547D01*
X106054547Y-85250467D01*
X106067296Y-85256262D01*
X106073411Y-85264299D01*
X106076556Y-85274943D01*
X106076646Y-85275325D01*
X106081814Y-85300347D01*
X106091209Y-85348681D01*
X106103867Y-85415260D01*
X106118825Y-85495014D01*
X106135119Y-85582875D01*
X106136448Y-85590064D01*
X106152691Y-85675340D01*
X106167805Y-85750242D01*
X106180808Y-85810219D01*
X106190715Y-85850717D01*
X106196544Y-85867184D01*
X106196575Y-85867210D01*
X106214943Y-85876320D01*
X106252640Y-85891457D01*
X106301543Y-85909358D01*
X106304297Y-85910330D01*
X106366817Y-85933959D01*
X106439543Y-85963595D01*
X106507294Y-85993062D01*
X106618703Y-86043626D01*
X106865399Y-85875160D01*
X106882775Y-85863311D01*
X106957202Y-85812947D01*
X107023614Y-85768612D01*
X107078039Y-85732916D01*
X107116506Y-85708471D01*
X107135042Y-85697889D01*
X107147743Y-85700315D01*
X107176579Y-85719110D01*
X107221143Y-85756330D01*
X107282670Y-85813020D01*
X107362398Y-85890227D01*
X107369532Y-85897255D01*
X107432796Y-85960222D01*
X107488990Y-86017268D01*
X107534677Y-86064817D01*
X107566414Y-86099297D01*
X107580764Y-86117131D01*
X107580810Y-86117217D01*
X107582633Y-86130795D01*
X107575910Y-86152820D01*
X107558946Y-86186304D01*
X107530044Y-86234261D01*
X107487508Y-86299704D01*
X107429644Y-86385645D01*
X107419783Y-86400151D01*
X107369913Y-86473635D01*
X107325905Y-86538687D01*
X107290380Y-86591417D01*
X107265959Y-86627936D01*
X107255264Y-86644356D01*
X107254458Y-86647834D01*
X107259518Y-86673785D01*
X107274677Y-86716159D01*
X107297463Y-86767728D01*
X107328429Y-86835170D01*
X107363004Y-86915195D01*
X107392366Y-86987629D01*
X107399645Y-87006377D01*
X107418710Y-87054246D01*
X107432715Y-87087596D01*
X107439041Y-87100114D01*
X107446025Y-87101050D01*
X107477413Y-87106461D01*
X107528787Y-87115806D01*
X107594802Y-87128069D01*
X107670113Y-87142232D01*
X107749375Y-87157280D01*
X107827243Y-87172195D01*
X107898370Y-87185961D01*
X107957412Y-87197562D01*
X107999022Y-87205980D01*
X108017857Y-87210199D01*
X108020980Y-87211389D01*
X108028591Y-87217805D01*
X108034254Y-87231465D01*
X108038251Y-87255999D01*
X108040866Y-87295038D01*
X108042384Y-87352213D01*
X108043086Y-87431154D01*
X108043257Y-87535492D01*
X108043257Y-87852799D01*
X107967057Y-87867839D01*
X107957840Y-87869642D01*
X107908891Y-87878980D01*
X107841205Y-87891669D01*
X107762478Y-87906273D01*
X107680400Y-87921355D01*
X107648078Y-87927422D01*
X107575855Y-87942181D01*
X107515666Y-87956137D01*
X107473040Y-87967952D01*
X107453510Y-87976287D01*
X107444660Y-87989905D01*
X107428548Y-88025938D01*
X107412065Y-88072572D01*
X107406263Y-88090034D01*
X107384906Y-88147358D01*
X107357359Y-88215201D01*
X107328107Y-88282355D01*
X107312463Y-88317430D01*
X107290174Y-88369822D01*
X107274857Y-88409058D01*
X107269162Y-88428563D01*
X107269478Y-88430036D01*
X107280281Y-88450729D01*
X107304638Y-88490665D01*
X107340081Y-88545972D01*
X107384136Y-88612781D01*
X107434332Y-88687220D01*
X107599501Y-88929623D01*
X107382503Y-89146983D01*
X107361516Y-89167899D01*
X107297342Y-89230505D01*
X107239990Y-89284495D01*
X107192820Y-89326826D01*
X107159192Y-89354457D01*
X107142467Y-89364343D01*
X107124303Y-89356821D01*
X107086265Y-89335227D01*
X107032726Y-89302151D01*
X106967884Y-89260191D01*
X106895940Y-89211943D01*
X106825275Y-89164291D01*
X106761526Y-89122328D01*
X106709513Y-89089165D01*
X106673279Y-89067378D01*
X106656867Y-89059543D01*
X106655905Y-89059614D01*
X106634103Y-89067338D01*
X106595440Y-89085323D01*
X106547612Y-89110013D01*
X106547110Y-89110284D01*
X106483587Y-89142099D01*
X106440060Y-89157642D01*
X106413052Y-89157685D01*
X106399090Y-89143000D01*
X106393180Y-89128544D01*
X106377229Y-89089831D01*
X106352660Y-89030316D01*
X106320779Y-88953165D01*
X106282893Y-88861541D01*
X106240310Y-88758607D01*
X106194337Y-88647526D01*
X106152667Y-88546472D01*
X106110268Y-88442780D01*
X106072756Y-88350119D01*
X106041388Y-88271642D01*
X106017425Y-88210500D01*
X106002123Y-88169843D01*
X105996743Y-88152825D01*
X106007018Y-88137219D01*
X106035563Y-88111162D01*
X106075971Y-88080887D01*
X106172979Y-88001684D01*
X106259793Y-87900475D01*
X106323322Y-87789116D01*
X106363177Y-87670893D01*
X106378965Y-87549095D01*
X106370296Y-87427010D01*
X106336778Y-87307925D01*
X106278021Y-87195129D01*
X106193632Y-87091911D01*
X106149631Y-87051713D01*
X106044211Y-86980638D01*
X105931410Y-86934301D01*
X105814525Y-86911599D01*
X105696853Y-86911428D01*
X105581690Y-86932687D01*
X105472335Y-86974270D01*
X105372083Y-87035076D01*
X105284233Y-87114001D01*
X105212080Y-87209941D01*
X105158922Y-87321795D01*
X105128057Y-87448457D01*
X105122392Y-87509507D01*
X105130185Y-87641776D01*
X105165284Y-87767266D01*
X105226649Y-87883759D01*
X105313243Y-87989039D01*
X105424029Y-88080887D01*
X105462931Y-88109930D01*
X105492104Y-88136272D01*
X105503257Y-88152800D01*
X105498810Y-88167209D01*
X105484378Y-88205815D01*
X105461173Y-88265201D01*
X105430452Y-88342215D01*
X105393474Y-88433703D01*
X105351496Y-88536516D01*
X105305778Y-88647502D01*
X105264178Y-88748072D01*
X105221222Y-88851947D01*
X105182829Y-88944819D01*
X105150305Y-89023525D01*
X105124958Y-89084899D01*
X105108095Y-89125779D01*
X105101025Y-89143000D01*
X105100943Y-89143204D01*
X105086798Y-89157745D01*
X105059659Y-89157579D01*
X105016023Y-89141927D01*
X104952388Y-89110013D01*
X104947379Y-89107326D01*
X104900125Y-89083150D01*
X104862811Y-89066037D01*
X104843133Y-89059543D01*
X104827005Y-89067218D01*
X104790959Y-89088871D01*
X104739092Y-89121928D01*
X104675445Y-89163810D01*
X104604060Y-89211943D01*
X104533724Y-89259131D01*
X104468670Y-89301267D01*
X104414820Y-89334578D01*
X104376374Y-89356469D01*
X104357534Y-89364343D01*
X104354325Y-89363343D01*
X104331954Y-89347584D01*
X104293733Y-89315033D01*
X104243021Y-89268733D01*
X104183181Y-89211726D01*
X104117571Y-89147058D01*
X103900648Y-88929772D01*
X104069601Y-88681253D01*
X104238553Y-88432733D01*
X104187183Y-88321595D01*
X104187031Y-88321266D01*
X104156183Y-88250418D01*
X104124661Y-88171523D01*
X104099266Y-88101600D01*
X104095423Y-88090322D01*
X104076047Y-88037967D01*
X104058574Y-87997283D01*
X104046388Y-87976287D01*
X104041426Y-87973322D01*
X104011634Y-87963375D01*
X103961047Y-87950505D01*
X103895194Y-87936053D01*
X103819600Y-87921355D01*
X103796957Y-87917210D01*
X103715038Y-87902116D01*
X103638600Y-87887899D01*
X103575337Y-87875995D01*
X103532943Y-87867839D01*
X103456743Y-87852799D01*
X103456743Y-87535492D01*
X103456760Y-87496476D01*
X103457082Y-87401292D01*
X103458033Y-87330255D01*
X103459896Y-87279734D01*
X103462955Y-87246098D01*
X103467494Y-87225718D01*
X103473795Y-87214962D01*
X103482143Y-87210199D01*
X103490224Y-87208270D01*
X103523172Y-87201445D01*
X103575736Y-87191022D01*
X103642569Y-87178018D01*
X103718328Y-87163449D01*
X103797665Y-87148333D01*
X103875237Y-87133685D01*
X103945698Y-87120523D01*
X104003702Y-87109863D01*
X104043904Y-87102721D01*
X104060959Y-87100114D01*
X104062112Y-87098541D01*
X104071385Y-87078119D01*
X104087432Y-87039045D01*
X104107635Y-86987629D01*
X104135672Y-86918353D01*
X104170186Y-86838290D01*
X104202538Y-86767728D01*
X104209952Y-86751889D01*
X104230755Y-86702293D01*
X104243219Y-86664038D01*
X104244863Y-86644356D01*
X104244015Y-86642962D01*
X104230548Y-86622420D01*
X104203850Y-86582516D01*
X104166539Y-86527140D01*
X104121234Y-86460177D01*
X104070552Y-86385517D01*
X104013445Y-86300692D01*
X103970607Y-86234800D01*
X103941460Y-86186478D01*
X103924317Y-86152733D01*
X103917495Y-86130572D01*
X103919306Y-86117002D01*
X103919915Y-86115984D01*
X103936297Y-86096210D01*
X103969695Y-86060175D01*
X104016671Y-86011451D01*
X104073786Y-85953612D01*
X104137603Y-85890227D01*
X104203802Y-85825905D01*
X104268648Y-85765447D01*
X104316299Y-85724655D01*
X104347990Y-85702484D01*
X104364958Y-85697889D01*
X104367175Y-85698921D01*
X104390524Y-85712837D01*
X104432912Y-85740030D01*
X104490369Y-85777889D01*
X104558923Y-85823803D01*
X104634601Y-85875160D01*
X104881298Y-86043626D01*
X104992706Y-85993062D01*
X104995943Y-85991597D01*
X105064343Y-85961965D01*
X105136907Y-85932493D01*
X105198457Y-85909358D01*
X105198729Y-85909262D01*
X105247595Y-85891367D01*
X105285212Y-85876253D01*
X105303457Y-85867184D01*
X105303752Y-85866855D01*
X105309946Y-85848282D01*
X105320139Y-85806045D01*
X105333348Y-85744696D01*
X105348590Y-85668789D01*
X105364881Y-85582875D01*
X105365449Y-85579796D01*
X105381713Y-85492128D01*
X105396608Y-85412741D01*
X105409171Y-85346701D01*
X105418438Y-85299079D01*
X105423444Y-85274943D01*
X105423764Y-85273605D01*
X105427060Y-85263273D01*
X105433738Y-85255506D01*
X105447462Y-85249940D01*
X105471895Y-85246207D01*
X105510702Y-85243942D01*
X105567546Y-85242778D01*
X105646090Y-85242348D01*
X105750000Y-85242286D01*
X105763056Y-85242286D01*
X105863933Y-85242371D01*
G36*
X105863933Y-85242371D02*
G01*
X105939856Y-85242865D01*
X105994491Y-85244135D01*
X106031500Y-85246547D01*
X106054547Y-85250467D01*
X106067296Y-85256262D01*
X106073411Y-85264299D01*
X106076556Y-85274943D01*
X106076646Y-85275325D01*
X106081814Y-85300347D01*
X106091209Y-85348681D01*
X106103867Y-85415260D01*
X106118825Y-85495014D01*
X106135119Y-85582875D01*
X106136448Y-85590064D01*
X106152691Y-85675340D01*
X106167805Y-85750242D01*
X106180808Y-85810219D01*
X106190715Y-85850717D01*
X106196544Y-85867184D01*
X106196575Y-85867210D01*
X106214943Y-85876320D01*
X106252640Y-85891457D01*
X106301543Y-85909358D01*
X106304297Y-85910330D01*
X106366817Y-85933959D01*
X106439543Y-85963595D01*
X106507294Y-85993062D01*
X106618703Y-86043626D01*
X106865399Y-85875160D01*
X106882775Y-85863311D01*
X106957202Y-85812947D01*
X107023614Y-85768612D01*
X107078039Y-85732916D01*
X107116506Y-85708471D01*
X107135042Y-85697889D01*
X107147743Y-85700315D01*
X107176579Y-85719110D01*
X107221143Y-85756330D01*
X107282670Y-85813020D01*
X107362398Y-85890227D01*
X107369532Y-85897255D01*
X107432796Y-85960222D01*
X107488990Y-86017268D01*
X107534677Y-86064817D01*
X107566414Y-86099297D01*
X107580764Y-86117131D01*
X107580810Y-86117217D01*
X107582633Y-86130795D01*
X107575910Y-86152820D01*
X107558946Y-86186304D01*
X107530044Y-86234261D01*
X107487508Y-86299704D01*
X107429644Y-86385645D01*
X107419783Y-86400151D01*
X107369913Y-86473635D01*
X107325905Y-86538687D01*
X107290380Y-86591417D01*
X107265959Y-86627936D01*
X107255264Y-86644356D01*
X107254458Y-86647834D01*
X107259518Y-86673785D01*
X107274677Y-86716159D01*
X107297463Y-86767728D01*
X107328429Y-86835170D01*
X107363004Y-86915195D01*
X107392366Y-86987629D01*
X107399645Y-87006377D01*
X107418710Y-87054246D01*
X107432715Y-87087596D01*
X107439041Y-87100114D01*
X107446025Y-87101050D01*
X107477413Y-87106461D01*
X107528787Y-87115806D01*
X107594802Y-87128069D01*
X107670113Y-87142232D01*
X107749375Y-87157280D01*
X107827243Y-87172195D01*
X107898370Y-87185961D01*
X107957412Y-87197562D01*
X107999022Y-87205980D01*
X108017857Y-87210199D01*
X108020980Y-87211389D01*
X108028591Y-87217805D01*
X108034254Y-87231465D01*
X108038251Y-87255999D01*
X108040866Y-87295038D01*
X108042384Y-87352213D01*
X108043086Y-87431154D01*
X108043257Y-87535492D01*
X108043257Y-87852799D01*
X107967057Y-87867839D01*
X107957840Y-87869642D01*
X107908891Y-87878980D01*
X107841205Y-87891669D01*
X107762478Y-87906273D01*
X107680400Y-87921355D01*
X107648078Y-87927422D01*
X107575855Y-87942181D01*
X107515666Y-87956137D01*
X107473040Y-87967952D01*
X107453510Y-87976287D01*
X107444660Y-87989905D01*
X107428548Y-88025938D01*
X107412065Y-88072572D01*
X107406263Y-88090034D01*
X107384906Y-88147358D01*
X107357359Y-88215201D01*
X107328107Y-88282355D01*
X107312463Y-88317430D01*
X107290174Y-88369822D01*
X107274857Y-88409058D01*
X107269162Y-88428563D01*
X107269478Y-88430036D01*
X107280281Y-88450729D01*
X107304638Y-88490665D01*
X107340081Y-88545972D01*
X107384136Y-88612781D01*
X107434332Y-88687220D01*
X107599501Y-88929623D01*
X107382503Y-89146983D01*
X107361516Y-89167899D01*
X107297342Y-89230505D01*
X107239990Y-89284495D01*
X107192820Y-89326826D01*
X107159192Y-89354457D01*
X107142467Y-89364343D01*
X107124303Y-89356821D01*
X107086265Y-89335227D01*
X107032726Y-89302151D01*
X106967884Y-89260191D01*
X106895940Y-89211943D01*
X106825275Y-89164291D01*
X106761526Y-89122328D01*
X106709513Y-89089165D01*
X106673279Y-89067378D01*
X106656867Y-89059543D01*
X106655905Y-89059614D01*
X106634103Y-89067338D01*
X106595440Y-89085323D01*
X106547612Y-89110013D01*
X106547110Y-89110284D01*
X106483587Y-89142099D01*
X106440060Y-89157642D01*
X106413052Y-89157685D01*
X106399090Y-89143000D01*
X106393180Y-89128544D01*
X106377229Y-89089831D01*
X106352660Y-89030316D01*
X106320779Y-88953165D01*
X106282893Y-88861541D01*
X106240310Y-88758607D01*
X106194337Y-88647526D01*
X106152667Y-88546472D01*
X106110268Y-88442780D01*
X106072756Y-88350119D01*
X106041388Y-88271642D01*
X106017425Y-88210500D01*
X106002123Y-88169843D01*
X105996743Y-88152825D01*
X106007018Y-88137219D01*
X106035563Y-88111162D01*
X106075971Y-88080887D01*
X106172979Y-88001684D01*
X106259793Y-87900475D01*
X106323322Y-87789116D01*
X106363177Y-87670893D01*
X106378965Y-87549095D01*
X106370296Y-87427010D01*
X106336778Y-87307925D01*
X106278021Y-87195129D01*
X106193632Y-87091911D01*
X106149631Y-87051713D01*
X106044211Y-86980638D01*
X105931410Y-86934301D01*
X105814525Y-86911599D01*
X105696853Y-86911428D01*
X105581690Y-86932687D01*
X105472335Y-86974270D01*
X105372083Y-87035076D01*
X105284233Y-87114001D01*
X105212080Y-87209941D01*
X105158922Y-87321795D01*
X105128057Y-87448457D01*
X105122392Y-87509507D01*
X105130185Y-87641776D01*
X105165284Y-87767266D01*
X105226649Y-87883759D01*
X105313243Y-87989039D01*
X105424029Y-88080887D01*
X105462931Y-88109930D01*
X105492104Y-88136272D01*
X105503257Y-88152800D01*
X105498810Y-88167209D01*
X105484378Y-88205815D01*
X105461173Y-88265201D01*
X105430452Y-88342215D01*
X105393474Y-88433703D01*
X105351496Y-88536516D01*
X105305778Y-88647502D01*
X105264178Y-88748072D01*
X105221222Y-88851947D01*
X105182829Y-88944819D01*
X105150305Y-89023525D01*
X105124958Y-89084899D01*
X105108095Y-89125779D01*
X105101025Y-89143000D01*
X105100943Y-89143204D01*
X105086798Y-89157745D01*
X105059659Y-89157579D01*
X105016023Y-89141927D01*
X104952388Y-89110013D01*
X104947379Y-89107326D01*
X104900125Y-89083150D01*
X104862811Y-89066037D01*
X104843133Y-89059543D01*
X104827005Y-89067218D01*
X104790959Y-89088871D01*
X104739092Y-89121928D01*
X104675445Y-89163810D01*
X104604060Y-89211943D01*
X104533724Y-89259131D01*
X104468670Y-89301267D01*
X104414820Y-89334578D01*
X104376374Y-89356469D01*
X104357534Y-89364343D01*
X104354325Y-89363343D01*
X104331954Y-89347584D01*
X104293733Y-89315033D01*
X104243021Y-89268733D01*
X104183181Y-89211726D01*
X104117571Y-89147058D01*
X103900648Y-88929772D01*
X104069601Y-88681253D01*
X104238553Y-88432733D01*
X104187183Y-88321595D01*
X104187031Y-88321266D01*
X104156183Y-88250418D01*
X104124661Y-88171523D01*
X104099266Y-88101600D01*
X104095423Y-88090322D01*
X104076047Y-88037967D01*
X104058574Y-87997283D01*
X104046388Y-87976287D01*
X104041426Y-87973322D01*
X104011634Y-87963375D01*
X103961047Y-87950505D01*
X103895194Y-87936053D01*
X103819600Y-87921355D01*
X103796957Y-87917210D01*
X103715038Y-87902116D01*
X103638600Y-87887899D01*
X103575337Y-87875995D01*
X103532943Y-87867839D01*
X103456743Y-87852799D01*
X103456743Y-87535492D01*
X103456760Y-87496476D01*
X103457082Y-87401292D01*
X103458033Y-87330255D01*
X103459896Y-87279734D01*
X103462955Y-87246098D01*
X103467494Y-87225718D01*
X103473795Y-87214962D01*
X103482143Y-87210199D01*
X103490224Y-87208270D01*
X103523172Y-87201445D01*
X103575736Y-87191022D01*
X103642569Y-87178018D01*
X103718328Y-87163449D01*
X103797665Y-87148333D01*
X103875237Y-87133685D01*
X103945698Y-87120523D01*
X104003702Y-87109863D01*
X104043904Y-87102721D01*
X104060959Y-87100114D01*
X104062112Y-87098541D01*
X104071385Y-87078119D01*
X104087432Y-87039045D01*
X104107635Y-86987629D01*
X104135672Y-86918353D01*
X104170186Y-86838290D01*
X104202538Y-86767728D01*
X104209952Y-86751889D01*
X104230755Y-86702293D01*
X104243219Y-86664038D01*
X104244863Y-86644356D01*
X104244015Y-86642962D01*
X104230548Y-86622420D01*
X104203850Y-86582516D01*
X104166539Y-86527140D01*
X104121234Y-86460177D01*
X104070552Y-86385517D01*
X104013445Y-86300692D01*
X103970607Y-86234800D01*
X103941460Y-86186478D01*
X103924317Y-86152733D01*
X103917495Y-86130572D01*
X103919306Y-86117002D01*
X103919915Y-86115984D01*
X103936297Y-86096210D01*
X103969695Y-86060175D01*
X104016671Y-86011451D01*
X104073786Y-85953612D01*
X104137603Y-85890227D01*
X104203802Y-85825905D01*
X104268648Y-85765447D01*
X104316299Y-85724655D01*
X104347990Y-85702484D01*
X104364958Y-85697889D01*
X104367175Y-85698921D01*
X104390524Y-85712837D01*
X104432912Y-85740030D01*
X104490369Y-85777889D01*
X104558923Y-85823803D01*
X104634601Y-85875160D01*
X104881298Y-86043626D01*
X104992706Y-85993062D01*
X104995943Y-85991597D01*
X105064343Y-85961965D01*
X105136907Y-85932493D01*
X105198457Y-85909358D01*
X105198729Y-85909262D01*
X105247595Y-85891367D01*
X105285212Y-85876253D01*
X105303457Y-85867184D01*
X105303752Y-85866855D01*
X105309946Y-85848282D01*
X105320139Y-85806045D01*
X105333348Y-85744696D01*
X105348590Y-85668789D01*
X105364881Y-85582875D01*
X105365449Y-85579796D01*
X105381713Y-85492128D01*
X105396608Y-85412741D01*
X105409171Y-85346701D01*
X105418438Y-85299079D01*
X105423444Y-85274943D01*
X105423764Y-85273605D01*
X105427060Y-85263273D01*
X105433738Y-85255506D01*
X105447462Y-85249940D01*
X105471895Y-85246207D01*
X105510702Y-85243942D01*
X105567546Y-85242778D01*
X105646090Y-85242348D01*
X105750000Y-85242286D01*
X105763056Y-85242286D01*
X105863933Y-85242371D01*
G37*
D16*
%TO.C,J3*%
X91500000Y-97150000D02*
X74500000Y-97150000D01*
X91500000Y-95000000D02*
X91500000Y-97150000D01*
X74500000Y-97150000D02*
X74500000Y-95000000D01*
X78600000Y-89150000D02*
G75*
G03*
X78600000Y-89150000I-100000J0D01*
G01*
%TD*%
M02*
