(module 503398-1892_MOL (layer F.Cu)
  (fp_text reference REF** (at 0 -5.7755) (layer F.SilkS)
    (effects (font (size 1 1) (thickness .15)))
  )
  (fp_text value 503398-1892_MOL (at 0 -5.7755) (layer F.SilkS)
    (effects (font (size 1 1) (thickness .15)))
  )
  (fp_text user "Copyright 2016 Accelerated Designs. All rights reserved." (at 0 0) (layer Cmts.User)
    (effects (font (size .127 .127) (thickness .002)))
  )
  (fp_text user "*" (at -4.92 -5.7755) (layer F.SilkS)
    (effects (font (size 1 1) (thickness .15)))
  )
  (fp_text user "*" (at -4.92 -5.7755) (layer F.Fab)
    (effects (font (size 1 1) (thickness .15)))
  )
  (fp_text user "*" (at -4.92 -5.7755) (layer F.SilkS)
    (effects (font (size 1 1) (thickness .15)))
  )
  (fp_text user "*" (at -4.92 -5.7755) (layer F.Fab)
    (effects (font (size 1 1) (thickness .15)))
  )
  (fp_line (start -5.827036 7.3025) (end -4.914896 7.3025) (layer F.SilkS) (width .1524))
  (fp_line (start 6.676999 3.493059) (end 6.676999 -3.54576) (layer F.SilkS) (width .1524))
  (fp_line (start 6.676999 -7.3025) (end -6.676999 -7.3025) (layer F.SilkS) (width .1524))
  (fp_line (start -6.676999 -7.3025) (end -6.676999 -7.00764) (layer F.SilkS) (width .1524))
  (fp_line (start -6.549999 7.1755) (end 6.549999 7.1755) (layer F.Fab) (width .1524))
  (fp_line (start 6.549999 7.1755) (end 6.549999 -7.1755) (layer F.Fab) (width .1524))
  (fp_line (start 6.549999 -7.1755) (end -6.549999 -7.1755) (layer F.Fab) (width .1524))
  (fp_line (start -6.549999 -7.1755) (end -6.549999 7.1755) (layer F.Fab) (width .1524))
  (fp_line (start -.127 -7.0485) (end .127 -7.0485) (layer F.SilkS) (width .1524))
  (fp_line (start .127 -7.0485) (end .127 -7.3025) (layer F.SilkS) (width .1524))
  (fp_line (start .127 -7.3025) (end -.127 -7.3025) (layer F.SilkS) (width .1524))
  (fp_line (start -.127 -7.3025) (end -.127 -7.0485) (layer F.SilkS) (width .1524))
  (fp_line (start 0 -7.1755) (end 0 -7.1755) (layer F.Fab) (width .1524))
  (fp_line (start 0 -7.1755) (end 0 -7.1755) (layer F.Fab) (width .1524))
  (fp_line (start 0 -7.1755) (end 0 -7.1755) (layer F.Fab) (width .1524))
  (fp_line (start 0 -7.1755) (end 0 -7.1755) (layer F.Fab) (width .1524))
  (fp_line (start -3.425103 7.3025) (end -.510523 7.3025) (layer F.SilkS) (width .1524))
  (fp_line (start 1.130522 7.3025) (end 5.827036 7.3025) (layer F.SilkS) (width .1524))
  (fp_line (start -6.676999 -4.51336) (end -6.676999 3.493059) (layer F.SilkS) (width .1524))
  (fp_line (start 6.676999 -7.00524) (end 6.676999 -7.3025) (layer F.SilkS) (width .1524))
  (fp_line (start 6.803999 -7.4295) (end -6.803999 -7.4295) (layer F.CrtYd) (width .1524))
  (fp_line (start -6.803999 -7.4295) (end -6.803999 7.4295) (layer F.CrtYd) (width .1524))
  (fp_line (start -6.803999 7.4295) (end 6.803999 7.4295) (layer F.CrtYd) (width .1524))
  (fp_line (start 6.803999 7.4295) (end 6.803999 -7.4295) (layer F.CrtYd) (width .1524))
  (pad 1 smd rect (at -2.38 -5.7755) (size .7112 1.0922) (layers F.Cu F.Paste F.Mask))
  (pad 2 smd rect (at -1.28 -5.7755) (size .7112 1.0922) (layers F.Cu F.Paste F.Mask))
  (pad 3 smd rect (at -.18 -5.7755) (size .7112 1.0922) (layers F.Cu F.Paste F.Mask))
  (pad 4 smd rect (at .920001 -5.7755) (size .7112 1.0922) (layers F.Cu F.Paste F.Mask))
  (pad 5 smd rect (at 2.020001 -5.7755) (size .7112 1.0922) (layers F.Cu F.Paste F.Mask))
  (pad 6 smd rect (at 3.120001 -5.7755) (size .7112 1.0922) (layers F.Cu F.Paste F.Mask))
  (pad 7 smd rect (at 4.220002 -5.7755) (size .7112 1.0922) (layers F.Cu F.Paste F.Mask))
  (pad 8 smd rect (at 5.32 -5.7755) (size .7112 1.0922) (layers F.Cu F.Paste F.Mask))
  (pad 9 smd rect (at -4.169999 6.689499) (size .889 .9398) (layers F.Cu F.Paste F.Mask))
  (pad 10 smd rect (at .309999 6.7645) (size 1.0414 .7874) (layers F.Cu F.Paste F.Mask))
  (pad 11 smd rect (at -6.26 -5.7605) (size 1.143 1.8288) (layers F.Cu F.Paste F.Mask))
  (pad 12 smd rect (at 6.4 -5.2755) (size .8636 2.794) (layers F.Cu F.Paste F.Mask))
  (pad 13 smd rect (at -6.48 5.489499) (size .7112 3.3274) (layers F.Cu F.Paste F.Mask))
  (pad 14 smd rect (at 6.48 5.489499) (size .7112 3.3274) (layers F.Cu F.Paste F.Mask))
)
