{
  "GroupId": "%SECURITY_GROUP_ID%",
  "IpPermissions": [
    {
      "IpProtocol": "-1",
      "IpRanges": [
        {
          "CidrIp": "0.0.0.0/0"
        }
      ],
      "Ipv6Ranges": [
        {
          "CidrIpv6": "::/0"
        }
      ]
    }
  ]
}
