{
  "Port": 5439,
  "Encrypted": false,
  "NodeType": "dc2.large",
  "ClusterIdentifier": "falcon",
  "MasterUsername": "%USER%",
  "MasterUserPassword": "%PASSWORD%",
  "PubliclyAccessible": false,
  "DBName": "%DATABASE%",
  "ClusterType": "single-node",
  "IamRoles": [ "%IAM_ROLE_ARN%" ],
  "VpcSecurityGroupIds": [ "%SECURITY_GROUP_ID%" ]
}
