newsletter-form-main-title	Newsletter Abonnieren
newsletter-form-lead	Abonnieren Sie unseren Newsletter mit interessanten News und Tipps zu aktuellen Themen. Sie können diesen Newsletter jederzeit wieder abbestellen.
newsletter-form-title	Persönliche Daten
newsletter-form-mandatory-notice	Diese Felder müssen ausgefüllt werden.
newsletter-form-abo	Abonnement
newsletter-form-abo-yes	Ich möchte den Newsletter abonnieren.
newsletter-form-abo-no	Ich möchte den Newsletter abbestellen.
newsletter-form-email	E-Mail
newsletter-form-language	Sprache
newsletter-form-salutation	Anrede
newsletter-form-title	Titel
newsletter-form-prename	Vorname
newsletter-form-surname	Name
newsletter-form-privacypolicy-1	Ich stimme den 
newsletter-form-privacypolicy-2	Datenschutzbestimmungen 
newsletter-form-privacypolicy-3	zu.
newsletter-form-captcha-notice	Bitte das Captcha ausfüllen.
newsletter-form-send-button	Senden

newsletter-confirmation-title	Newsletter Bestätigung
newsletter-confirmation-new	Danke für die Registrierung. Wir haben Ihnen eine E-Mail an folgende Adresse geschickt [EMail]. Um Ihre Registrierung zu bestätigen, klicken Sie bitte auf den Link in der E-Mail.
newsletter-confirmation-confirm	Danke, dass Sie unseren Newsletter abonniert haben.
newsletter-confirmation-updated-yes	Ihre persönlichen Daten wurden geändert. Sie erhalten weiterhin Newsletter von uns. Danke.
newsletter-confirmation-updated-canceled	Ihre persönlichen Daten wurden geändert. Sie erhalten in Zukunft keine Newsletter mehr von uns.
newsletter-confirmation-unsubscribed	Sie erhalten zukünftig keine Newsletter mehr von uns. Danke.
newsletter-confirmation-notfound	Ihre Daten konnten nicht gefunden werden. Stellen Sie sicher, dass Ihre URL vollständig ist.

newsletter-mail-subject	Bestätigen Sie Ihr Rey Royal-Newsletter-Abonnement
newsletter-mail-salutation-indeterminate	Sehr geehrter Kunde und Geschäftspartner, sehr geehrte Damen und Herren
newsletter-mail-confirmation-text	Sie haben sich für den Rex Royal Newsletter angemeldet. Wir bitten Sie, Ihre Anmeldung über den folgenden Link zu bestätigen. Wenn Sie nicht abonniert haben, ignorieren Sie bitte diese E-Mail.

newsletter-please-select	Bitte auswählen

change-registration	Registration anpassen
view-online	Onlineansicht
unsubscribe	Von diesem Newsletter abmelden

If you encounter problems viewing this newsletter please try to	Falls Sie Probleme mit der Darstellung haben, probieren Sie die 