[gd_scene load_steps=2 format=2]

[ext_resource path="res://zones/zone.gd" type="Script" id=1]

[node name="Zone" type="Area2D"]
script = ExtResource( 1 )

[node name="CollisionShape2D" type="CollisionShape2D" parent="."]
