[gd_scene load_steps=4 format=2]

[ext_resource path="res://gui/log_monitor/log_monitor_line.gd" type="Script" id=1]
[ext_resource path="res://assets/fonts/consolas/consolas_bold.ttf" type="DynamicFontData" id=2]

[sub_resource type="DynamicFont" id=1]
size = 24
use_mipmaps = true
use_filter = true
font_data = ExtResource( 2 )

[node name="LogMonitorLine" type="Label"]
anchor_right = 1.0
anchor_bottom = 1.0
custom_fonts/font = SubResource( 1 )
autowrap = true
script = ExtResource( 1 )
__meta__ = {
"_edit_use_anchors_": false
}
