[gd_scene load_steps=2 format=2]

[ext_resource path="res://classes/drawing/arc_2d.gd" type="Script" id=1]

[node name="Arc2D" type="Node2D"]
script = ExtResource( 1 )
color = Color( 0.552941, 0.0980392, 0.0980392, 1 )
thickness = 8.0

[node name="Camera2D" type="Camera2D" parent="."]
current = true
